{"text_format":"1","workbook":"xlsx","n_sheets":5,"sheets":["Tablas","Vencimiento días","Riesgo de liberación","Control de avances","Proyectos en Ejecución SGR "],"not_rendered":{"charts":4,"images":1,"macros":1,"external_links":1,"defined_names":4,"comments":1,"pivot_tables":4},"unopened":[],"bounds":{"document_bytes":16777216,"sheet_cells":100000,"rows_first":2000,"rows_last":500,"rows_between":2000,"halvings":0,"cell_chars":16384,"cell_head_chars":4096},"cells_cut":0,"cells_raw":0,"read":"whole","date_system":"1900"}

{"sheet":"Tablas","index":0,"n_rows":20,"n_cols":21,"rows_kept":20,"cut":false,"hidden":false,"merged":[]}
["EJECUTOR (Dpto / Entidad)","CUNDINAMARCA",null,null,null,"EJECUTOR (Dpto / Entidad)","CUNDINAMARCA",null,null,null,null,"EJECUTOR (Dpto / Entidad)","CUNDINAMARCA",null,null,null,null,"EJECUTOR (Dpto / Entidad)","CUNDINAMARCA"]
[null,null,null,null,null,"ESTADO","(Varios elementos)",null,null,null,null,"ESTADO","(Varios elementos)",null,null,null,null,"ESTADO","(Varios elementos)"]
["Etiquetas de fila","Cuenta de ESTADO"]
["CONTRATADO EN EJECUCIÓN",33,null,null,null,"Etiquetas de fila","Cuenta de SECTOR","Suma de VALOR PROYECTO","Suma de VALOR SGR",null,null,"Etiquetas de fila","Cuenta de EJECUTOR INTERNO","Suma de VALOR PROYECTO","Suma de VALOR SGR",null,null,"Etiquetas de fila","Promedio de \tAVANCE FÍSICO","Promedio de \tAVANCE FINANCIERO","Cuenta de EJECUTOR INTERNO"]
["CONTRATADO SIN ACTA DE INICIO",2,null,null,null,"CTEL",27,191779638692,155723036786,null,null,"ENTIDAD DESIGNADA PARA LA SUPERVISIÓN DEL PROYECTO O PARA CONTRATAR LA INTERVENTORÍA RAPE - INTERVENTORIA SECRETARIA DE PLANEACIÓN",1,32499987282,32499987282,null,null,"SECRETARIA DE CIENCIA, TECNOLOGIA E INNOVACIÓN",0.58346666666666669,0.70026045454545449,27]
["EN PROCESO DE CONTRATACIÓN",5,null,null,null,"EDUCACIÓN",5,71585959488,114551996798,null,null,"ENTIDAD DESIGNADA PARA LA SUPERVISIÓN DEL PROYECTO O PARA CONTRATAR LA INTERVENTORÍA-EMPRESAS PUBLICAS DE CUNDINAMARCA -EPC",1,4999900475,4999900475,null,null,"SECRETARIA DE MINAS, ENERGIA Y GAS",0.57694999999999996,0.76786666666666659,5]
["PARA CIERRE",7,null,null,null,"AGRICULTURA ",8,59725542590.559998,48132930832.559998,null,null,"SECRETARIA DE GOBIERNO",1,9260000000,8500000000,null,null,"SECRETARIA DE EDUCACIÓN",0.8963000000000001,0.70042000000000004,5]
["TERMINADO",8,null,null,null,"SALUD Y PROTECCIÓN SOCIAL",1,43433295564,43433295564,null,null,"ICCU - GESPROY GB",1,9976205175,9976205175,null,null,"SECRETARIA DE HABITAT Y VIVIENDA",0.74997500000000006,0.69922499999999999,4]
["NO HA MIGRADO A GESPROY",1,null,null,null,"AMBIENTE Y DESARROLLO SOSTENIBLE",3,38972862080,38442719610,null,null,"SECRETARIA DE PLANEACIÓN",1,6791102422,6725380622,null,null,"SECRETARIA DE COMPETITIVIDAD",0.25,0.4718,4]
["SIN CONTRATAR",1,null,null,null,"MINAS Y ENERGÍA",4,28895282235,16825879226,null,null,"SECRETARIA GENERAL",1,1000000000,1000000000,null,null,"UNIDAD ADMINISTRATIVA DE GESTIÓN DEL RIESGO.",0.60119999999999996,0.17169999999999999,2]
{"$rows_left_out":11}
{"sheet":"Vencimiento días","index":1,"n_rows":129,"n_cols":14,"rows_kept":129,"cut":false,"hidden":true,"merged":[]}
["EJECUTOR (Dpto / Entidad)","EJECUTOR INTERNO","ENCARGADO DE LA ENTIDAD ","ENLACE EMTIDAD EJECUTORA","BPIN ","PROYECTO","SECTOR","VALOR","ESTADO","FECHA ","FECHA DE TERMINACIÓN2","HOY","VENCIMIENTO N° DÍAS ","Columna1"]
["CUNDINAMARCA","SECRETARIA GENERAL","YAHIR ARCINIEGAS","JIMENA TAFUR",2012000050010,"ESTUDIOS Y DISEÑOS PARA LA RECUPERACIÓN Y ADECUACION DEL PATRIMONIO HISTORICO CULTURAL PALACIO DE SAN FRANCISCO EN BOGOTA D.C. DEPARTAMENTO DE CUNDINAMARCA ","CULTURA ",1000000000,"TERMINADO",43465,{"$f":"VLOOKUP(Tabla22[[#This Row],[BPIN ]],[1]Base1!F$3:Z$223,21,0)","v":43465},{"$f":"+TODAY()","v":45012},{"$f":"Tabla22[[#This Row],[FECHA ]]-Tabla22[[#This Row],[HOY]]","v":-1547},{"$f":"Tabla22[[#This Row],[FECHA ]]-Tabla22[[#This Row],[FECHA DE TERMINACIÓN2]]","v":0}]
["CUNDINAMARCA","SECRETARIA DE COMPETITIVIDAD","ALEXANDER RIVEROS/JEIMY FORERO","FABIAN CUESTA",2012000050030,"DESARROLLO CREACION Y FORTALECIMIENTO DE NUEVE (9) CENTROS DE EMPREDIMIENTO Y FORTALECIMIENTO EMPRESARIAL EN EL DEPARTAMENTO DE CUNDINAMARCA ","COMERCIO, INDUSTRIA Y TURISMO ",1752501814,"PARA CIERRE",42369,{"$f":"VLOOKUP(Tabla22[[#This Row],[BPIN ]],[1]Base1!F$3:Z$223,21,0)","v":42369},45012,{"$f":"Tabla22[[#This Row],[FECHA ]]-Tabla22[[#This Row],[HOY]]","v":-2643},{"$f":"Tabla22[[#This Row],[FECHA ]]-Tabla22[[#This Row],[FECHA DE TERMINACIÓN2]]","v":0}]
["CUNDINAMARCA","SECRETARIA DE CIENCIA, TECNOLOGIA E INNOVACIÓN","ALEXANDER RIVEROS Y YAHIR ARCINIEGAS","LUIS MANUEL GONZALEZ",2012000100010,"FORTALECIMIENTO DE LAS REGIONES COLOMBIANAS EN SUS CAPACIDADES DE CTI - CUNDINAMARCA","CTEL",8721806744,"CONTRATADO EN EJECUCIÓN",44926,{"$f":"VLOOKUP(Tabla22[[#This Row],[BPIN ]],[1]Base1!F$3:Z$223,21,0)","v":44926},45012,{"$f":"Tabla22[[#This Row],[FECHA ]]-Tabla22[[#This Row],[HOY]]","v":-86},{"$f":"Tabla22[[#This Row],[FECHA ]]-Tabla22[[#This Row],[FECHA DE TERMINACIÓN2]]","v":0}]
["CUNDINAMARCA","SECRETARIA DE CIENCIA, TECNOLOGIA E INNOVACIÓN","ALEXANDER RIVEROS Y YAHIR ARCINIEGAS","LUIS MANUEL GONZALEZ",2012000100144,"INVESTIGACIÓN INVESTIGACION, DESARROLLO Y TRANSFERENCIA TECNOLOGICA EN EL SECTOR AGROPECUARIO Y AGROINDUSTRIAL CON EL FIN DE MEJORAR L TODO EL DEPARTAMENTO, CUNDINAMARCA, CENTRO ORIENTE","CTEL",50514736439,"CONTRATADO EN EJECUCIÓN",45716,{"$f":"VLOOKUP(Tabla22[[#This Row],[BPIN ]],[1]Base1!F$3:Z$223,21,0)","v":45716},45012,{"$f":"Tabla22[[#This Row],[FECHA ]]-Tabla22[[#This Row],[HOY]]","v":704},{"$f":"Tabla22[[#This Row],[FECHA ]]-Tabla22[[#This Row],[FECHA DE TERMINACIÓN2]]","v":0}]
["CUNDINAMARCA","SECRETARIA DE MINAS, ENERGIA Y GAS","DIEGO TORRES","ALVARO CHACON",2013000050026,"CONSTRUCCIÓN REDES ELECTRICAS EN LA ZONA RURAL DE LOS MUNICIPIOS DE PARATEBUENO Y GUTIERREZ EN EL DEPARTAMENTO DE CUNDINAMARCA","MINAS Y ENERGÍA",1068319227,"TERMINADO",42369,{"$f":"VLOOKUP(Tabla22[[#This Row],[BPIN ]],[1]Base1!F$3:Z$223,21,0)","v":42369},45012,{"$f":"Tabla22[[#This Row],[FECHA ]]-Tabla22[[#This Row],[HOY]]","v":-2643},{"$f":"Tabla22[[#This Row],[FECHA ]]-Tabla22[[#This Row],[FECHA DE TERMINACIÓN2]]","v":0}]
["ENTIDAD APORTANTE RECURSOS","BANCO AGRARIO DE COLOMBIA","DIEGO TORRES / JEIMY FORERO",null,2013000050044,"CONSTRUCCIÓN CUNDINAMARCA VISR 2013 TODO EL DEPARTAMENTO, CUNDINAMARCA, CENTRO ORIENTE","AGRICULTURA ",60041780218,"CONTRATADO EN EJECUCIÓN",45260,{"$f":"VLOOKUP(Tabla22[[#This Row],[BPIN ]],[1]Base1!F$3:Z$223,21,0)","v":45260},45012,{"$f":"Tabla22[[#This Row],[FECHA ]]-Tabla22[[#This Row],[HOY]]","v":248},{"$f":"Tabla22[[#This Row],[FECHA ]]-Tabla22[[#This Row],[FECHA DE TERMINACIÓN2]]","v":0}]
["CUNDINAMARCA","SECRETARIA DE CIENCIA, TECNOLOGIA E INNOVACIÓN","ALEXANDER RIVEROS Y YAHIR ARCINIEGAS","LUIS MANUEL GONZALEZ",2013000100129,"INCREMENTO EN LAS ESTRATEGIAS SUSTENTABLES EN EL USO DEL RECURSO DE ENERGA ELECTRICA PARA LA POBLACION VULNERABLE EN EL DPTO. DE CUNDINAMARCA","CTEL",5170002961,"CONTRATADO EN EJECUCIÓN",44865,{"$f":"VLOOKUP(Tabla22[[#This Row],[BPIN ]],[1]Base1!F$3:Z$223,21,0)","v":44865},45012,{"$f":"Tabla22[[#This Row],[FECHA ]]-Tabla22[[#This Row],[HOY]]","v":-147},{"$f":"Tabla22[[#This Row],[FECHA ]]-Tabla22[[#This Row],[FECHA DE TERMINACIÓN2]]","v":0}]
["CUNDINAMARCA","SECRETARIA DE CIENCIA, TECNOLOGIA E INNOVACIÓN","ALEXANDER RIVEROS Y YAHIR ARCINIEGAS","LUIS MANUEL GONZALEZ",2013000100176,"INNOVACIÓN SISTEMA DE PRODUCCION DE FRUTAS/HORTALIZAS FRESCAS/PROCESADAS TIPO EXPORTACION CON TECNOLOGIA BIOLOGICA /INTEGRAL INOCUA SUBACHOQUE, CUNDINAMARCA, CENTRO ORIENTE","CTEL",9285096292,"CONTRATADO EN EJECUCIÓN",44377,{"$f":"VLOOKUP(Tabla22[[#This Row],[BPIN ]],[1]Base1!F$3:Z$223,21,0)","v":44377},45012,{"$f":"Tabla22[[#This Row],[FECHA ]]-Tabla22[[#This Row],[HOY]]","v":-635},{"$f":"Tabla22[[#This Row],[FECHA ]]-Tabla22[[#This Row],[FECHA DE TERMINACIÓN2]]","v":0}]
["CUNDINAMARCA","SECRETARIA DE CIENCIA, TECNOLOGIA E INNOVACIÓN","ALEXANDER RIVEROS Y YAHIR ARCINIEGAS","LUIS MANUEL GONZALEZ",2013000100248,"INNOVACIÓN , CIENCIA Y TECNOLOGIA PARA PRODUCTORES DE LECHE EN LA PROVINCIA DE UBATE, CUNDINAMARCA.","CTEL",11619725567,"CONTRATADO EN EJECUCIÓN",43496,{"$f":"VLOOKUP(Tabla22[[#This Row],[BPIN ]],[1]Base1!F$3:Z$223,21,0)","v":"31/01/2019\n\n"},45012,{"$f":"Tabla22[[#This Row],[FECHA ]]-Tabla22[[#This Row],[HOY]]","v":-1516},{"$f":"Tabla22[[#This Row],[FECHA ]]-Tabla22[[#This Row],[FECHA DE TERMINACIÓN2]]","v":{"$error":"#VALUE!"}}]
{"$rows_left_out":120}
{"sheet":"Riesgo de liberación","index":2,"n_rows":7,"n_cols":18,"rows_kept":7,"cut":false,"hidden":true,"merged":[]}
[]
["N°","EJECUTOR (Dpto / Entidad)","EJECUTOR INTERNO","ENCARGADO DE LA ENTIDAD ","ENLACE EMTIDAD EJECUTORA","BPIN ","PROYECTO","SECTOR","VALOR PROYECTO","VALOR SGR","OTRAS FUENTES","FECHA DE APROBACIÓN OCAD","ACUERDO DE APROBACIÓN","ESTADO","FECHA LIMITE","DÍAS TRANSCURRIDOS DESDE EL ACUERDO DE APROBACIÓN  ","Columna1","DÍAS HABILES PARA REALIZAR ACTO DE APERTURA"]
[164,"ENTIDAD APORTANTE RECURSOS","UNIVERSIDAD DE CUNDINAMARCA","YAHIR ARCINIEGAS","LUIS MANUEL GONZALEZ",2020000100158,"FORTALECIMIENTO DE LA INFRAESTRUCTURA FÍSICA Y TECNOLÓGICA DEL CENTRO DE ESTUDIOS AGROAMBIENTALES DE LA UNIVERSIDAD DE CUNDINAMARCA AGROU CUNDINAMARCA ","CTEL",2024433669,1997753509,{"$f":"I3-J3","v":26680160},44111,"098 DE 2020","SIN CONTRATAR",{"$f":"IF(L3=0,\"-\",EDATE(L3,6))","v":44293},{"$f":"IF(L3=0,\"-\",_xlfn.DAYS(TODAY(),L3))","v":901},{"$f":"IF(O3=\"-\",\"-\",_xlfn.DAYS(TODAY(),O3))","v":719},{"$f":"-Tabla25[[#This Row],[Columna1]]","v":-719}]
[218,"CUNDINAMARCA","SECRETARIA DE AMBIENTE",null,null,2022004250025,"Fortalecimiento de la producción de material vegetal arbustivo y arbóreo para la recuperación de la cobertura arbórea en el departamento de Cundinamarca","AMBIENTE Y DESARROLLO SOSTENIBLE",3387966925,2857824455,{"$f":"I4-J4","v":530142470},44907,"474 DE 2022","SIN CONTRATAR",{"$f":"IF(L4=0,\"-\",EDATE(L4,6))","v":45089},{"$f":"IF(L4=0,\"-\",_xlfn.DAYS(TODAY(),L4))","v":105},{"$f":"IF(O4=\"-\",\"-\",_xlfn.DAYS(TODAY(),O4))","v":-77},{"$f":"-Q4","v":77}]
[219,"CUNDINAMARCA","ICCU - GESPROY GB","ALEXANDER RIVEROS/JEIMY FORERO","GIOVANY QUEVEDO",2022004250032,"Mejoramiento de la vía que comunica a los municipios de san Cayetano y Cogua tramo vereda cardonal vereda mortiño del municipio de san Cayetano departamento de Cundinamarca","TRANSPORTE",9976205175,9976205175,0,44907,"474 DE 2022","NO HA MIGRADO A GESPROY",{"$f":"IF(L5=0,\"-\",EDATE(L5,6))","v":45089},{"$f":"IF(L5=0,\"-\",_xlfn.DAYS(TODAY(),L5))","v":105},{"$f":"IF(O5=\"-\",\"-\",_xlfn.DAYS(TODAY(),O5))","v":-77},{"$f":"-Q5","v":77}]
[]
[null,null,null,null,null,null,null,null,null,{"$f":"SUM(J3:J5)","v":14831783139}]

{"sheet":"Control de avances","index":3,"n_rows":1651,"n_cols":33,"rows_kept":1651,"cut":false,"hidden":true,"merged":[[216,19,216,21],[217,19,217,21],[0,0,0,14],[0,18,0,19],[0,21,0,22],[214,19,214,21],[215,19,215,21]]}
[" SISTEMAS GENERAL DEL REGALÍAS-BASE DE PROYECTOS APROBADOS",null,null,null,null,null,null,null,null,null,null,null,null,null,null,null,null,null,"\tAVANCE FÍSICO Y FINANCIERO",null,null,"ESTADO"]
["N°","EJECUTOR (Dpto / Entidad)","EJECUTOR INTERNO","ENCARGADO DE LA ENTIDAD ","ENLACE EMTIDAD EJECUTORA","BPIM","PROYECTO","SECTOR","VALOR PROYECTO","VALOR SGR","OTRAS FUENTES","FECHA DE APROBACIÓN OCAD","ESTADO","\tAVANCE FÍSICO","\tAVANCE FINANCIERO",null,null,null,"presento avance en el mes vigente ",null,null,"presento avance en el mes vigente ",null,null,null,null,"ESTADO"]
[1,"CUNDINAMARCA","SECRETARIA DE AMBIENTE","ALEXANDER RIVEROS Y YAHIR ARCINIEGAS","EDUARDO ",2012000050005,"ESTUDIOS Y DISEÑOS DE DETALLE EMBALSE CALANDAIMA MUNICIPIO DE EL COLEGIO DEPARTAMENTO DE CUNDINAMARCA","AMBIENTE Y DESARROLLO SOSTENIBLE",4000000000,1000000000,{"$f":"I3-J3","v":3000000000},41271,"CERRADO",1,1,null,null,null,"lleva 1 mes sin reportar avance",null,null,"lleva 3 mes sin reportar avance",null,null,null,null,44972,44607,{"$f":"IF(AA3=0,0,_xlfn.DAYS(AA3,TODAY()))","v":-40},{"$f":"IF(AB3=0,0,_xlfn.DAYS(AB3,TODAY()))","v":-405},{"$f":"IF(Z3=0,0,_xlfn.DAYS(Z3,TODAY()))","v":0}]
[2,"DESENTRALIZADOS","ICCU - GESPROY GB","DIEGO TORRES / JEIMY FORERO","GIOVANY QUEVEDO",2012000050006,"CONSTRUCCIÓN CUBIERTA COLISEO DEL CENTRO AGROTECNOLOGICO DE EXPOSICIONES Y COMERCIALIZACION DE LA REGION DEL SUMAPAZ EN EL MUNICIPIO DE FUSAGASUGA - CUNDINAMARCA","TRANSPORTE",6352617736,3581530801,2771086935,41271,"CERRADO",1,0.99539999999999995,null,null,null,"lleva 3 mes sin reportar avance",null,null,"lleva 6 mes sin reportar avance",null,null,null,null,44972,44607,{"$f":"IF(AA4=0,0,_xlfn.DAYS(AA4,TODAY()))","v":-40},{"$f":"IF(AB4=0,0,_xlfn.DAYS(AB4,TODAY()))","v":-405},{"$f":"IF(Z4=0,0,_xlfn.DAYS(Z4,TODAY()))","v":0}]
[3,"CUNDINAMARCA","SECRETARIA DE AGRICULTURA","DIEGO TORRES/VALENTINA PORTILLO","JAVIER HERREDIA",2012000050007,"FORTALECIMIENTO DE LAS CADENAS HORTIFRUTICOLA Y AROMATICAS EN CUNDINAMARCA","AGRICULTURA ",2490400000,1300000000,1190400000,41271,"CERRADO",1,1,null,null,null,"lleva 4 mes sin reportar avance",null,null,"lleva 9 mes sin reportar avance",null,null,null,null,44607,44607,{"$f":"IF(AA5=0,0,_xlfn.DAYS(AA5,TODAY()))","v":-405},-405,{"$f":"IF(Z5=0,0,_xlfn.DAYS(Z5,TODAY()))","v":0}]
[4,"CUNDINAMARCA","SECRETARIA DE AGRICULTURA","DIEGO TORRES/VALENTINA PORTILLO","JAVIER HERREDIA",2012000050009,"FORTALECIMIENTO DE LA PRODUCTIVIDAD Y COMPETITIVIDAD DEL SECTOR CACAOTERO EN EL DEPARTAMENTO DE CUNDINAMARCA ","AGRICULTURA ",2334689275,1200000000,1134689275,41271,"CERRADO",1,0.96340000000000003,null,null,null,"lleva 6 mes sin reportar avance",null,null,"lleva 1 año sin reportar avance",null,null,null,null,44607,44607,{"$f":"IF(AA6=0,0,_xlfn.DAYS(AA6,TODAY()))","v":-405},-405,0]
[5,"CUNDINAMARCA","SECRETARIA GENERAL","YAHIR ARCINIEGAS","JIMENA TAFUR",2012000050010,"ESTUDIOS Y DISEÑOS PARA LA RECUPERACIÓN Y ADECUACION DEL PATRIMONIO HISTORICO CULTURAL PALACIO DE SAN FRANCISCO EN BOGOTA D.C. DEPARTAMENTO DE CUNDINAMARCA ","CULTURA ",1000000000,1000000000,0,41271,"TERMINADO",1,0.94640000000000002,null,null,null,null,null,null,null,null,null,null,null,44607,44607,-405,-405,0]
[6,"CUNDINAMARCA","SECRETARIA DE EDUCACIÓN","YAHIR ARCINIEGAS Y ALEXANDER RIVEROS","GENNY PADILLA",2012000050011,"FORTALECIMIENTO DE LA PERMANENCIA DE LOS ESTUDIANTES EN LOS MUNICIPIOS DEL DEPARTAMENTO DE CUNDINAMARCA DEPARTAMENTO DE CUNDINAMARCA\n","EDUCACIÓN",6000000000,6000000000,0,41187,"CERRADO",1,0.58189999999999997,null,null,null,null,null,null,null,null,null,null,null,44607,44607,-405,-405,0]
[7,"CUNDINAMARCA","SECRETARIA DE DESARROLLO E INCLUSIÓN SOCIAL","ALEXANDER RIVEROS Y JEIMY FORERO","TATIANA HERNANDEZ",2012000050012,"IMPLEMENTACIÓN DEL PROGRAMA DE COMPLEMENTACION ALIMENTARIA Y NUTRICIONAL EN MENORES DE 5 AÑOS, MUJERES GESTANTES Y LACTANTES EN TODO EL DEPARTAMENTO DE CUNDINAMARCA","SALUD Y PROTECCIÓN SOCIAL",4531022720,3000000000,1531022720,41187,"CERRADO",0.99039999999999995,0.99719999999999998,null,null,null,null,null,null,null,null,null,null,null,44607,44607,-405,-405,0]
[8,"CUNDINAMARCA","SECRETARIA DE TRANSPORTE Y MOVILIDAD","DAYANA FERNANDEZ Y EDGAR YAHIR ARCINIEGAS","JORGE PINZON",2012000050013,"ACTUALIZACION Y FORMULACION DE LOS ESTUDIOS Y DISEÑOS FASE II Y III DE LA EXTENCION NORTE - QUITO - SUR DEL SISTEMA TRANSMILENIO AL MUNICIPIO DE SOACHA DEPARTAMENTO DE CUNDINAMARCA ","SALUD Y PROTECCIÓN SOCIAL",4026917304,3130787355,896129949,41187,"CERRADO",0.96220000000000006,0.97030000000000005,null,null,null,null,null,null,null,null,null,null,null,44607,44607,-405,-405,0]
{"$rows_left_out":1642}
{"sheet":"Proyectos en Ejecución SGR ","index":4,"n_rows":236,"n_cols":25,"rows_kept":236,"cut":false,"hidden":false,"merged":[[0,0,0,24],[234,1,234,6],[235,1,235,6]]}
[" SISTEMAS GENERAL DEL REGALÍAS-BASE DE PROYECTOS APROBADOS"]
["N°","EJECUTOR (Dpto / Entidad)","EJECUTOR INTERNO","ENCARGADO DE LA ENTIDAD ","ENLACE EMTIDAD EJECUTORA","BPIN","PROYECTO","ALCANCE","SECTOR","VALOR PROYECTO","VALOR SGR","OTRAS FUENTES","FECHA DE APROBACIÓN OCAD","AÑO DE APROBACIÓN","ACUERDO DE APROBACIÓN","Cumplimiento de requisitos previos al inicio de la ejecución","Proyecto fue aprobado en SUIFP SGR pero no ha migrado a Gesproy","CDP","Proyecto fue migrado a Gesproy pero no tiene asignación de recursos en SPGR.","Proyecto con asignación de recursos en SPGR y sin apertura del primer proceso de contratación","Proyecto con asignación de recursos y sin apertura del primer proceso de contratación y sin identificación de alcance,  hitos y programación","Proyecto con apertura del primer proceso de contratación y sin suscripción del primer contrato.","ESTADO","\tAVANCE FÍSICO","\tAVANCE FINANCIERO"]
[1,"CUNDINAMARCA","SECRETARIA DE AMBIENTE","ALEXANDER RIVEROS Y YAHIR ARCINIEGAS","EDUARDO ",2012000050005,"ESTUDIOS Y DISEÑOS DE DETALLE EMBALSE CALANDAIMA MUNICIPIO DE EL COLEGIO DEPARTAMENTO DE CUNDINAMARCA",null,"AMBIENTE Y DESARROLLO SOSTENIBLE",4000000000,1000000000,{"$f":"J3-K3","v":3000000000},41271,2012,"004 DE 2012","04/04/2013\t","OK","15/04/2013\t","25/01/2013\t","30/08/2013\t","HACE FALTA ALCANCE DEL PROYECTO","12/07/2013\t","CERRADO",1,1]
[2,"DESENTRALIZADOS","ICCU - GESPROY GB","DIEGO TORRES / JEIMY FORERO","GIOVANY QUEVEDO",2012000050006,"CONSTRUCCIÓN CUBIERTA COLISEO DEL CENTRO AGROTECNOLOGICO DE EXPOSICIONES Y COMERCIALIZACION DE LA REGION DEL SUMAPAZ EN EL MUNICIPIO DE FUSAGASUGA - CUNDINAMARCA",null,"TRANSPORTE",6352617736,3581530801,2771086935,41271,2012,"004 DE 2012","S.D 31/05/2013","OK","217-24/04/2013",41299,41639,"VALOR TOTAL DEL PROYECTO A PROGRAMAR ES DIFERENTE A VALOR ACTIVIDADES PROGRAMADAS Y EJECUTADAS",41808,"CERRADO",1,0.99539999999999995]
[3,"CUNDINAMARCA","SECRETARIA DE AGRICULTURA","DIEGO TORRES/VALENTINA PORTILLO","JAVIER HERREDIA",2012000050007,"FORTALECIMIENTO DE LAS CADENAS HORTIFRUTICOLA Y AROMATICAS EN CUNDINAMARCA","MEJORAR LA COMPETITIVIDAD ECONÓMICA, SOCIAL Y AMBIENTAL DE PRODUCTORES DE LAS CADENAS DE MANGO, MORA Y AROMÁTICAS, DEL DEPARTAMENTO DE CUNDINAMARCA, ACOMPAÑADO DE PRODUCCIÓN DE ABONOS ORGANICOS E IMPLEMENTACIÓN DE POSCOSECHA Y VALOR AGREGADO.","AGRICULTURA ",2490400000,1300000000,1190400000,41271,2012,"004 DE 2012","013-03/05/2013","OK",41453,"0018-25/01/2013",41458,"HACE FALTA ALCANCE DEL PROYECTO ",41458,"CERRADO",1,1]
[4,"CUNDINAMARCA","SECRETARIA DE AGRICULTURA","DIEGO TORRES/VALENTINA PORTILLO","JAVIER HERREDIA",2012000050009,"FORTALECIMIENTO DE LA PRODUCTIVIDAD Y COMPETITIVIDAD DEL SECTOR CACAOTERO EN EL DEPARTAMENTO DE CUNDINAMARCA ","AUMENTO DE LA PRODUCTIVIDAD DE LAS ÁREAS CACAOTERAS DEL DEPARTAMENTO DE CUNDINAMARCA ","AGRICULTURA ",2334689275,1200000000,1134689275,41271,2012,"004 DE 2012","012-04/04/2013","OK",41431,"0018-25/01/2013","001 de 2013- 24/06/2013","HACE FALTA ALCANCE DEL PROYECTO ",41449,"CERRADO",1,0.96340000000000003]
[5,"CUNDINAMARCA","SECRETARIA GENERAL","YAHIR ARCINIEGAS","JIMENA TAFUR",2012000050010,"ESTUDIOS Y DISEÑOS PARA LA RECUPERACIÓN Y ADECUACION DEL PATRIMONIO HISTORICO CULTURAL PALACIO DE SAN FRANCISCO EN BOGOTA D.C. DEPARTAMENTO DE CUNDINAMARCA ","GESTIONAR INTEGRALMENTE EL DESARROLLO DE LA RESTAURACION Y ADECUACION CON LA FORMULACION DE ESTUDIOS Y DISEÑOS DEL MONUMENTO HISTORICO PALACIO DE SAN FRANCISCO","CULTURA ",1000000000,1000000000,0,41271,2012,"004 DE 2012","01-04/04/2013","OK",41705,41299,41795,"OK",41852,"TERMINADO",1,0.94640000000000002]
[6,"CUNDINAMARCA","SECRETARIA DE EDUCACIÓN","YAHIR ARCINIEGAS Y ALEXANDER RIVEROS","GENNY PADILLA",2012000050011,"FORTALECIMIENTO DE LA PERMANENCIA DE LOS ESTUDIANTES EN LOS MUNICIPIOS DEL DEPARTAMENTO DE CUNDINAMARCA DEPARTAMENTO DE CUNDINAMARCA\n","\nDISMINUIR LA DESERCIÓN EN LOS MUNICIPIOS DEL DEPARTAMENTO DE CUNDINAMARCA","EDUCACIÓN",6000000000,6000000000,0,41187,2012,"003 DE 2012","1-01/04/2013","OK",41247,41227,41247,"HACE FALTA ALCANCE DEL PROYECTO  Y DIFERENCIA EN LA INFORMACION DE ACTIVIDAD DEL PROYECTO",41247,"CERRADO",1,0.58189999999999997]
[7,"CUNDINAMARCA","SECRETARIA DE DESARROLLO E INCLUSIÓN SOCIAL","ALEXANDER RIVEROS Y JEIMY FORERO","TATIANA HERNANDEZ",2012000050012,"IMPLEMENTACIÓN DEL PROGRAMA DE COMPLEMENTACION ALIMENTARIA Y NUTRICIONAL EN MENORES DE 5 AÑOS, MUJERES GESTANTES Y LACTANTES EN TODO EL DEPARTAMENTO DE CUNDINAMARCA","MEJORAR Y FORTALECER LA SEGURIDAD ALIMENTARIA Y NUTRICIONAL EN EL DEPARTAMENTO FACILITANDO EL ACCESO A LOS ALIMENTOS Y NUTRIENTES CRÍTICOS A LOS GRUPOS POBLACIONALES MÁS VULNERABLES.","SALUD Y PROTECCIÓN SOCIAL",4531022720,3000000000,1531022720,41187,2012,"003 DE 2012","08/11/2013 -031","OK",41335,41267,41520,"HACE FALTA ALCANCE DEL PROYECTO  Y DIFERENCIA EN LA INFORMACION DE ACTIVIDAD DEL PROYECTO",41541,"CERRADO",0.99039999999999995,0.99719999999999998]
[8,"CUNDINAMARCA","SECRETARIA DE TRANSPORTE Y MOVILIDAD","DAYANA FERNANDEZ Y EDGAR YAHIR ARCINIEGAS","JORGE PINZON",2012000050013,"ACTUALIZACION Y FORMULACION DE LOS ESTUDIOS Y DISEÑOS FASE II Y III DE LA EXTENCION NORTE - QUITO - SUR DEL SISTEMA TRANSMILENIO AL MUNICIPIO DE SOACHA DEPARTAMENTO DE CUNDINAMARCA ","INTRANSITABILIDAD VEHICULAR DE LA VIA LIMITE DEL DISTRITO AL MUNICIPIO DE SOACHA","SALUD Y PROTECCIÓN SOCIAL",4026917304,3130787355,896129949,41187,2012,"003 DE 2012","04/04/2013-32","OK",41586,41508,41600,"HACE FALTA ALCANCE DEL PROYECTO ",41632,"CERRADO",0.96220000000000006,0.97030000000000005]
{"$rows_left_out":226}