{"text_format":"1","workbook":"xlsx","n_sheets":5,"sheets":["Tablas","Vencimiento días","Riesgo de liberación","Control de avances","Proyectos en Ejecución SGR "],"not_rendered":{"charts":4,"images":1,"macros":1,"external_links":1,"defined_names":4,"comments":1,"pivot_tables":4},"unopened":[],"bounds":{"document_bytes":16777216,"sheet_cells":100000,"rows_first":2000,"rows_last":500,"rows_between":2000,"halvings":0,"cell_chars":16384,"cell_head_chars":4096},"cells_cut":0,"cells_raw":0,"read":"whole","date_system":"1900"}

{"sheet":"Tablas","index":0,"n_rows":20,"n_cols":21,"rows_kept":20,"cut":false,"hidden":false,"merged":[]}
["EJECUTOR (Dpto / Entidad)","CUNDINAMARCA",null,null,null,"EJECUTOR (Dpto / Entidad)","CUNDINAMARCA",null,null,null,null,"EJECUTOR (Dpto / Entidad)","CUNDINAMARCA",null,null,null,null,"EJECUTOR (Dpto / Entidad)","CUNDINAMARCA"]
[null,null,null,null,null,"ESTADO","(Varios elementos)",null,null,null,null,"ESTADO","(Varios elementos)",null,null,null,null,"ESTADO","(Varios elementos)"]
["Etiquetas de fila","Cuenta de ESTADO"]
["CONTRATADO EN EJECUCIÓN",33,null,null,null,"Etiquetas de fila","Cuenta de SECTOR","Suma de VALOR PROYECTO","Suma de VALOR SGR",null,null,"Etiquetas de fila","Cuenta de EJECUTOR INTERNO","Suma de VALOR PROYECTO","Suma de VALOR SGR",null,null,"Etiquetas de fila","Promedio de \tAVANCE FÍSICO","Promedio de \tAVANCE FINANCIERO","Cuenta de EJECUTOR INTERNO"]
["CONTRATADO SIN ACTA DE INICIO",2,null,null,null,"CTEL",27,191779638692,155723036786,null,null,"ENTIDAD DESIGNADA PARA LA SUPERVISIÓN DEL PROYECTO O PARA CONTRATAR LA INTERVENTORÍA RAPE - INTERVENTORIA SECRETARIA DE PLANEACIÓN",1,32499987282,32499987282,null,null,"SECRETARIA DE CIENCIA, TECNOLOGIA E INNOVACIÓN",0.58346666666666669,0.70026045454545449,27]
["EN PROCESO DE CONTRATACIÓN",5,null,null,null,"EDUCACIÓN",5,71585959488,114551996798,null,null,"ENTIDAD DESIGNADA PARA LA SUPERVISIÓN DEL PROYECTO O PARA CONTRATAR LA INTERVENTORÍA-EMPRESAS PUBLICAS DE CUNDINAMARCA -EPC",1,4999900475,4999900475,null,null,"SECRETARIA DE MINAS, ENERGIA Y GAS",0.57694999999999996,0.76786666666666659,5]
["PARA CIERRE",7,null,null,null,"AGRICULTURA ",8,59725542590.559998,48132930832.559998,null,null,"SECRETARIA DE GOBIERNO",1,9260000000,8500000000,null,null,"SECRETARIA DE EDUCACIÓN",0.8963000000000001,0.70042000000000004,5]
["TERMINADO",8,null,null,null,"SALUD Y PROTECCIÓN SOCIAL",1,43433295564,43433295564,null,null,"ICCU - GESPROY GB",1,9976205175,9976205175,null,null,"SECRETARIA DE HABITAT Y VIVIENDA",0.74997500000000006,0.69922499999999999,4]
["NO HA MIGRADO A GESPROY",1,null,null,null,"AMBIENTE Y DESARROLLO SOSTENIBLE",3,38972862080,38442719610,null,null,"SECRETARIA DE PLANEACIÓN",1,6791102422,6725380622,null,null,"SECRETARIA DE COMPETITIVIDAD",0.25,0.4718,4]
["SIN CONTRATAR",1,null,null,null,"MINAS Y ENERGÍA",4,28895282235,16825879226,null,null,"SECRETARIA GENERAL",1,1000000000,1000000000,null,null,"UNIDAD ADMINISTRATIVA DE GESTIÓN DEL RIESGO.",0.60119999999999996,0.17169999999999999,2]
["Total general",57,null,null,null,"TRANSPORTE",2,16767307597,16701585797,null,null,"SECRETARIA DE SALUD",1,43433295564,43433295564,null,null,"SECRETARIA DE AGRICULTURA",0.95700000000000007,0.94789999999999996,2]
[null,null,null,null,null,"JUSTICIA Y DEL DERECHO ",1,9260000000,8500000000,null,null,"UNIDAD ADMINISTRATIVA DE GESTIÓN DEL RIESGO.",2,10384421973,10384421973,null,null,"ENTIDAD DESIGNADA PARA LA SUPERVISIÓN DEL PROYECTO O PARA CONTRATAR LA INTERVENTORÍA RAPE - INTERVENTORIA SECRETARIA DE PLANEACIÓN",0.99809999999999999,0.99880000000000002,1]
[null,null,null,null,null,"GOBIERNO TERRITORIAL",2,7299514100,7299514100,null,null,"SECRETARIA DE AGRICULTURA",2,16616918902,8617237971,null,null,"SECRETARIA DE SALUD",0.54379999999999995,0.54759999999999998,1]
[null,null,null,null,null,"VIVIENDA, CIUDAD Y TERRITORIO ",1,4999900475,4999900475,null,null,"SECRETARIA DE COMPETITIVIDAD",4,29235967455.559998,26238669395.559998,null,null,"SECRETARIA DE PLANEACIÓN",0.98519999999999996,0.92030000000000001,1]
[null,null,null,null,null," ",1,2354318125,2354318125,null,null,"SECRETARIA DE HABITAT Y VIVIENDA",4,17979476172,17339445952,null,null,"ENTIDAD DESIGNADA PARA LA SUPERVISIÓN DEL PROYECTO O PARA CONTRATAR LA INTERVENTORÍA-EMPRESAS PUBLICAS DE CUNDINAMARCA -EPC",0.87680000000000002,0.78310000000000002,1]
[null,null,null,null,null,"COMERCIO, INDUSTRIA Y TURISMO ",1,1752501814,1708104361,null,null,"SECRETARIA DE EDUCACIÓN",5,71585959488,114551996798,null,null,"SECRETARIA GENERAL",1,0.94640000000000002,1]
[null,null,null,null,null,"CULTURA ",1,1000000000,1000000000,null,null,"SECRETARIA DE MINAS, ENERGIA Y GAS",5,28895282235,16825879226,null,null,"SECRETARIA DE AMBIENTE",0,0,1]
[null,null,null,null,null,"Total general",57,477826122760.56,459673281674.56,null,null,"SECRETARIA DE CIENCIA, TECNOLOGIA E INNOVACIÓN",27,191779638692,155723036786,null,null,"ICCU - GESPROY GB",0,0,1]
[null,null,null,null,null,null,null,null,null,null,null,"Total general",56,474438155835.56,456815457219.56,null,null,"SECRETARIA DE GOBIERNO",1,1,1]
[null,null,null,null,null,null,null,null,null,null,null,null,null,null,null,null,null,"Total general",0.62854150943396225,0.67059448979591851,57]

{"sheet":"Vencimiento días","index":1,"n_rows":129,"n_cols":14,"rows_kept":129,"cut":false,"hidden":true,"merged":[]}
["EJECUTOR (Dpto / Entidad)","EJECUTOR INTERNO","ENCARGADO DE LA ENTIDAD ","ENLACE EMTIDAD EJECUTORA","BPIN ","PROYECTO","SECTOR","VALOR","ESTADO","FECHA ","FECHA DE TERMINACIÓN2","HOY","VENCIMIENTO N° DÍAS ","Columna1"]
["CUNDINAMARCA","SECRETARIA GENERAL","YAHIR ARCINIEGAS","JIMENA TAFUR",2012000050010,"ESTUDIOS Y DISEÑOS PARA LA RECUPERACIÓN Y ADECUACION DEL PATRIMONIO HISTORICO CULTURAL PALACIO DE SAN FRANCISCO EN BOGOTA D.C. DEPARTAMENTO DE CUNDINAMARCA ","CULTURA ",1000000000,"TERMINADO",43465,{"$f":"VLOOKUP(Tabla22[[#This Row],[BPIN ]],[1]Base1!F$3:Z$223,21,0)","v":43465},{"$f":"+TODAY()","v":45012},{"$f":"Tabla22[[#This Row],[FECHA ]]-Tabla22[[#This Row],[HOY]]","v":-1547},{"$f":"Tabla22[[#This Row],[FECHA ]]-Tabla22[[#This Row],[FECHA DE TERMINACIÓN2]]","v":0}]
["CUNDINAMARCA","SECRETARIA DE COMPETITIVIDAD","ALEXANDER RIVEROS/JEIMY FORERO","FABIAN CUESTA",2012000050030,"DESARROLLO CREACION Y FORTALECIMIENTO DE NUEVE (9) CENTROS DE EMPREDIMIENTO Y FORTALECIMIENTO EMPRESARIAL EN EL DEPARTAMENTO DE CUNDINAMARCA ","COMERCIO, INDUSTRIA Y TURISMO ",1752501814,"PARA CIERRE",42369,{"$f":"VLOOKUP(Tabla22[[#This Row],[BPIN ]],[1]Base1!F$3:Z$223,21,0)","v":42369},45012,{"$f":"Tabla22[[#This Row],[FECHA ]]-Tabla22[[#This Row],[HOY]]","v":-2643},{"$f":"Tabla22[[#This Row],[FECHA ]]-Tabla22[[#This Row],[FECHA DE TERMINACIÓN2]]","v":0}]
["CUNDINAMARCA","SECRETARIA DE CIENCIA, TECNOLOGIA E INNOVACIÓN","ALEXANDER RIVEROS Y YAHIR ARCINIEGAS","LUIS MANUEL GONZALEZ",2012000100010,"FORTALECIMIENTO DE LAS REGIONES COLOMBIANAS EN SUS CAPACIDADES DE CTI - CUNDINAMARCA","CTEL",8721806744,"CONTRATADO EN EJECUCIÓN",44926,{"$f":"VLOOKUP(Tabla22[[#This Row],[BPIN ]],[1]Base1!F$3:Z$223,21,0)","v":44926},45012,{"$f":"Tabla22[[#This Row],[FECHA ]]-Tabla22[[#This Row],[HOY]]","v":-86},{"$f":"Tabla22[[#This Row],[FECHA ]]-Tabla22[[#This Row],[FECHA DE TERMINACIÓN2]]","v":0}]
["CUNDINAMARCA","SECRETARIA DE CIENCIA, TECNOLOGIA E INNOVACIÓN","ALEXANDER RIVEROS Y YAHIR ARCINIEGAS","LUIS MANUEL GONZALEZ",2012000100144,"INVESTIGACIÓN INVESTIGACION, DESARROLLO Y TRANSFERENCIA TECNOLOGICA EN EL SECTOR AGROPECUARIO Y AGROINDUSTRIAL CON EL FIN DE MEJORAR L TODO EL DEPARTAMENTO, CUNDINAMARCA, CENTRO ORIENTE","CTEL",50514736439,"CONTRATADO EN EJECUCIÓN",45716,{"$f":"VLOOKUP(Tabla22[[#This Row],[BPIN ]],[1]Base1!F$3:Z$223,21,0)","v":45716},45012,{"$f":"Tabla22[[#This Row],[FECHA ]]-Tabla22[[#This Row],[HOY]]","v":704},{"$f":"Tabla22[[#This Row],[FECHA ]]-Tabla22[[#This Row],[FECHA DE TERMINACIÓN2]]","v":0}]
["CUNDINAMARCA","SECRETARIA DE MINAS, ENERGIA Y GAS","DIEGO TORRES","ALVARO CHACON",2013000050026,"CONSTRUCCIÓN REDES ELECTRICAS EN LA ZONA RURAL DE LOS MUNICIPIOS DE PARATEBUENO Y GUTIERREZ EN EL DEPARTAMENTO DE CUNDINAMARCA","MINAS Y ENERGÍA",1068319227,"TERMINADO",42369,{"$f":"VLOOKUP(Tabla22[[#This Row],[BPIN ]],[1]Base1!F$3:Z$223,21,0)","v":42369},45012,{"$f":"Tabla22[[#This Row],[FECHA ]]-Tabla22[[#This Row],[HOY]]","v":-2643},{"$f":"Tabla22[[#This Row],[FECHA ]]-Tabla22[[#This Row],[FECHA DE TERMINACIÓN2]]","v":0}]
["ENTIDAD APORTANTE RECURSOS","BANCO AGRARIO DE COLOMBIA","DIEGO TORRES / JEIMY FORERO",null,2013000050044,"CONSTRUCCIÓN CUNDINAMARCA VISR 2013 TODO EL DEPARTAMENTO, CUNDINAMARCA, CENTRO ORIENTE","AGRICULTURA ",60041780218,"CONTRATADO EN EJECUCIÓN",45260,{"$f":"VLOOKUP(Tabla22[[#This Row],[BPIN ]],[1]Base1!F$3:Z$223,21,0)","v":45260},45012,{"$f":"Tabla22[[#This Row],[FECHA ]]-Tabla22[[#This Row],[HOY]]","v":248},{"$f":"Tabla22[[#This Row],[FECHA ]]-Tabla22[[#This Row],[FECHA DE TERMINACIÓN2]]","v":0}]
["CUNDINAMARCA","SECRETARIA DE CIENCIA, TECNOLOGIA E INNOVACIÓN","ALEXANDER RIVEROS Y YAHIR ARCINIEGAS","LUIS MANUEL GONZALEZ",2013000100129,"INCREMENTO EN LAS ESTRATEGIAS SUSTENTABLES EN EL USO DEL RECURSO DE ENERGA ELECTRICA PARA LA POBLACION VULNERABLE EN EL DPTO. DE CUNDINAMARCA","CTEL",5170002961,"CONTRATADO EN EJECUCIÓN",44865,{"$f":"VLOOKUP(Tabla22[[#This Row],[BPIN ]],[1]Base1!F$3:Z$223,21,0)","v":44865},45012,{"$f":"Tabla22[[#This Row],[FECHA ]]-Tabla22[[#This Row],[HOY]]","v":-147},{"$f":"Tabla22[[#This Row],[FECHA ]]-Tabla22[[#This Row],[FECHA DE TERMINACIÓN2]]","v":0}]
["CUNDINAMARCA","SECRETARIA DE CIENCIA, TECNOLOGIA E INNOVACIÓN","ALEXANDER RIVEROS Y YAHIR ARCINIEGAS","LUIS MANUEL GONZALEZ",2013000100176,"INNOVACIÓN SISTEMA DE PRODUCCION DE FRUTAS/HORTALIZAS FRESCAS/PROCESADAS TIPO EXPORTACION CON TECNOLOGIA BIOLOGICA /INTEGRAL INOCUA SUBACHOQUE, CUNDINAMARCA, CENTRO ORIENTE","CTEL",9285096292,"CONTRATADO EN EJECUCIÓN",44377,{"$f":"VLOOKUP(Tabla22[[#This Row],[BPIN ]],[1]Base1!F$3:Z$223,21,0)","v":44377},45012,{"$f":"Tabla22[[#This Row],[FECHA ]]-Tabla22[[#This Row],[HOY]]","v":-635},{"$f":"Tabla22[[#This Row],[FECHA ]]-Tabla22[[#This Row],[FECHA DE TERMINACIÓN2]]","v":0}]
["CUNDINAMARCA","SECRETARIA DE CIENCIA, TECNOLOGIA E INNOVACIÓN","ALEXANDER RIVEROS Y YAHIR ARCINIEGAS","LUIS MANUEL GONZALEZ",2013000100248,"INNOVACIÓN , CIENCIA Y TECNOLOGIA PARA PRODUCTORES DE LECHE EN LA PROVINCIA DE UBATE, CUNDINAMARCA.","CTEL",11619725567,"CONTRATADO EN EJECUCIÓN",43496,{"$f":"VLOOKUP(Tabla22[[#This Row],[BPIN ]],[1]Base1!F$3:Z$223,21,0)","v":"31/01/2019\n\n"},45012,{"$f":"Tabla22[[#This Row],[FECHA ]]-Tabla22[[#This Row],[HOY]]","v":-1516},{"$f":"Tabla22[[#This Row],[FECHA ]]-Tabla22[[#This Row],[FECHA DE TERMINACIÓN2]]","v":{"$error":"#VALUE!"}}]
["CUNDINAMARCA","SECRETARIA DE GOBIERNO","DAYANA FERNANDEZ ","EDUARDO ",2014000050010,"CONSTRUCCIÓN DE UN CENTRO DE ATENCION ESPECIALIZADA AL SERVICIO DE ADOLESCENTES INFRACTORES DE LA LEY PENAL EN EL DEPARTAMENTO DE CUNDINAMARCA","JUSTICIA Y DEL DERECHO ",9260000000,"PARA CIERRE",43190,{"$f":"VLOOKUP(Tabla22[[#This Row],[BPIN ]],[1]Base1!F$3:Z$223,21,0)","v":43190},45012,{"$f":"Tabla22[[#This Row],[FECHA ]]-Tabla22[[#This Row],[HOY]]","v":-1822},{"$f":"Tabla22[[#This Row],[FECHA ]]-Tabla22[[#This Row],[FECHA DE TERMINACIÓN2]]","v":0}]
["CUNDINAMARCA","SECRETARIA DE HABITAT Y VIVIENDA","ALEXANDER RIVEROS/JEIMY FORERO","BEATRIZ GAMEZ",2016000050052,"CONSTRUCCIÓN DE VIVIENDAS NUEVAS RURALES EN EL DEPARTAMENTO DE CUNDINAMARCA","AGRICULTURA ",5983779025,"CONTRATADO EN EJECUCIÓN",44561,{"$f":"VLOOKUP(Tabla22[[#This Row],[BPIN ]],[1]Base1!F$3:Z$223,21,0)","v":44561},{"$f":"+TODAY()","v":45012},{"$f":"Tabla22[[#This Row],[FECHA ]]-Tabla22[[#This Row],[HOY]]","v":-451},{"$f":"Tabla22[[#This Row],[FECHA ]]-Tabla22[[#This Row],[FECHA DE TERMINACIÓN2]]","v":0}]
["CUNDINAMARCA","SECRETARIA DE CIENCIA, TECNOLOGIA E INNOVACIÓN","ALEXANDER RIVEROS Y YAHIR ARCINIEGAS","LUIS MANUEL GONZALEZ",2016000100027,"ANLISIS DE FACTORES GENETICOS, SANITARIOS Y MEDIOAMBIENTALES QUE AFECTAN LAS TASAS DE PREÑEZ A PARTIR DE EMBRIONES IN VITRO EN EL DEPARTAMENTO DE CUNDINAMARCA","CTEL",6401358633,"CONTRATADO EN EJECUCIÓN",44742,{"$f":"VLOOKUP(Tabla22[[#This Row],[BPIN ]],[1]Base1!F$3:Z$223,21,0)","v":44742},45012,{"$f":"Tabla22[[#This Row],[FECHA ]]-Tabla22[[#This Row],[HOY]]","v":-270},{"$f":"Tabla22[[#This Row],[FECHA ]]-Tabla22[[#This Row],[FECHA DE TERMINACIÓN2]]","v":0}]
["ENTIDAD DESIGNADA PARA LA SUPERVISIÓN DEL PROYECTO O PARA CONTRATAR LA INTERVENTORÍA","RAPE - INTERVENTORIA SECRETARIA DE PLANEACIÓN","YAHIR ARCINIEGAS","ANGELA MARTINEZ",2016000050012,"IMPLEMENTACIÓN DE ACCIONES DE CONSERVACION Y RESTAURACION DE LOS COMPLEJOS DE PARAMO, BOSQUE ALTO-ANDINO Y SERVICIOS ECOSISTEMICOS DE LA REGION CENTRAL","AMBIENTE Y DESARROLLO SOSTENIBLE",32499987282,"CONTRATADO EN EJECUCIÓN",44530,{"$f":"VLOOKUP(Tabla22[[#This Row],[BPIN ]],[1]Base1!F$3:Z$223,21,0)","v":44530},45012,{"$f":"Tabla22[[#This Row],[FECHA ]]-Tabla22[[#This Row],[HOY]]","v":-482},{"$f":"Tabla22[[#This Row],[FECHA ]]-Tabla22[[#This Row],[FECHA DE TERMINACIÓN2]]","v":0}]
["ENTIDAD APORTANTE RECURSOS","MUNICIPIO DE ZIPAQUIRA","ALEXANDER RIVEROS","JAIRO JARA",2017000050029,"CONSERVACIÓN  Y GESTIÓN INTEGRAL DEL RECURSO HÍDRICO MEDIANTE LA ADQUISICIÓN Y RESTAURACIÓN DE PREDIOS DE INTERÉS ECOSISTÉMICO EN ELDEPARTAMENTO DE   CUNDINAMARCA","AMBIENTE Y DESARROLLO SOSTENIBLE",900000000,"CONTRATADO EN EJECUCIÓN",44865,{"$f":"VLOOKUP(Tabla22[[#This Row],[BPIN ]],[1]Base1!F$3:Z$223,21,0)","v":44865},45012,{"$f":"Tabla22[[#This Row],[FECHA ]]-Tabla22[[#This Row],[HOY]]","v":-147},{"$f":"Tabla22[[#This Row],[FECHA ]]-Tabla22[[#This Row],[FECHA DE TERMINACIÓN2]]","v":0}]
["CUNDINAMARCA","SECRETARIA DE MINAS, ENERGIA Y GAS","DIEGO TORRES / LIYUGETH ALFONSO","JAHIR HERNANDEZ",2017000050036,"IMPLEMENTACIÓN Y EXPANSIÓN DEL SERVICIO DE GAS COMBUSTIBLE POR REDES PARA VEREDAS Y CENTROS POBLADOS DEL DEPARTAMENTO DE CUNDINAMARCA","MINAS Y ENERGÍA",4751658472,"PARA CIERRE",44196,{"$f":"VLOOKUP(Tabla22[[#This Row],[BPIN ]],[1]Base1!F$3:Z$223,21,0)","v":44196},45012,{"$f":"Tabla22[[#This Row],[FECHA ]]-Tabla22[[#This Row],[HOY]]","v":-816},{"$f":"Tabla22[[#This Row],[FECHA ]]-Tabla22[[#This Row],[FECHA DE TERMINACIÓN2]]","v":0}]
["CUNDINAMARCA","SECRETARIA DE PLANEACIÓN","YESID CASTAÑO Y JEIMY FORERO","RUSVEL NIETO",2017000050039,"MEJORAMIENTO DE VÍAS TERCIARIAS MEDIANTE EL USO DE PLACA HUELLA EN LOS MUNICIPIOS DE GUATAVITA, PACHO, SAN JUAN DE RIOSECO, SUBACHOQUE, TENA Y ZIPAQUIRÁ, DEPARTAMENTO DE CUNDINAMARCA","TRANSPORTE",6791102422,"CONTRATADO EN EJECUCIÓN",43830,{"$f":"VLOOKUP(Tabla22[[#This Row],[BPIN ]],[1]Base1!F$3:Z$223,21,0)","v":43830},45012,{"$f":"Tabla22[[#This Row],[FECHA ]]-Tabla22[[#This Row],[HOY]]","v":-1182},{"$f":"Tabla22[[#This Row],[FECHA ]]-Tabla22[[#This Row],[FECHA DE TERMINACIÓN2]]","v":0}]
["CUNDINAMARCA","SECRETARIA DE HABITAT Y VIVIENDA","ALEXANDER RIVEROS/JEIMY FORERO","BEATRIZ GAMEZ",2017000050042,"MEJORAMIENTO DE VIVIENDAS RURALES DE LA PROVINCIA DE UBATÉ - CUNDINAMARCA","AGRICULTURA ",2354318125,"TERMINADO",44561,{"$f":"VLOOKUP(Tabla22[[#This Row],[BPIN ]],[1]Base1!F$3:Z$223,21,0)","v":44561},45012,{"$f":"Tabla22[[#This Row],[FECHA ]]-Tabla22[[#This Row],[HOY]]","v":-451},{"$f":"Tabla22[[#This Row],[FECHA ]]-Tabla22[[#This Row],[FECHA DE TERMINACIÓN2]]","v":0}]
["CUNDINAMARCA","SECRETARIA DE AGRICULTURA","DIEGO TORRES/VALENTINA PORTILLO","JAVIER HERREDIA",2017000050065,"MEJORAMIENTO DE LA PRODUCTIVIDAD Y RENTABILIDAD DE LOS CAFICULTORES DEL DEPARTAMENTO DE CUNDINAMARCA","AGRICULTURA ",6523880054,"TERMINADO",44196,{"$f":"VLOOKUP(Tabla22[[#This Row],[BPIN ]],[1]Base1!F$3:Z$223,21,0)","v":44196},45012,{"$f":"Tabla22[[#This Row],[FECHA ]]-Tabla22[[#This Row],[HOY]]","v":-816},{"$f":"Tabla22[[#This Row],[FECHA ]]-Tabla22[[#This Row],[FECHA DE TERMINACIÓN2]]","v":0}]
["CUNDINAMARCA","SECRETARIA DE CIENCIA, TECNOLOGIA E INNOVACIÓN","ALEXANDER RIVEROS Y YAHIR ARCINIEGAS","LUIS MANUEL GONZALEZ",2017000100016,"IMPLEMENTACIÓN PROGRAMA DE INNOVACIÓN PARA LA VALIDACIÓN Y GENERACIÓN DE PRODUCTOS DERIVADOS DE LA BIODIVERSIDAD EN EL DEPARTAMENTO DE CUNDINAMARCA","CTEL",4486653319,"CONTRATADO EN EJECUCIÓN",44926,{"$f":"VLOOKUP(Tabla22[[#This Row],[BPIN ]],[1]Base1!F$3:Z$223,21,0)","v":44926},45012,{"$f":"Tabla22[[#This Row],[FECHA ]]-Tabla22[[#This Row],[HOY]]","v":-86},{"$f":"Tabla22[[#This Row],[FECHA ]]-Tabla22[[#This Row],[FECHA DE TERMINACIÓN2]]","v":0}]
["CUNDINAMARCA","SECRETARIA DE CIENCIA, TECNOLOGIA E INNOVACIÓN","ALEXANDER RIVEROS Y YAHIR ARCINIEGAS","LUIS MANUEL GONZALEZ",2017000100034,"IMPLEMENTACIÓN DE UN SISTEMA DE GESTIÓN DE INNOVACIÓN PARA LA INDUSTRIA DE CUNDINAMARCA","CTEL",3925471448,"CONTRATADO EN EJECUCIÓN",44530,{"$f":"VLOOKUP(Tabla22[[#This Row],[BPIN ]],[1]Base1!F$3:Z$223,21,0)","v":44530},45012,{"$f":"Tabla22[[#This Row],[FECHA ]]-Tabla22[[#This Row],[HOY]]","v":-482},{"$f":"Tabla22[[#This Row],[FECHA ]]-Tabla22[[#This Row],[FECHA DE TERMINACIÓN2]]","v":0}]
["CUNDINAMARCA","SECRETARIA DE CIENCIA, TECNOLOGIA E INNOVACIÓN","ALEXANDER RIVEROS Y YAHIR ARCINIEGAS","LUIS MANUEL GONZALEZ",2017000100074,"IMPLEMENTACIÓN DE ESTRATEGIAS DE FOMENTO A LA CULTURA Y SERVICIOS DE INNOVACIÓN EN LAS PROVINCIAS SABANA OCCIDENTE, SABANA CENTRAL, SOACHA Y SUMAPAZ CUNDINAMARCA","CTEL",6183633276,"TERMINADO",44592,{"$f":"VLOOKUP(Tabla22[[#This Row],[BPIN ]],[1]Base1!F$3:Z$223,21,0)","v":44592},45012,{"$f":"Tabla22[[#This Row],[FECHA ]]-Tabla22[[#This Row],[HOY]]","v":-420},{"$f":"Tabla22[[#This Row],[FECHA ]]-Tabla22[[#This Row],[FECHA DE TERMINACIÓN2]]","v":0}]
["CUNDINAMARCA","SECRETARIA DE CIENCIA, TECNOLOGIA E INNOVACIÓN","ALEXANDER RIVEROS Y YAHIR ARCINIEGAS","LUIS MANUEL GONZALEZ",2017000100076,"FORTALECIMIENTO DE CAPACIDADES DE GESTIÓN DEL RIESGO A TRAVÉS DE APROPIACIÓN SOCIAL DE LA CIENCIA, LA TECNOLOGÍA Y LA INNOVACIÓN EN EL DEPARTAMENTO DE CUNDINAMARCA","CTEL",4404970720,"CONTRATADO EN EJECUCIÓN",44895,{"$f":"VLOOKUP(Tabla22[[#This Row],[BPIN ]],[1]Base1!F$3:Z$223,21,0)","v":44895},45012,{"$f":"Tabla22[[#This Row],[FECHA ]]-Tabla22[[#This Row],[HOY]]","v":-117},{"$f":"Tabla22[[#This Row],[FECHA ]]-Tabla22[[#This Row],[FECHA DE TERMINACIÓN2]]","v":0}]
["CUNDINAMARCA","SECRETARIA DE CIENCIA, TECNOLOGIA E INNOVACIÓN","ALEXANDER RIVEROS Y YAHIR ARCINIEGAS","LUIS MANUEL GONZALEZ",2017000100087,"FORMACIÓN DE TALENTO HUMANO DE ALTO NIVEL EN MAESTRÍAS EN EL DEPARTAMENTO DE CUNDINAMARCA","CTEL",5148022960,"CONTRATADO EN EJECUCIÓN",45747,{"$f":"VLOOKUP(Tabla22[[#This Row],[BPIN ]],[1]Base1!F$3:Z$223,21,0)","v":45747},45012,{"$f":"Tabla22[[#This Row],[FECHA ]]-Tabla22[[#This Row],[HOY]]","v":735},{"$f":"Tabla22[[#This Row],[FECHA ]]-Tabla22[[#This Row],[FECHA DE TERMINACIÓN2]]","v":0}]
["CUNDINAMARCA","SECRETARIA DE CIENCIA, TECNOLOGIA E INNOVACIÓN","ALEXANDER RIVEROS Y YAHIR ARCINIEGAS","LUIS MANUEL GONZALEZ",2017000100104,"FORTALECIMIENTO DE LA CULTURA DE LA GESTIÓN Y UTILIZACIÓN DEL CONOCIMIENTO EN CTEI EN NIÑOS, JÓVENES Y COMUNIDADES DEL DEPARTAMENTO DE CUNDINAMARCA","CTEL",9498967749,"CONTRATADO EN EJECUCIÓN",44926,{"$f":"VLOOKUP(Tabla22[[#This Row],[BPIN ]],[1]Base1!F$3:Z$223,21,0)","v":44926},45012,{"$f":"Tabla22[[#This Row],[FECHA ]]-Tabla22[[#This Row],[HOY]]","v":-86},{"$f":"Tabla22[[#This Row],[FECHA ]]-Tabla22[[#This Row],[FECHA DE TERMINACIÓN2]]","v":0}]
["CUNDINAMARCA","UNIDAD ADMINISTRATIVA DE GESTIÓN DEL RIESGO.","DIEGO TORRES/VALENTINA PORTILLO","GINNA HERRERA",20172401060022,"ESTUDIOS DETALLADOS PARA LA INCORPORACIÓN DE LA GESTIÓN DEL RIESGO PARA LOS MUNICIPIOS DE GIRARDOT, RICAURTE","AMBIENTE Y DESARROLLO SOSTENIBLE",3084907873,"CONTRATADO EN EJECUCIÓN",44773,{"$f":"VLOOKUP(Tabla22[[#This Row],[BPIN ]],[1]Base1!F$3:Z$223,21,0)","v":44773},45012,{"$f":"Tabla22[[#This Row],[FECHA ]]-Tabla22[[#This Row],[HOY]]","v":-239},{"$f":"Tabla22[[#This Row],[FECHA ]]-Tabla22[[#This Row],[FECHA DE TERMINACIÓN2]]","v":0}]
["CUNDINAMARCA","SECRETARIA DE CIENCIA, TECNOLOGIA E INNOVACIÓN","ALEXANDER RIVEROS Y YAHIR ARCINIEGAS","LUIS MANUEL GONZALEZ",20170000100012,"CONFORMACIÓN DE UNA CONVOCATORIA REGIONAL DE PROYECTOS I+D EN FOCOS PRIORIZADOS CTEI PARA EL FORTALECIMIENTO DE LOS GRUPOS DE INVESTIGACIÓN CUNDINAMARCA","CTEL",7321934035,"CONTRATADO EN EJECUCIÓN",44926,{"$f":"VLOOKUP(Tabla22[[#This Row],[BPIN ]],[1]Base1!F$3:Z$223,21,0)","v":44926},45012,{"$f":"Tabla22[[#This Row],[FECHA ]]-Tabla22[[#This Row],[HOY]]","v":-86},{"$f":"Tabla22[[#This Row],[FECHA ]]-Tabla22[[#This Row],[FECHA DE TERMINACIÓN2]]","v":0}]
["ENTIDAD APORTANTE RECURSOS","CAR","YESID CASTAÑO","CARLOS MURCIA",2017000050063,"RECUPERACIÓN HIDRÁULICA Y AMBIENTAL DEL COMPLEJO LAGUNAR  FÚQUENE","AMBIENTE Y DESARROLLO SOSTENIBLE",18000000000,"CONTRATADO EN EJECUCIÓN",45199,{"$f":"VLOOKUP(Tabla22[[#This Row],[BPIN ]],[1]Base1!F$3:Z$223,21,0)","v":45199},45012,{"$f":"Tabla22[[#This Row],[FECHA ]]-Tabla22[[#This Row],[HOY]]","v":187},{"$f":"Tabla22[[#This Row],[FECHA ]]-Tabla22[[#This Row],[FECHA DE TERMINACIÓN2]]","v":0}]
["ENTIDAD APORTANTE RECURSOS","MUNICIPIO DE UTICA","JUAN CARLOS TORRES","CESAR SIMANCAS",2017000050087,"MEJORAMIENTO DEL SENDERO TURÍSTICO DE LA PROVINCIA DEL GUALIVÁ  – ÚTICA  CUNDINAMARCA","COMERCIO, INDUSTRIA Y TURISMO ",2347004868,"CONTRATADO EN EJECUCIÓN",44530,{"$f":"VLOOKUP(Tabla22[[#This Row],[BPIN ]],[1]Base1!F$3:Z$223,21,0)","v":44530},45012,{"$f":"Tabla22[[#This Row],[FECHA ]]-Tabla22[[#This Row],[HOY]]","v":-482},{"$f":"Tabla22[[#This Row],[FECHA ]]-Tabla22[[#This Row],[FECHA DE TERMINACIÓN2]]","v":0}]
["CUNDINAMARCA","SECRETARIA DE HABITAT Y VIVIENDA","ALEXANDER RIVEROS/JEIMY FORERO","BEATRIZ GAMEZ",2018000050039,"MEJORAMIENTO DE VIVIENDA RURAL EN LOS MUNICIPIOS DE CUCUNUBÁ, JERUSALEN, QUEBRADANEGRA Y VIOTÁ - DEPARTAMENTO DE CUNDINAMARCA","AGRICULTURA ",4024793625,"PARA CIERRE",44561,{"$f":"VLOOKUP(Tabla22[[#This Row],[BPIN ]],[1]Base1!F$3:Z$223,21,0)","v":"31/12/2021\n"},45012,{"$f":"Tabla22[[#This Row],[FECHA ]]-Tabla22[[#This Row],[HOY]]","v":-451},{"$f":"Tabla22[[#This Row],[FECHA ]]-Tabla22[[#This Row],[FECHA DE TERMINACIÓN2]]","v":{"$error":"#VALUE!"}}]
["CUNDINAMARCA","SECRETARIA DE CIENCIA, TECNOLOGIA E INNOVACIÓN","ALEXANDER RIVEROS Y YAHIR ARCINIEGAS","LUIS MANUEL GONZALEZ",2018000100106,"INNOVACIÓN EN EL MODELO DE GESTIÓN DEL MEDICAMENTO FASE III EN EL DEPARTAMENTO DE  CUNDINAMARCA","CTEL",3452890062,"NO HA MIGRADO A GESPROY",null,{"$f":"VLOOKUP(Tabla22[[#This Row],[BPIN ]],[1]Base1!F$3:Z$223,21,0)","v":0},45012,{"$f":"Tabla22[[#This Row],[FECHA ]]-Tabla22[[#This Row],[HOY]]","v":-45012},{"$f":"Tabla22[[#This Row],[FECHA ]]-Tabla22[[#This Row],[FECHA DE TERMINACIÓN2]]","v":0}]
["CUNDINAMARCA","SECRETARIA DE CIENCIA, TECNOLOGIA E INNOVACIÓN","ALEXANDER RIVEROS Y YAHIR ARCINIEGAS","LUIS MANUEL GONZALEZ",2018000100160,"FORMACIÓN DE CAPITAL HUMANO DE ALTO NIVEL PARA LA INVESTIGACIÓN, EL DESARROLLO TECNOLÓGICO Y LA INNOVACIÓN MAESTRÍAS DE INVESTIGACIÓN PARA DOCENTES DEL DEPARTAMENTO DE CUNDINAMARCA","CTEL",5217415747,"CONTRATADO EN EJECUCIÓN",47087,{"$f":"VLOOKUP(Tabla22[[#This Row],[BPIN ]],[1]Base1!F$3:Z$223,21,0)","v":"30/11/2027\n"},45012,{"$f":"Tabla22[[#This Row],[FECHA ]]-Tabla22[[#This Row],[HOY]]","v":2075},{"$f":"Tabla22[[#This Row],[FECHA ]]-Tabla22[[#This Row],[FECHA DE TERMINACIÓN2]]","v":{"$error":"#VALUE!"}}]
["ENTIDAD DESIGNADA PARA LA SUPERVISIÓN DEL PROYECTO O PARA CONTRATAR LA INTERVENTORÍA","EMPRESAS PUBLICAS DE CUNDINAMARCA -EPC","ALEXANDER RIVEROS/LIYUGETH ALFONSO","PAULA ACUÑA",20181301010555,"CONSTRUCCIÓN DE UNIDADES SANITARIAS EN EL ÁREA RURAL DEL DEPARTAMENTO DE CUNDINAMARCA","VIVIENDA, CIUDAD Y TERRITORIO ",4999900475,"CONTRATADO EN EJECUCIÓN",44712,{"$f":"VLOOKUP(Tabla22[[#This Row],[BPIN ]],[1]Base1!F$3:Z$223,21,0)","v":"31/05/2022\n"},45012,{"$f":"Tabla22[[#This Row],[FECHA ]]-Tabla22[[#This Row],[HOY]]","v":-300},{"$f":"Tabla22[[#This Row],[FECHA ]]-Tabla22[[#This Row],[FECHA DE TERMINACIÓN2]]","v":{"$error":"#VALUE!"}}]
["CUNDINAMARCA","SECRETARIA DE EDUCACIÓN","YAHIR ARCINIEGAS Y ALEXANDER RIVEROS","PABLO CAJAMARCA",2019000050020,"FORTALECIMIENTO DE LA PERMANENCIA DE LOS ESTUDIANTES PARA EL AÑO 2019 EN LOS MUNICIPIOS DEL DEPARTAMENTO DE CUNDINAMARCA","EDUCACIÓN",20536293937,"TERMINADO",43769,{"$f":"VLOOKUP(Tabla22[[#This Row],[BPIN ]],[1]Base1!F$3:Z$223,21,0)","v":"31/10/2019\n"},45012,{"$f":"Tabla22[[#This Row],[FECHA ]]-Tabla22[[#This Row],[HOY]]","v":-1243},{"$f":"Tabla22[[#This Row],[FECHA ]]-Tabla22[[#This Row],[FECHA DE TERMINACIÓN2]]","v":{"$error":"#VALUE!"}}]
["CUNDINAMARCA","SECRETARIA DE AGRICULTURA","DIEGO TORRES/VALENTINA PORTILLO","JAVIER HERREDIA",2019000050027," MEJORAMIENTO DE LA COMPETITIVIDAD  DE LA CADENA PRODUCTIVA DE CACAO EN EL DEPARTAMENTO DE CUNDINAMARCA","AGRICULTURA ",5862983962,"TERMINADO",44651,{"$f":"VLOOKUP(Tabla22[[#This Row],[BPIN ]],[1]Base1!F$3:Z$223,21,0)","v":"31/03/2022\n"},45012,{"$f":"Tabla22[[#This Row],[FECHA ]]-Tabla22[[#This Row],[HOY]]","v":-361},{"$f":"Tabla22[[#This Row],[FECHA ]]-Tabla22[[#This Row],[FECHA DE TERMINACIÓN2]]","v":{"$error":"#VALUE!"}}]
["ENTIDAD APORTANTE RECURSOS","MEDICINA LEGAL Y CIENCIAS FORENSES","ALEXANDER RIVEROS","MARTIN SEPULVEDA",2019000050025,"ESTUDIOS Y DISEÑOS PARA LA CONSTRUCCIÓN DE LA SEDE DE MEDICINA LEGAL EN EL DEPARTAMENTO DE CUNDINAMARCA","FISCALIA",904521100,"CONTRATADO EN EJECUCIÓN",44620,{"$f":"VLOOKUP(Tabla22[[#This Row],[BPIN ]],[1]Base1!F$3:Z$223,21,0)","v":"28/02/2022\n"},{"$f":"+TODAY()","v":45012},{"$f":"Tabla22[[#This Row],[FECHA ]]-Tabla22[[#This Row],[HOY]]","v":-392},{"$f":"Tabla22[[#This Row],[FECHA ]]-Tabla22[[#This Row],[FECHA DE TERMINACIÓN2]]","v":{"$error":"#VALUE!"}}]
["DECENTRALIZADOS","IDECUT","DIEGO TORRES Y YAHIR ARCINIEGAS","MARTHA VANEGAS",2019000050059,"FORTALECIMIENTO A LAS ESCUELAS MUNICIPALES DE MÚSICA, DANZA, TEATRO Y ARTES PLÁSTICAS Y VISUALES EN EL DEPARTAMENTO DE CUNDINAMARCA","CULTURA ",1972606058,"TERMINADO",44530,{"$f":"VLOOKUP(Tabla22[[#This Row],[BPIN ]],[1]Base1!F$3:Z$223,21,0)","v":44530},45012,{"$f":"Tabla22[[#This Row],[FECHA ]]-Tabla22[[#This Row],[HOY]]","v":-482},{"$f":"Tabla22[[#This Row],[FECHA ]]-Tabla22[[#This Row],[FECHA DE TERMINACIÓN2]]","v":0}]
["CUNDINAMARCA","SECRETARIA DE MINAS, ENERGIA Y GAS","DIEGO TORRES / LIYUGETH ALFONSO","JAHIR HERNANDEZ",2019000050073,"AMPLIACIÓN DE LA COBERTURA DEL SERVICIO DE GAS COMBUSTIBLE DOMICILIARIO A TRAVÉS DE LA FINANCIACIÓN DE LA CONEXIÓN Y LA RED INTERNA PARA USUARIOS DE BARRIOS PERIFÉRICOS, VEREDAS Y CENTROS POBLADOS DEL DEPARTAMENTO DE CUNDINAMARCA","MINAS Y ENERGÍA",12461377100,"CONTRATADO EN EJECUCIÓN",44530,{"$f":"VLOOKUP(Tabla22[[#This Row],[BPIN ]],[1]Base1!F$3:Z$223,21,0)","v":"30/11/2021\n"},45012,{"$f":"Tabla22[[#This Row],[FECHA ]]-Tabla22[[#This Row],[HOY]]","v":-482},{"$f":"Tabla22[[#This Row],[FECHA ]]-Tabla22[[#This Row],[FECHA DE TERMINACIÓN2]]","v":{"$error":"#VALUE!"}}]
["ENTIDAD APORTANTE RECURSOS","UNAD","ALEXANDER RIVEROS","ANDRES ACOSTA",2019000050069,"MEJORAMIENTO DE INFRAESTRUCTURA FÍSICA, DOTACIÓN DE MOBILIARIO Y EQUIPAMIENTO TECNOLÓGICO DE LA UNIVERSIDAD NACIONAL ABIERTA Y A DISTANCIA EN MUNICIPIOS DEL DEPARTAMENTO DE CUNDINAMARCA","EDUCACIÓN",16011115461,"TERMINADO",44165,{"$f":"VLOOKUP(Tabla22[[#This Row],[BPIN ]],[1]Base1!F$3:Z$223,21,0)","v":"30/11/2020\n"},45012,{"$f":"Tabla22[[#This Row],[FECHA ]]-Tabla22[[#This Row],[HOY]]","v":-847},{"$f":"Tabla22[[#This Row],[FECHA ]]-Tabla22[[#This Row],[FECHA DE TERMINACIÓN2]]","v":{"$error":"#VALUE!"}}]
["ENTIDAD APORTANTE RECURSOS","U TECNOLOGICA DE PEREIRA","YAHIR ARCINIEGAS","LUIS MANUEL GONZALEZ",2019000100009,"FORMACIÓN DE CAPITAL HUMANO DE ALTO NIVEL UNIVERSIDAD TECNOLÓGICA DE PEREIRA  NACIONAL","CTEL",4360028215,"CONTRATADO EN EJECUCIÓN",46784,{"$f":"VLOOKUP(Tabla22[[#This Row],[BPIN ]],[1]Base1!F$3:Z$223,21,0)","v":"10/02/2028\n"},45012,{"$f":"Tabla22[[#This Row],[FECHA ]]-Tabla22[[#This Row],[HOY]]","v":1772},{"$f":"Tabla22[[#This Row],[FECHA ]]-Tabla22[[#This Row],[FECHA DE TERMINACIÓN2]]","v":{"$error":"#VALUE!"}}]
["ENTIDAD APORTANTE RECURSOS","U EAN","YAHIR ARCINIEGAS","LUIS MANUEL GONZALEZ",2019000100015,"FORMACIÓN DE CAPITAL HUMANO DE ALTO NIVEL - UNIVERSIDAD EAN -  NACIONAL","CTEL",1294375000,"CONTRATADO EN EJECUCIÓN",46964,{"$f":"VLOOKUP(Tabla22[[#This Row],[BPIN ]],[1]Base1!F$3:Z$223,21,0)","v":"30/07/2028\n"},45012,{"$f":"Tabla22[[#This Row],[FECHA ]]-Tabla22[[#This Row],[HOY]]","v":1952},{"$f":"Tabla22[[#This Row],[FECHA ]]-Tabla22[[#This Row],[FECHA DE TERMINACIÓN2]]","v":{"$error":"#VALUE!"}}]
["ENTIDAD APORTANTE RECURSOS","U CATOLICA","YAHIR ARCINIEGAS","LUIS MANUEL GONZALEZ",2019000100022,"FORMACIÓN DE CAPITAL HUMANO DE ALTO NIVEL - UNIVERSIDAD CATÓLICA DE COLOMBIA -  NACIONAL","CTEL",343595000,"CONTRATADO EN EJECUCIÓN",46904,{"$f":"VLOOKUP(Tabla22[[#This Row],[BPIN ]],[1]Base1!F$3:Z$223,21,0)","v":"31/05/2028\n"},45012,{"$f":"Tabla22[[#This Row],[FECHA ]]-Tabla22[[#This Row],[HOY]]","v":1892},{"$f":"Tabla22[[#This Row],[FECHA ]]-Tabla22[[#This Row],[FECHA DE TERMINACIÓN2]]","v":{"$error":"#VALUE!"}}]
["ENTIDAD APORTANTE RECURSOS","UNIVERSIDAD MILITAR NUEVA GRANADA","YAHIR ARCINIEGAS","LUIS MANUEL GONZALEZ",2019000100025,"FORMACIÓN DE CAPITAL HUMANO DE ALTO NIVEL UNIVERSIDAD MILITAR NUEVA GRANADA  NACIONAL","CTEL",294375000,"CONTRATADO EN EJECUCIÓN",46752,{"$f":"VLOOKUP(Tabla22[[#This Row],[BPIN ]],[1]Base1!F$3:Z$223,21,0)","v":"31/12/2027\n"},45012,{"$f":"Tabla22[[#This Row],[FECHA ]]-Tabla22[[#This Row],[HOY]]","v":1740},{"$f":"Tabla22[[#This Row],[FECHA ]]-Tabla22[[#This Row],[FECHA DE TERMINACIÓN2]]","v":{"$error":"#VALUE!"}}]
["ENTIDAD APORTANTE RECURSOS","UNIVERSIDAD NACIONAL DE COLOMBIA","YAHIR ARCINIEGAS","LUIS MANUEL GONZALEZ",2019000100026,"FORMACIÓN DE CAPITAL HUMANO DE ALTO NIVEL UNIVERSIDAD NACIONAL DE COLOMBIA   NACIONAL","CTEL",21162064500,"CONTRATADO EN EJECUCIÓN",46904,{"$f":"VLOOKUP(Tabla22[[#This Row],[BPIN ]],[1]Base1!F$3:Z$223,21,0)","v":"31/05/2028\n"},45012,{"$f":"Tabla22[[#This Row],[FECHA ]]-Tabla22[[#This Row],[HOY]]","v":1892},{"$f":"Tabla22[[#This Row],[FECHA ]]-Tabla22[[#This Row],[FECHA DE TERMINACIÓN2]]","v":{"$error":"#VALUE!"}}]
["ENTIDAD APORTANTE RECURSOS","U DISTRITAL","YAHIR ARCINIEGAS","LUIS MANUEL GONZALEZ",2019000100027,"FORMACIÓN DE CAPITAL HUMANO DE ALTO NIVEL EN DOCTORADO PARA EL DESARROLLO REGIONAL, UNIVERSIDAD DISTRITAL FRANCISCO JOSÉ DE CALDAS, A NIVEL  NACIONAL","CTEL",1218668841,"CONTRATADO EN EJECUCIÓN",46899,{"$f":"VLOOKUP(Tabla22[[#This Row],[BPIN ]],[1]Base1!F$3:Z$223,21,0)","v":"26/05/2028\n"},45012,{"$f":"Tabla22[[#This Row],[FECHA ]]-Tabla22[[#This Row],[HOY]]","v":1887},{"$f":"Tabla22[[#This Row],[FECHA ]]-Tabla22[[#This Row],[FECHA DE TERMINACIÓN2]]","v":{"$error":"#VALUE!"}}]
["ENTIDAD APORTANTE RECURSOS","U JAVERIANA","YAHIR ARCINIEGAS","LUIS MANUEL GONZALEZ",2019000100028,"FORMACIÓN DE CAPITAL HUMANO DE ALTO NIVEL PONTIFICIA UNIVERSIDAD JAVERIANA SEDE CENTRAL  NACIONAL","CTEL",6524500000,"CONTRATADO EN EJECUCIÓN",46921,{"$f":"VLOOKUP(Tabla22[[#This Row],[BPIN ]],[1]Base1!F$3:Z$223,21,0)","v":"17/06/2028\n"},45012,{"$f":"Tabla22[[#This Row],[FECHA ]]-Tabla22[[#This Row],[HOY]]","v":1909},{"$f":"Tabla22[[#This Row],[FECHA ]]-Tabla22[[#This Row],[FECHA DE TERMINACIÓN2]]","v":{"$error":"#VALUE!"}}]
["ENTIDAD APORTANTE RECURSOS","U DE LOS ANDES","YAHIR ARCINIEGAS","LUIS MANUEL GONZALEZ",2019000100036,"FORMACIÓN  DE CAPITAL HUMANO DE ALTO NIVEL UNIVERSIDAD DE LOS ANDES   NACIONAL","CTEL",2814671307,"CONTRATADO EN EJECUCIÓN",46828,{"$f":"VLOOKUP(Tabla22[[#This Row],[BPIN ]],[1]Base1!F$3:Z$223,21,0)","v":"16/03/2028\n"},45012,{"$f":"Tabla22[[#This Row],[FECHA ]]-Tabla22[[#This Row],[HOY]]","v":1816},{"$f":"Tabla22[[#This Row],[FECHA ]]-Tabla22[[#This Row],[FECHA DE TERMINACIÓN2]]","v":{"$error":"#VALUE!"}}]
["ENTIDAD APORTANTE RECURSOS","UNIVERSIDAD NACIONAL DE COLOMBIA","YAHIR ARCINIEGAS","LUIS MANUEL GONZALEZ",2019000100061,"FORTALECIMIENTO DE LA CAPACIDAD TECNOLÓGICA INSTALADA EN EL CENTRO AGROPECUARIO MARENGO PARA LA INVESTIGACIÓN EN LOS SISTEMAS AGROPRODUCTIVOS DEL TRÓPICO ALTO, BAJO EL EFECTO DE LA VARIABILIDAD Y CAMBIO CLIMÁTICO -  CUNDINAMARCA","CTEL",2386591598.0999999,"CONTRATADO EN EJECUCIÓN",44739,{"$f":"VLOOKUP(Tabla22[[#This Row],[BPIN ]],[1]Base1!F$3:Z$223,21,0)","v":"27/06/2022\n"},45012,{"$f":"Tabla22[[#This Row],[FECHA ]]-Tabla22[[#This Row],[HOY]]","v":-273},{"$f":"Tabla22[[#This Row],[FECHA ]]-Tabla22[[#This Row],[FECHA DE TERMINACIÓN2]]","v":{"$error":"#VALUE!"}}]
["CUNDINAMARCA","SECRETARIA DE CIENCIA, TECNOLOGIA E INNOVACIÓN","ALEXANDER RIVEROS Y YAHIR ARCINIEGAS","LUIS MANUEL GONZALEZ",2020000100137,"FORTALECIMIENTO DE LAS CAPACIDADES DE INVESTIGACIÓN Y DESARROLLO PARA ATENDER PROBLEMÁTICAS ASOCIADAS CON AGENTES BIOLÓGICOS PARA LA SALUD PÚBLICA, A TRAVÉS DEL MEJORAMIENTO DEL LABORATORIO DE SALUD PÚBLICA DE CUNDINAMARCA","CTEL",4506359274,"CONTRATADO EN EJECUCIÓN",44677,{"$f":"VLOOKUP(Tabla22[[#This Row],[BPIN ]],[1]Base1!F$3:Z$223,21,0)","v":"26/04/2022\n"},45012,{"$f":"Tabla22[[#This Row],[FECHA ]]-Tabla22[[#This Row],[HOY]]","v":-335},{"$f":"Tabla22[[#This Row],[FECHA ]]-Tabla22[[#This Row],[FECHA DE TERMINACIÓN2]]","v":{"$error":"#VALUE!"}}]
["CUNDINAMARCA","SECRETARIA DE SALUD","DAYANA FERNANDEZ/ LIYUGETH ALFONSO","OLGA LUCIA GARZON",2020000050003,"ADQUISICIÓN DE AMBULANCIAS,EQUIPOS BIOMÉDICOS, ELEMENTOS DE PROTECCIÓN PERSONAL, ASEO Y DESINFECCIÓN PARA LA ATENCIÓN DE LA CALAMIDAD SANITARIA POR COVID-19 EN LAS E.S.E DEL DEPARTAMENTO DE   CUNDINAMARCA","SALUD Y PROTECCIÓN SOCIAL",43433295564,"CONTRATADO EN EJECUCIÓN",44742,{"$f":"VLOOKUP(Tabla22[[#This Row],[BPIN ]],[1]Base1!F$3:Z$223,21,0)","v":"30/06/2022\n"},45012,{"$f":"Tabla22[[#This Row],[FECHA ]]-Tabla22[[#This Row],[HOY]]","v":-270},{"$f":"Tabla22[[#This Row],[FECHA ]]-Tabla22[[#This Row],[FECHA DE TERMINACIÓN2]]","v":{"$error":"#VALUE!"}}]
["CUNDINAMARCA","SECRETARIA DE EDUCACIÓN","YAHIR ARCINIEGAS Y ALEXANDER RIVEROS","GENNY PADILLA",2020000050019,"FORTALECIMIENTO A LA ESTRATEGIA DE ALIMENTACIÓN ESCOLAR PARA EL AÑO 2020, EN LOS MUNICIPIOS DEL DEPARTAMENTO DE CUNDINAMARCA ","EDUCACIÓN",26240955000,"PARA CIERRE",44178,{"$f":"VLOOKUP(Tabla22[[#This Row],[BPIN ]],[1]Base1!F$3:Z$223,21,0)","v":"13/12/2020\n"},45012,{"$f":"Tabla22[[#This Row],[FECHA ]]-Tabla22[[#This Row],[HOY]]","v":-834},{"$f":"Tabla22[[#This Row],[FECHA ]]-Tabla22[[#This Row],[FECHA DE TERMINACIÓN2]]","v":{"$error":"#VALUE!"}}]
["CUNDINAMARCA","SECRETARIA DE CIENCIA, TECNOLOGIA E INNOVACIÓN","ALEXANDER RIVEROS Y YAHIR ARCINIEGAS","LUIS MANUEL GONZALEZ",2020000100266,"GENERACIÓN DE ESPACIOS DE ENCUENTRO DE LA SOCIEDAD CON LA CIENCIA Y LA TECNOLOGÍA - UN VIAJE CON LA CIENCIA EN EL DEPARTAMENTO DE CUNDINAMARCA","CTEL",2241429590,"CONTRATADO EN EJECUCIÓN",44929,{"$f":"VLOOKUP(Tabla22[[#This Row],[BPIN ]],[1]Base1!F$3:Z$223,21,0)","v":"03/01/2023\n"},45012,{"$f":"Tabla22[[#This Row],[FECHA ]]-Tabla22[[#This Row],[HOY]]","v":-83},{"$f":"Tabla22[[#This Row],[FECHA ]]-Tabla22[[#This Row],[FECHA DE TERMINACIÓN2]]","v":{"$error":"#VALUE!"}}]
["CUNDINAMARCA","SECRETARIA DE CIENCIA, TECNOLOGIA E INNOVACIÓN","ALEXANDER RIVEROS Y YAHIR ARCINIEGAS","LUIS MANUEL GONZALEZ",2020000100246,"FORTALECIMIENTO DE LA COMPETITIVIDAD DE LA CADENA PRODUCTIVA DE LA GUADUA POR MEDIO DEL DESARROLLO E IMPLEMENTACIÓN DE DOS (2) PAQUETES TECNOLÓGICOS PARA LA GENERACIÓN DE PRODUCTOS CON VALOR AGREGADO EN EL DEPARTAMENTO DE CUNDINAMARCA ","CTEL",3144525520,"CONTRATADO EN EJECUCIÓN",45120,{"$f":"VLOOKUP(Tabla22[[#This Row],[BPIN ]],[1]Base1!F$3:Z$223,21,0)","v":"13/07/2023\n"},45012,{"$f":"Tabla22[[#This Row],[FECHA ]]-Tabla22[[#This Row],[HOY]]","v":108},{"$f":"Tabla22[[#This Row],[FECHA ]]-Tabla22[[#This Row],[FECHA DE TERMINACIÓN2]]","v":{"$error":"#VALUE!"}}]
["ENTIDAD APORTANTE RECURSOS","CONNECT BOGOTA REGIÓN","YAHIR ARCINIEGAS","LUIS MANUEL GONZALEZ",2020000100078,"DISEÑO E IMPLEMENTACIÓN DE UN MODELO DE GESTIÓN DE CONOCIMIENTO, INNOVACIÓN Y TRANSFERENCIA DE TECNOLOGÍA CON APLICACIÓN EN EL SECTOR AGROPECUARIO Y AGROINDUSTRIAL EN EL DEPARTAMENTO DE CUNDINAMARCA ","CTEL",3309848753,"CONTRATADO EN EJECUCIÓN",45473,{"$f":"VLOOKUP(Tabla22[[#This Row],[BPIN ]],[1]Base1!F$3:Z$223,21,0)","v":"30/06/2024\n"},45012,{"$f":"Tabla22[[#This Row],[FECHA ]]-Tabla22[[#This Row],[HOY]]","v":461},{"$f":"Tabla22[[#This Row],[FECHA ]]-Tabla22[[#This Row],[FECHA DE TERMINACIÓN2]]","v":{"$error":"#VALUE!"}}]
["ENTIDAD APORTANTE RECURSOS","FEDERACIÓN NACIONAL DE CAFETEROS","YAHIR ARCINIEGAS","LUIS MANUEL GONZALEZ",2020000100205,"TRASLADO DE TECNOLOGÍAS INNOVADORAS A CAFICULTORES CON IMPACTO SOBRE LA CALIDAD DEL CAFÉ Y LA GESTIÓN DEL RECURSO HÍDRICO DURANTE EL PROCESO DE BENEFICIO EN ZONA CAFETERA DEL DEPARTAMENTO DE CUNDINAMARCA ","CTEL",13783557324,"CONTRATADO EN EJECUCIÓN",45629,{"$f":"VLOOKUP(Tabla22[[#This Row],[BPIN ]],[1]Base1!F$3:Z$223,21,0)","v":"03/12/2024\n"},45012,{"$f":"Tabla22[[#This Row],[FECHA ]]-Tabla22[[#This Row],[HOY]]","v":617},{"$f":"Tabla22[[#This Row],[FECHA ]]-Tabla22[[#This Row],[FECHA DE TERMINACIÓN2]]","v":{"$error":"#VALUE!"}}]
["ENTIDAD APORTANTE RECURSOS","AGROSAVIA","YAHIR ARCINIEGAS","LUIS MANUEL GONZALEZ",2020000100197,"DESARROLLO DE BIOPLAGUICIDAS POTENCIADOS DE NUEVA GENERACIÓN PARA EL MEJORAMIENTO DE LA PRODUCTIVIDAD E INOCUIDAD DEL CULTIVO DE TOMATE Y CRUCÍFERAS EN EL DEPARTAMENTO DE CUNDINAMARCA ","CTEL",4583970033,"CONTRATADO EN EJECUCIÓN",46112,{"$f":"VLOOKUP(Tabla22[[#This Row],[BPIN ]],[1]Base1!F$3:Z$223,21,0)","v":"31/03/2026\n"},45012,{"$f":"Tabla22[[#This Row],[FECHA ]]-Tabla22[[#This Row],[HOY]]","v":1100},{"$f":"Tabla22[[#This Row],[FECHA ]]-Tabla22[[#This Row],[FECHA DE TERMINACIÓN2]]","v":{"$error":"#VALUE!"}}]
["ENTIDAD APORTANTE RECURSOS","UNIVERSIDAD NACIONAL DE COLOMBIA","YAHIR ARCINIEGAS","LUIS MANUEL GONZALEZ",2020000100240,"ESTUDIO DE PREFACTIBILIDAD PARA LA CREACIÓN DE UN CENTRO DE INNOVACIÓN Y DE PRODUCTIVIDAD PARA EL SECTOR AGROPECUARIO DE SABANA OCCIDENTE DE CUNDINAMARCA ","CTEL",1896154229,"CONTRATADO EN EJECUCIÓN",44926,{"$f":"VLOOKUP(Tabla22[[#This Row],[BPIN ]],[1]Base1!F$3:Z$223,21,0)","v":"31/12/2022\n"},45012,{"$f":"Tabla22[[#This Row],[FECHA ]]-Tabla22[[#This Row],[HOY]]","v":-86},{"$f":"Tabla22[[#This Row],[FECHA ]]-Tabla22[[#This Row],[FECHA DE TERMINACIÓN2]]","v":{"$error":"#VALUE!"}}]
["ENTIDAD APORTANTE RECURSOS","UNIVERSIDAD DE CUNDINAMARCA","YAHIR ARCINIEGAS","LUIS MANUEL GONZALEZ",2020000100158,"FORTALECIMIENTO DE LA INFRAESTRUCTURA FÍSICA Y TECNOLÓGICA DEL CENTRO DE ESTUDIOS AGROAMBIENTALES DE LA UNIVERSIDAD DE CUNDINAMARCA AGROU CUNDINAMARCA ","CTEL",2024433669,"SIN CONTRATAR",null,{"$f":"VLOOKUP(Tabla22[[#This Row],[BPIN ]],[1]Base1!F$3:Z$223,21,0)","v":45489},45012,{"$f":"Tabla22[[#This Row],[FECHA ]]-Tabla22[[#This Row],[HOY]]","v":-45012},{"$f":"Tabla22[[#This Row],[FECHA ]]-Tabla22[[#This Row],[FECHA DE TERMINACIÓN2]]","v":-45489}]
["ENTIDAD APORTANTE RECURSOS","ZIPAQUIRA","YESID CASTAÑO / JEIMY FORERO",null,2020000050013,"Mejoramiento de la vía que comunica a los municipios de Zipaquirá y Tocancipá, tramo barandillas - la fuente, departamento de Cundinamarca","TRANSPORTE","6.788.620.869,00","CONTRATADO EN EJECUCIÓN",44709,{"$f":"VLOOKUP(Tabla22[[#This Row],[BPIN ]],[1]Base1!F$3:Z$223,21,0)","v":"28/05/2022\n"},45012,{"$f":"Tabla22[[#This Row],[FECHA ]]-Tabla22[[#This Row],[HOY]]","v":-303},{"$f":"Tabla22[[#This Row],[FECHA ]]-Tabla22[[#This Row],[FECHA DE TERMINACIÓN2]]","v":{"$error":"#VALUE!"}}]
["ENTIDAD APORTANTE RECURSOS","ZIPAQUIRA","YESID CASTAÑO / JEIMY FORERO",null,2020000050015,"MEJORAMIENTO DE LA VÍA ZIPAQUIRÁ - SAN JORGE - TABIO DEPARTAMENTO DE CUNDINAMARCA","TRANSPORTE",7458735075,"CONTRATADO EN EJECUCIÓN",44920,{"$f":"VLOOKUP(Tabla22[[#This Row],[BPIN ]],[1]Base1!F$3:Z$223,21,0)","v":"25/12/2022\n"},45012,{"$f":"Tabla22[[#This Row],[FECHA ]]-Tabla22[[#This Row],[HOY]]","v":-92},{"$f":"Tabla22[[#This Row],[FECHA ]]-Tabla22[[#This Row],[FECHA DE TERMINACIÓN2]]","v":{"$error":"#VALUE!"}}]
["CUNDINAMARCA","SECRETARIA DE CIENCIA, TECNOLOGIA E INNOVACIÓN","ALEXANDER RIVEROS Y YAHIR ARCINIEGAS","LUIS MANUEL GONZALEZ",2020000100695,"DESARROLLO, TRANSFERENCIA DE TECNOLOGÍA Y CONOCIMIENTO PARA LA INNOVACIÓN QUE FORTALEZCAN CAPACIDADES COMUNITARIAS EN LA COMPRENSIÓN Y/O MITIGACIÓN DE LOS PROBLEMAS DE VIOLENCIAS BASADAS EN GÉNERO, DERIVADAS DE LA EMERGENCIA POR COVID 19, EN CUNDINAMARCA","CTEL",3100000000,"CONTRATADO EN EJECUCIÓN",45000,{"$f":"VLOOKUP(Tabla22[[#This Row],[BPIN ]],[1]Base1!F$3:Z$223,21,0)","v":"15/03/2023\n"},45012,{"$f":"Tabla22[[#This Row],[FECHA ]]-Tabla22[[#This Row],[HOY]]","v":-12},{"$f":"Tabla22[[#This Row],[FECHA ]]-Tabla22[[#This Row],[FECHA DE TERMINACIÓN2]]","v":{"$error":"#VALUE!"}}]
["CUNDINAMARCA","SECRETARIA DE CIENCIA, TECNOLOGIA E INNOVACIÓN","ALEXANDER RIVEROS Y YAHIR ARCINIEGAS","LUIS MANUEL GONZALEZ",2020000100650,"FORTALECIMIENTO DE CAPACIDADES DE CTEI PARALA INNOVACION EDUCATIVA EN LOS NIVELES DE BÁSICA Y\nMEDIA, MEDIANTE USO DE TICS EN INSTITUCIONES EDUCATIVAS OFICIALES DE LOS MUNICIPIOS NO\nCERTIFICADOS DEL DEPARTAMENTO DE CUNDINAMARCA","CTEL",10804663122,"CONTRATADO EN EJECUCIÓN",45217,{"$f":"VLOOKUP(Tabla22[[#This Row],[BPIN ]],[1]Base1!F$3:Z$223,21,0)","v":"18/10/2023\n"},45012,{"$f":"Tabla22[[#This Row],[FECHA ]]-Tabla22[[#This Row],[HOY]]","v":205},{"$f":"Tabla22[[#This Row],[FECHA ]]-Tabla22[[#This Row],[FECHA DE TERMINACIÓN2]]","v":{"$error":"#VALUE!"}}]
["CUNDINAMARCA","SECRETARIA DE CIENCIA, TECNOLOGIA E INNOVACIÓN","ALEXANDER RIVEROS Y YAHIR ARCINIEGAS","LUIS MANUEL GONZALEZ",2020000100696,"FORTALECIMIENTO DE CAPACIDADES DE CTEI PARA LA REACTIVACIÓN ECONÓMICA Y LA TRANSFORMACIÓN\nPRODUCTIVA EN CUNDINAMARCA","CTEL",7370634083,"CONTRATADO EN EJECUCIÓN",45204,{"$f":"VLOOKUP(Tabla22[[#This Row],[BPIN ]],[1]Base1!F$3:Z$223,21,0)","v":"05/10/2023\n"},45012,{"$f":"Tabla22[[#This Row],[FECHA ]]-Tabla22[[#This Row],[HOY]]","v":192},{"$f":"Tabla22[[#This Row],[FECHA ]]-Tabla22[[#This Row],[FECHA DE TERMINACIÓN2]]","v":{"$error":"#VALUE!"}}]
["CUNDINAMARCA","SECRETARIA DE CIENCIA, TECNOLOGIA E INNOVACIÓN","ALEXANDER RIVEROS Y YAHIR ARCINIEGAS","LUIS MANUEL GONZALEZ",2020000100649,"FORTALECIMIENTO DE CAPACIDADES DE CTeI PARA EL RELACIONAMIENTO ESCUELA - CONTEXTO RURAL MEDIANTE LA APROPIACIÓN Y USO DE LAS TIC EN EL MUNICIPIO DE SIBATÉ, DEPARTAMENTO DE CUNDINAMARCA","CTEL",4292464018,"CONTRATADO EN EJECUCIÓN",45245,{"$f":"VLOOKUP(Tabla22[[#This Row],[BPIN ]],[1]Base1!F$3:Z$223,21,0)","v":"15/11/2023\n"},45012,{"$f":"Tabla22[[#This Row],[FECHA ]]-Tabla22[[#This Row],[HOY]]","v":233},{"$f":"Tabla22[[#This Row],[FECHA ]]-Tabla22[[#This Row],[FECHA DE TERMINACIÓN2]]","v":{"$error":"#VALUE!"}}]
["ENTIDAD APORTANTE RECURSOS","FUNDACION UNIVERSIDAD DEL VALLE","YAHIR ARCINIEGAS","JOSE MARIA LEITON",2020000050044,"FORTALECIMIENTO DE LAS COMPETENCIAS COMUNICATIVAS EN INGLÉS DE LOS ESTUDIANTES DE LOS ESTABLECIMIENTOS EDUCATIVOS NO OFICIALES DE CUNDINAMARCA","EDUCACIÓN","$ 10.468.961.978","CONTRATADO EN EJECUCIÓN",45137,{"$f":"VLOOKUP(Tabla22[[#This Row],[BPIN ]],[1]Base1!F$3:Z$223,21,0)","v":"30/07/2023\n"},45012,{"$f":"Tabla22[[#This Row],[FECHA ]]-Tabla22[[#This Row],[HOY]]","v":125},{"$f":"Tabla22[[#This Row],[FECHA ]]-Tabla22[[#This Row],[FECHA DE TERMINACIÓN2]]","v":{"$error":"#VALUE!"}}]
["ENTIDAD APORTANTE RECURSOS","UNAD","YAHIR ARCINIEGAS","LUIS MANUEL GONZALEZ",2020000100433,"Investigación de los compuestos volátiles orgánicos e inducidos para el manejo de moscas plagas en gulupa y granadilla en el departamento de  Cundinamarca","CTEL",3412874201,"CONTRATADO EN EJECUCIÓN",45514,{"$f":"VLOOKUP(Tabla22[[#This Row],[BPIN ]],[1]Base1!F$3:Z$223,21,0)","v":"10/08/2024\n"},45012,{"$f":"Tabla22[[#This Row],[FECHA ]]-Tabla22[[#This Row],[HOY]]","v":502},{"$f":"Tabla22[[#This Row],[FECHA ]]-Tabla22[[#This Row],[FECHA DE TERMINACIÓN2]]","v":{"$error":"#VALUE!"}}]
["ENTIDAD APORTANTE RECURSOS","UNIVERSIDAD INDUSTRIAL DE SANTANDER","YAHIR ARCINIEGAS","LUIS MANUEL GONZALEZ",2020000100415,"Desarrollo de un sistema óptico  computacional para estimar el contenido de carbono orgánico de suelos agrícolas a través de imágenes espectrales e inteligencia artificial en cultivos de cítricos de   Santander","CTEL",2184125885.29,"CONTRATADO EN EJECUCIÓN",45412,{"$f":"VLOOKUP(Tabla22[[#This Row],[BPIN ]],[1]Base1!F$3:Z$223,21,0)","v":45412},45012,{"$f":"Tabla22[[#This Row],[FECHA ]]-Tabla22[[#This Row],[HOY]]","v":400},{"$f":"Tabla22[[#This Row],[FECHA ]]-Tabla22[[#This Row],[FECHA DE TERMINACIÓN2]]","v":0}]
["ENTIDAD APORTANTE RECURSOS","UNIVERSIDAD INDUSTRIAL DE SANTANDER","YAHIR ARCINIEGAS","LUIS MANUEL GONZALEZ",2020000100375,"Conformación de una plataforma para estudios celulares avanzados in vivo en tiempo real para el análisis de la respuesta inmunometabólica ante la reexpresión de interferón tipo I kappa en esferoides de células tumorales de cuello uterino en  Santander","CTEL",3123997801,"CONTRATADO EN EJECUCIÓN",45416,{"$f":"VLOOKUP(Tabla22[[#This Row],[BPIN ]],[1]Base1!F$3:Z$223,21,0)","v":"04/05/2024\n"},45012,{"$f":"Tabla22[[#This Row],[FECHA ]]-Tabla22[[#This Row],[HOY]]","v":404},{"$f":"Tabla22[[#This Row],[FECHA ]]-Tabla22[[#This Row],[FECHA DE TERMINACIÓN2]]","v":{"$error":"#VALUE!"}}]
["ENTIDAD APORTANTE RECURSOS","UNIVERSIDAD INDUSTRIAL DE SANTANDER","YAHIR ARCINIEGAS","LUIS MANUEL GONZALEZ",2020000100351,"Desarrollo de un prototipo selectivo y sensible para monitorear contenido de cadmio in situ en diversas matrices asociadas a la producción de granos de cacao en el departamento de  Santander","CTEL",2585800000,"CONTRATADO EN EJECUCIÓN",44865,{"$f":"VLOOKUP(Tabla22[[#This Row],[BPIN ]],[1]Base1!F$3:Z$223,21,0)","v":"31/10/2022\n"},45012,{"$f":"Tabla22[[#This Row],[FECHA ]]-Tabla22[[#This Row],[HOY]]","v":-147},{"$f":"Tabla22[[#This Row],[FECHA ]]-Tabla22[[#This Row],[FECHA DE TERMINACIÓN2]]","v":{"$error":"#VALUE!"}}]
["ENTIDAD APORTANTE RECURSOS","INSTITUTO SUPERIOR DE EDUCACION RURAL DE PAMPLONA","YAHIR ARCINIEGAS","LUIS MANUEL GONZALEZ",2020000100343,"Implementación laboratorio de calidad fisicoquímica de alimentos para el fortalecimiento competitivo y sostenible de lascadenas agroalimentarias del departamento de  Norte de Santander","CTEL",1097306327,"CONTRATADO EN EJECUCIÓN",45427,{"$f":"VLOOKUP(Tabla22[[#This Row],[BPIN ]],[1]Base1!F$3:Z$223,21,0)","v":"15/05/2024\n"},45012,{"$f":"Tabla22[[#This Row],[FECHA ]]-Tabla22[[#This Row],[HOY]]","v":415},{"$f":"Tabla22[[#This Row],[FECHA ]]-Tabla22[[#This Row],[FECHA DE TERMINACIÓN2]]","v":{"$error":"#VALUE!"}}]
["ENTIDAD APORTANTE RECURSOS","UNIVERSIDAD NACIONAL DE COLOMBIA","YAHIR ARCINIEGAS","LUIS MANUEL GONZALEZ",2020000100342,"Estudio de potenciales insecticidas en matrices poliméricas para el control de plagas de granos almacenados basados en aceites esenciales provenientes de la biodiversidadflorística del departamento de  Cundinamarca","CTEL",2748237104,"CONTRATADO EN EJECUCIÓN",45507,{"$f":"VLOOKUP(Tabla22[[#This Row],[BPIN ]],[1]Base1!F$3:Z$223,21,0)","v":"03/08/2024\n"},45012,{"$f":"Tabla22[[#This Row],[FECHA ]]-Tabla22[[#This Row],[HOY]]","v":495},{"$f":"Tabla22[[#This Row],[FECHA ]]-Tabla22[[#This Row],[FECHA DE TERMINACIÓN2]]","v":{"$error":"#VALUE!"}}]
["ENTIDAD APORTANTE RECURSOS","UNIVERSIDAD MILITAR NUEVA GRANADA","YAHIR ARCINIEGAS","LUIS MANUEL GONZALEZ",2020000100728,"Generación y transferencia de conocimientos y tecnologías para elevar capacidades de CTel de pequeños productores de tomate para afrontar problemas derivados del COVID-19 asociadas a la Seg. Alimentaria en las Sab. Centro y Oriente  Cundinamarca","CTEL",4162541452,"CONTRATADO EN EJECUCIÓN",44966,{"$f":"VLOOKUP(Tabla22[[#This Row],[BPIN ]],[1]Base1!F$3:Z$223,21,0)","v":"09/02/2024\n"},45012,{"$f":"Tabla22[[#This Row],[FECHA ]]-Tabla22[[#This Row],[HOY]]","v":-46},{"$f":"Tabla22[[#This Row],[FECHA ]]-Tabla22[[#This Row],[FECHA DE TERMINACIÓN2]]","v":{"$error":"#VALUE!"}}]
["ENTIDAD APORTANTE RECURSOS","UNIVERSIDAD NACIONAL DE COLOMBIA","YAHIR ARCINIEGAS","LUIS MANUEL GONZALEZ",2020000100339,"Desarrollo de Nuevos Métodos No Destructivos para Monitoreo In Situ de Probabilidad de Ocurrencia de Falla en Tuberías en el Sector de Hidrocarburos en los Departamentos de  Bogotá Boyacá Santander","CTEL",2412084140,"CONTRATADO EN EJECUCIÓN",45077,{"$f":"VLOOKUP(Tabla22[[#This Row],[BPIN ]],[1]Base1!F$3:Z$223,21,0)","v":"31/05/2023\n"},45012,{"$f":"Tabla22[[#This Row],[FECHA ]]-Tabla22[[#This Row],[HOY]]","v":65},{"$f":"Tabla22[[#This Row],[FECHA ]]-Tabla22[[#This Row],[FECHA DE TERMINACIÓN2]]","v":{"$error":"#VALUE!"}}]
["ENTIDAD APORTANTE RECURSOS","UNIVERSIDAD MILITAR NUEVA GRANADA","YAHIR ARCINIEGAS","LUIS MANUEL GONZALEZ",2020000100216,"Innovación y transferencia tecnológica de UMNGBIO a productores de flores para el control biológico de Tetranychus urticae (Acari: Tetranychiidae) en cultivos de invernadero con el ácaro benéfico Neoseiulus californicus (Acari: Phytoseiidae)  Cundinamarca","CTEL",2431580000,"CONTRATADO EN EJECUCIÓN",45456,{"$f":"VLOOKUP(Tabla22[[#This Row],[BPIN ]],[1]Base1!F$3:Z$223,21,0)","v":"13/06/2024\n"},45012,{"$f":"Tabla22[[#This Row],[FECHA ]]-Tabla22[[#This Row],[HOY]]","v":444},{"$f":"Tabla22[[#This Row],[FECHA ]]-Tabla22[[#This Row],[FECHA DE TERMINACIÓN2]]","v":{"$error":"#VALUE!"}}]
["CUNDINAMARCA","SECRETARIA DE COMPETITIVIDAD","DIEGO TORRES/VALENTINA PORTILLO","FABIAN CUESTA",2019000050026,"Desarrollo de un programa productivo, amigable con el medio ambiente del sector ganadero en el Departamento de Cundinamarca Cundinamarca","AGRICULTURA ",9757143522,"CONTRATADO EN EJECUCIÓN",null,{"$f":"VLOOKUP(Tabla22[[#This Row],[BPIN ]],[1]Base1!F$3:Z$223,21,0)","v":"NO DEFINIDO\n"},45012,{"$f":"Tabla22[[#This Row],[FECHA ]]-Tabla22[[#This Row],[HOY]]","v":-45012},{"$f":"Tabla22[[#This Row],[FECHA ]]-Tabla22[[#This Row],[FECHA DE TERMINACIÓN2]]","v":{"$error":"#VALUE!"}}]
["ENTIDAD APORTANTE RECURSOS","UNIVERSIDAD NACIONAL DE COLOMBIA","YAHIR ARCINIEGAS","LUIS MANUEL GONZALEZ",2020000100169,"Investigación Desarrollo, innovación y transferencia de conocimiento para el procesamiento de la semilla de Sacha Inchi en productos de valor agregado, como estrategia para mejorar la productividad del sector agroindustrial de la Región  Cundinamarca","CTEL",2757697312,"CONTRATADO EN EJECUCIÓN",45457,{"$f":"VLOOKUP(Tabla22[[#This Row],[BPIN ]],[1]Base1!F$3:Z$223,21,0)","v":"14/06/2024\n"},45012,{"$f":"Tabla22[[#This Row],[FECHA ]]-Tabla22[[#This Row],[HOY]]","v":445},{"$f":"Tabla22[[#This Row],[FECHA ]]-Tabla22[[#This Row],[FECHA DE TERMINACIÓN2]]","v":{"$error":"#VALUE!"}}]
["ENTIDAD APORTANTE RECURSOS","UPTC","YAHIR ARCINIEGAS","LUIS MANUEL GONZALEZ",2020000100114,"Fortalecimiento del ecosistema de investigación científica para CTeI en la universidad pedagógica y tecnológica de Colombia UPTC, I-SPACIO  Sogamoso","CTEL",2310634882,"CONTRATADO EN EJECUCIÓN",45077,{"$f":"VLOOKUP(Tabla22[[#This Row],[BPIN ]],[1]Base1!F$3:Z$223,21,0)","v":"31/05/2023\n"},45012,{"$f":"Tabla22[[#This Row],[FECHA ]]-Tabla22[[#This Row],[HOY]]","v":65},{"$f":"Tabla22[[#This Row],[FECHA ]]-Tabla22[[#This Row],[FECHA DE TERMINACIÓN2]]","v":{"$error":"#VALUE!"}}]
["ENTIDAD APORTANTE RECURSOS","UNIVERSIDAD DE ANTIOQUIA","YAHIR ARCINIEGAS","LUIS MANUEL GONZALEZ",2020000100079,"Fortalecimiento de la infraestructura tecnológica y equipamiento del ambiente de formación industrial para el aumento de las capacidades institucionales en CTeI de la ETITC  Bogotá","CTEL",1090608306,"CONTRATADO EN EJECUCIÓN",45046,{"$f":"VLOOKUP(Tabla22[[#This Row],[BPIN ]],[1]Base1!F$3:Z$223,21,0)","v":"30/04/2023\n"},45012,{"$f":"Tabla22[[#This Row],[FECHA ]]-Tabla22[[#This Row],[HOY]]","v":34},{"$f":"Tabla22[[#This Row],[FECHA ]]-Tabla22[[#This Row],[FECHA DE TERMINACIÓN2]]","v":{"$error":"#VALUE!"}}]
["ENTIDAD APORTANTE RECURSOS","UNIVERSIDAD NACIONAL DE COLOMBIA","YAHIR ARCINIEGAS","LUIS MANUEL GONZALEZ",2020000100075,"Aprovechamiento de la biodiversidad en agraz y papa para el desarrollo de cultivos promisorios en el departamento de   Santander","CTEL",3177259696,"CONTRATADO EN EJECUCIÓN",45565,{"$f":"VLOOKUP(Tabla22[[#This Row],[BPIN ]],[1]Base1!F$3:Z$223,21,0)","v":"30/09/2024\n"},45012,{"$f":"Tabla22[[#This Row],[FECHA ]]-Tabla22[[#This Row],[HOY]]","v":553},{"$f":"Tabla22[[#This Row],[FECHA ]]-Tabla22[[#This Row],[FECHA DE TERMINACIÓN2]]","v":{"$error":"#VALUE!"}}]
["ENTIDAD APORTANTE RECURSOS","UNIVERSIDAD NACIONAL DE COLOMBIA","YAHIR ARCINIEGAS","LUIS MANUEL GONZALEZ",2020000100019,"Fortalecimiento de capacidades de investigación y desarrollo tecnológico de la Universidad Colegio Mayor de Cundinamarca a partir de tecnologías industria 4.0 para el diseño y construcción en   Bogotá","CTEL",2077571214,"CONTRATADO EN EJECUCIÓN",45075,{"$f":"VLOOKUP(Tabla22[[#This Row],[BPIN ]],[1]Base1!F$3:Z$223,21,0)","v":"29/05/2023\n\n"},45012,{"$f":"Tabla22[[#This Row],[FECHA ]]-Tabla22[[#This Row],[HOY]]","v":63},{"$f":"Tabla22[[#This Row],[FECHA ]]-Tabla22[[#This Row],[FECHA DE TERMINACIÓN2]]","v":{"$error":"#VALUE!"}}]
["ENTIDAD APORTANTE RECURSOS","UNIVERSIDAD INDUSTRIAL DE SANTANDER","YAHIR ARCINIEGAS","LUIS MANUEL GONZALEZ",2020000100017,"Fortalecimiento DE LA CAPACIDAD INSTITUCIONAL DE INVESTIGACIÓN DE LA UNIVERSIDAD INDUSTRIAL DESANTANDER  Nacional","CTEL",2808520000,"CONTRATADO EN EJECUCIÓN",45269,{"$f":"VLOOKUP(Tabla22[[#This Row],[BPIN ]],[1]Base1!F$3:Z$223,21,0)","v":"09/12/2023\n"},45012,{"$f":"Tabla22[[#This Row],[FECHA ]]-Tabla22[[#This Row],[HOY]]","v":257},{"$f":"Tabla22[[#This Row],[FECHA ]]-Tabla22[[#This Row],[FECHA DE TERMINACIÓN2]]","v":{"$error":"#VALUE!"}}]
["ENTIDAD APORTANTE RECURSOS","UNIVERSIDAD MILITAR NUEVA GRANADA","YAHIR ARCINIEGAS","LUIS MANUEL GONZALEZ",2020000100103,"Fortalecimiento de capacidades instaladas de Ciencia y Tecnología del Laboratorio de Diagnóstico en el Campus de la Univ Militar Nueva Granada, para atender problemáticas asociadas con agentes biológicos de alto riesgo para la salud humana,  Cundinamarca","CTEL",5162742977,"CONTRATADO EN EJECUCIÓN",44834,{"$f":"VLOOKUP(Tabla22[[#This Row],[BPIN ]],[1]Base1!F$3:Z$223,21,0)","v":"30/09/2022\n"},45012,{"$f":"Tabla22[[#This Row],[FECHA ]]-Tabla22[[#This Row],[HOY]]","v":-178},{"$f":"Tabla22[[#This Row],[FECHA ]]-Tabla22[[#This Row],[FECHA DE TERMINACIÓN2]]","v":{"$error":"#VALUE!"}}]
["ENTIDAD APORTANTE RECURSOS","INSTITUTO UNIVERSITARIO DE LA PAZ – UNIPAZ","YAHIR ARCINIEGAS","LUIS MANUEL GONZALEZ",2020000100042,"Fortalecimiento de los procesos académicos en los programas ofrecidos por el Instituto Universitario de la Paz, UNIPAZ,   Barrancabermeja","CTEL",1178749590,"CONTRATADO EN EJECUCIÓN",44705,{"$f":"VLOOKUP(Tabla22[[#This Row],[BPIN ]],[1]Base1!F$3:Z$223,21,0)","v":"24/05/2022\n"},45012,{"$f":"Tabla22[[#This Row],[FECHA ]]-Tabla22[[#This Row],[HOY]]","v":-307},{"$f":"Tabla22[[#This Row],[FECHA ]]-Tabla22[[#This Row],[FECHA DE TERMINACIÓN2]]","v":{"$error":"#VALUE!"}}]
["ENTIDAD APORTANTE RECURSOS","INSTITUTO UNIVERSITARIO DE LA PAZ – UNIPAZ","YAHIR ARCINIEGAS","LUIS MANUEL GONZALEZ",2020000100016,"Adecuación , DOTACIÓN E IMPLEMENTACIÓN DE UN LABORATORIO DE FABRICACIÓN DIGITAL PARA PROMOVER EL DESARROLLO DE LA CIENCIA, LAINNOVACIÓN Y EL EMPRENDIMIENTO EN LA UNIVERSIDAD FRANCISCO DE PAULA SANTANDER.  Cúcuta","CTEL",2921057589,"CONTRATADO EN EJECUCIÓN",44872,{"$f":"VLOOKUP(Tabla22[[#This Row],[BPIN ]],[1]Base1!F$3:Z$223,21,0)","v":"07/11/2022\n"},45012,{"$f":"Tabla22[[#This Row],[FECHA ]]-Tabla22[[#This Row],[HOY]]","v":-140},{"$f":"Tabla22[[#This Row],[FECHA ]]-Tabla22[[#This Row],[FECHA DE TERMINACIÓN2]]","v":{"$error":"#VALUE!"}}]
["ENTIDAD APORTANTE RECURSOS","UNIVERSIDAD TECNOLOGICA DE SANTANDER","YAHIR ARCINIEGAS","LUIS MANUEL GONZALEZ",2020000100004,"Fortalecimiento y adecuación de equipos e infraestructura del Laboratorio de física del Departamento de Ciencias Básicas, para el mejoramiento de las capacidades institucionales y la investigación en las Unidades Tecnológicas de Santander -  Bucaramanga","CTEL",1016752702,"CONTRATADO EN EJECUCIÓN",null,{"$f":"VLOOKUP(Tabla22[[#This Row],[BPIN ]],[1]Base1!F$3:Z$223,21,0)","v":"30/11/2022\n"},45012,{"$f":"Tabla22[[#This Row],[FECHA ]]-Tabla22[[#This Row],[HOY]]","v":-45012},{"$f":"Tabla22[[#This Row],[FECHA ]]-Tabla22[[#This Row],[FECHA DE TERMINACIÓN2]]","v":{"$error":"#VALUE!"}}]
["CUNDINAMARCA","SECRETARIA DE EDUCACIÓN","YAHIR ARCINIEGAS","GENNY PADILLA",2020000050037,"Dotación del mobiliario escolar para las instituciones educativas de los municipios no certificados del Departamento de Cundinamarca","EDUCACIÓN",10093038848,"CONTRATADO EN EJECUCIÓN",44773,{"$f":"VLOOKUP(Tabla22[[#This Row],[BPIN ]],[1]Base1!F$3:Z$223,21,0)","v":"31/07/2022\n"},45012,{"$f":"Tabla22[[#This Row],[FECHA ]]-Tabla22[[#This Row],[HOY]]","v":-239},{"$f":"Tabla22[[#This Row],[FECHA ]]-Tabla22[[#This Row],[FECHA DE TERMINACIÓN2]]","v":{"$error":"#VALUE!"}}]
["ENTIDAD APORTANTE RECURSOS","UNIVERSIDAD DEL NORTE","YAHIR ARCINIEGAS","LUIS MANUEL GONZALEZ",2020000100287,"Formación de Capital Humano de Alto Nivel Universidad del Norte 2do Corte Nacional","CTEL",6920233499,"CONTRATADO EN EJECUCIÓN",47299,{"$f":"VLOOKUP(Tabla22[[#This Row],[BPIN ]],[1]Base1!F$3:Z$223,21,0)","v":"30/06/2029\n"},45012,{"$f":"Tabla22[[#This Row],[FECHA ]]-Tabla22[[#This Row],[HOY]]","v":2287},{"$f":"Tabla22[[#This Row],[FECHA ]]-Tabla22[[#This Row],[FECHA DE TERMINACIÓN2]]","v":{"$error":"#VALUE!"}}]
["ENTIDAD APORTANTE RECURSOS","UNIVERSIDAD DEL VALLE","YAHIR ARCINIEGAS","LUIS MANUEL GONZALEZ",2020000100345,"Formación de capital humano de alto Nivel segundo Corte Universidad del Valle Nacional","CTEL",5913070114,"CONTRATADO EN EJECUCIÓN",47330,{"$f":"VLOOKUP(Tabla22[[#This Row],[BPIN ]],[1]Base1!F$3:Z$223,21,0)","v":"31/07/2029\n"},{"$f":"+TODAY()","v":45012},{"$f":"Tabla22[[#This Row],[FECHA ]]-Tabla22[[#This Row],[HOY]]","v":2318},{"$f":"Tabla22[[#This Row],[FECHA ]]-Tabla22[[#This Row],[FECHA DE TERMINACIÓN2]]","v":{"$error":"#VALUE!"}}]
["ENTIDAD APORTANTE RECURSOS","UNIVERSIDAD NACIONAL DE COLOMBIA","YAHIR ARCINIEGAS","LUIS MANUEL GONZALEZ",2021000100003,"Formación de Capital Humano de Alto Nivel Universidad  Nacional de Colombia Corte II Nacionl","CTEL",18418143500,"CONTRATADO EN EJECUCIÓN",47330,{"$f":"VLOOKUP(Tabla22[[#This Row],[BPIN ]],[1]Base1!F$3:Z$223,21,0)","v":"31/07/2029\n"},45012,{"$f":"Tabla22[[#This Row],[FECHA ]]-Tabla22[[#This Row],[HOY]]","v":2318},{"$f":"Tabla22[[#This Row],[FECHA ]]-Tabla22[[#This Row],[FECHA DE TERMINACIÓN2]]","v":{"$error":"#VALUE!"}}]
["ENTIDAD APORTANTE RECURSOS","UNIVERSIDAD DE LA SABANA","YAHIR ARCINIEGAS","LUIS MANUEL GONZALEZ",2021000100004,"Formación de Capital Humano de Alto Nivel Universidad de La Sabana Core 2 Nacional","CTEL",1519950000,"CONTRATADO EN EJECUCIÓN",47385,{"$f":"VLOOKUP(Tabla22[[#This Row],[BPIN ]],[1]Base1!F$3:Z$223,21,0)","v":"24/09/2029\n"},45012,{"$f":"Tabla22[[#This Row],[FECHA ]]-Tabla22[[#This Row],[HOY]]","v":2373},{"$f":"Tabla22[[#This Row],[FECHA ]]-Tabla22[[#This Row],[FECHA DE TERMINACIÓN2]]","v":{"$error":"#VALUE!"}}]
["ENTIDAD APORTANTE RECURSOS","UNIVERSIDAD ANTONIO NARIÑO","YAHIR ARCINIEGAS","LUIS MANUEL GONZALEZ",2021000100014,"Formación de Capital Humano de Alto Nivel Universidad Antonio Nariño Core 2 Nacional","CTEL",4526652200,"CONTRATADO EN EJECUCIÓN",47311,{"$f":"VLOOKUP(Tabla22[[#This Row],[BPIN ]],[1]Base1!F$3:Z$223,21,0)","v":"12/07/2029\n"},45012,{"$f":"Tabla22[[#This Row],[FECHA ]]-Tabla22[[#This Row],[HOY]]","v":2299},{"$f":"Tabla22[[#This Row],[FECHA ]]-Tabla22[[#This Row],[FECHA DE TERMINACIÓN2]]","v":{"$error":"#VALUE!"}}]
["ENTIDAD APORTANTE RECURSOS","UNIVERSIDAD EAN","YAHIR ARCINIEGAS","LUIS MANUEL GONZALEZ",2021000100025,"Formación DE CAPITAL HUMANO DE ALTO NIVEL UNIVERSIDAD EAN NACIONAL COHORTE II Nacional","CTEL",2044506416,"CONTRATADO EN EJECUCIÓN",47425,{"$f":"VLOOKUP(Tabla22[[#This Row],[BPIN ]],[1]Base1!F$3:Z$223,21,0)","v":"03/11/2029\n"},45012,{"$f":"Tabla22[[#This Row],[FECHA ]]-Tabla22[[#This Row],[HOY]]","v":2413},{"$f":"Tabla22[[#This Row],[FECHA ]]-Tabla22[[#This Row],[FECHA DE TERMINACIÓN2]]","v":{"$error":"#VALUE!"}}]
["ENTIDAD APORTANTE RECURSOS","UNIVERSIDAD MILITAR NUEVA GRANADA","YAHIR ARCINIEGAS","LUIS MANUEL GONZALEZ",2021000100026,"Formación de Capital Humano de Alto Nivel Universidad Militar Nueva Granada Segundo Corte Nacional","CTEL",751632481,"CONTRATADO EN EJECUCIÓN",47184,{"$f":"VLOOKUP(Tabla22[[#This Row],[BPIN ]],[1]Base1!F$3:Z$223,21,0)","v":"07/03/2029\n"},45012,{"$f":"Tabla22[[#This Row],[FECHA ]]-Tabla22[[#This Row],[HOY]]","v":2172},{"$f":"Tabla22[[#This Row],[FECHA ]]-Tabla22[[#This Row],[FECHA DE TERMINACIÓN2]]","v":{"$error":"#VALUE!"}}]
["ENTIDAD APORTANTE RECURSOS","PONIFICA UNIVERSIDAD JAVERIANA","YAHIR ARCINIEGAS","LUIS MANUEL GONZALEZ",2021000100027,"Formación de Capital Humano de Alto Nivel Pontificia Universidad Javeriana Sede Bogotá Corte II Nacional","CTEL",8577491761,"CONTRATADO EN EJECUCIÓN",null,{"$f":"VLOOKUP(Tabla22[[#This Row],[BPIN ]],[1]Base1!F$3:Z$223,21,0)","v":"No definido "},45012,{"$f":"Tabla22[[#This Row],[FECHA ]]-Tabla22[[#This Row],[HOY]]","v":-45012},{"$f":"Tabla22[[#This Row],[FECHA ]]-Tabla22[[#This Row],[FECHA DE TERMINACIÓN2]]","v":{"$error":"#VALUE!"}}]
["ENTIDAD APORTANTE RECURSOS","UNIVERSIDAD DE CALDAS","YAHIR ARCINIEGAS","LUIS MANUEL GONZALEZ",2021000100028,"Formación de capital humano de alto nivel Corte 2 Universidad de Caldas - Nacional","CTEL",63580000000,"CONTRATADO EN EJECUCIÓN",47356,{"$f":"VLOOKUP(Tabla22[[#This Row],[BPIN ]],[1]Base1!F$3:Z$223,21,0)","v":"26/08/2029\n"},45012,{"$f":"Tabla22[[#This Row],[FECHA ]]-Tabla22[[#This Row],[HOY]]","v":2344},{"$f":"Tabla22[[#This Row],[FECHA ]]-Tabla22[[#This Row],[FECHA DE TERMINACIÓN2]]","v":{"$error":"#VALUE!"}}]
["CUNDINAMARCA","SECRETARIA DE EDUCACIÓN","YAHIR ARCINIEGAS","GENNY PADILLA",2021004250258,"Fortalecimiento a la Estrategia de Alimentación Escolar para el año 2021 en los municipios del Departamento de Cundinamarca","EDUCACIÓN",16289941201,"CONTRATADO EN EJECUCIÓN",44760,{"$f":"VLOOKUP(Tabla22[[#This Row],[BPIN ]],[1]Base1!F$3:Z$223,21,0)","v":"18/07/2022\n"},45012,{"$f":"Tabla22[[#This Row],[FECHA ]]-Tabla22[[#This Row],[HOY]]","v":-252},{"$f":"Tabla22[[#This Row],[FECHA ]]-Tabla22[[#This Row],[FECHA DE TERMINACIÓN2]]","v":{"$error":"#VALUE!"}}]
["CUNDINAMARCA","SECRETARIA DE HABITAT Y VIVIENDA","ALEXANDER RIVEROS/JEIMY FORERO","BEATRIZ GAMEZ",2018000050050,"Mejoramiento vivienda rural mediante construcción de cocinas habitaciones y pisos en los municipios de Cundinamarca","AGRICULTURA ",5616585397,"EN PROCESO DE CONTRATACIÓN",45023,{"$f":"VLOOKUP(Tabla22[[#This Row],[BPIN ]],[1]Base1!F$3:Z$223,21,0)","v":45023},45012,{"$f":"Tabla22[[#This Row],[FECHA ]]-Tabla22[[#This Row],[HOY]]","v":11},{"$f":"Tabla22[[#This Row],[FECHA ]]-Tabla22[[#This Row],[FECHA DE TERMINACIÓN2]]","v":0}]
["CUNDINAMARCA","SECRETARIA DE COMPETITIVIDAD","ALEXANDER RIVEROS/JEIMY FORERO","FABIAN CUESTA",2020000050035,"Fortalecimiento de los sistemas productivos a través de la reactivación del sector agrícola en el Departamento de Cundinamarca","AGRICULTURA ",8993872200.5599995,"EN PROCESO DE CONTRATACIÓN",45322,{"$f":"VLOOKUP(Tabla22[[#This Row],[BPIN ]],[1]Base1!F$3:Z$223,21,0)","v":45322},45012,{"$f":"Tabla22[[#This Row],[FECHA ]]-Tabla22[[#This Row],[HOY]]","v":310},{"$f":"Tabla22[[#This Row],[FECHA ]]-Tabla22[[#This Row],[FECHA DE TERMINACIÓN2]]","v":0}]
["CUNDINAMARCA","SECRETARIA DE MINAS, ENERGIA Y GAS","DIEGO TORRES / LIYUGETH ALFONSO","YAHIR",2021004250686,"Construcción Del Centro De Formación E Innovación Minero Energético De Cundinamarca","GOBIERNO TERRITORIAL","$ 13.770.893.382,00","EN PROCESO DE CONTRATACIÓN",44888,{"$f":"VLOOKUP(Tabla22[[#This Row],[BPIN ]],[1]Base1!F$3:Z$223,21,0)","v":44888},45012,{"$f":"Tabla22[[#This Row],[FECHA ]]-Tabla22[[#This Row],[HOY]]","v":-124},{"$f":"Tabla22[[#This Row],[FECHA ]]-Tabla22[[#This Row],[FECHA DE TERMINACIÓN2]]","v":0}]
["CUNDINAMARCA","UNIDAD ADMINISTRATIVA DE GESTIÓN DEL RIESGO.","DIEGO TORRES/VALENTINA PORTILLO","GINNA HERRERA",2021004250690,"Fortalecimiento del sistema automotor para la gestión del riesgo de desastres del departamento de Cundinamarca","GOBIERNO TERRITORIAL",7299514100,"EN PROCESO DE CONTRATACIÓN",44888,{"$f":"VLOOKUP(Tabla22[[#This Row],[BPIN ]],[1]Base1!F$3:Z$223,21,0)","v":44888},45012,{"$f":"Tabla22[[#This Row],[FECHA ]]-Tabla22[[#This Row],[HOY]]","v":-124},{"$f":"Tabla22[[#This Row],[FECHA ]]-Tabla22[[#This Row],[FECHA DE TERMINACIÓN2]]","v":0}]
["CUNDINAMARCA","SECRETARIA DE COMPETITIVIDAD","ALEXANDER RIVEROS/JEIMY FORERO","FABIAN CUESTA",2020000050038,"Optimización de los sistemas Ganaderos bovinos de carne leche y doble propósito a partir de la implementación de mejoramiento genético productivo y entrega de maquinaria y equipos en municipios del Departamento de Cundinamarca","AGRICULTURA ",8732449919,"SIN CONTRATAR",45565,{"$f":"VLOOKUP(Tabla22[[#This Row],[BPIN ]],[1]Base1!F$3:Z$223,21,0)","v":45565},45012,{"$f":"Tabla22[[#This Row],[FECHA ]]-Tabla22[[#This Row],[HOY]]","v":553},{"$f":"Tabla22[[#This Row],[FECHA ]]-Tabla22[[#This Row],[FECHA DE TERMINACIÓN2]]","v":0}]
["DECENTRALIZADOS","ICCU - GESPROY GB","DIEGO TORRES / JEIMY FORERO","GIOVANY QUEVEDO",2018000050024,"MEJORAMIENTO Y REHABILITACIÓN DE LA VÍA LA MARÍA – TOBIA - PASO EL REJO - LA PEÑA, DEPARTAMENTO DE CUNDINAMARCA","TRANSPORTE",9149162991,"TERMINADO",44316,{"$f":"VLOOKUP(Tabla22[[#This Row],[BPIN ]],[1]Base1!F$3:Z$223,21,0)","v":"30/04/2021\n"},{"$f":"+TODAY()","v":45012},{"$f":"Tabla22[[#This Row],[FECHA ]]-Tabla22[[#This Row],[HOY]]","v":-696},{"$f":"Tabla22[[#This Row],[FECHA ]]-Tabla22[[#This Row],[FECHA DE TERMINACIÓN2]]","v":{"$error":"#VALUE!"}}]
["DECENTRALIZADOS","ICCU - GESPROY GB","DIEGO TORRES / JEIMY FORERO","GIOVANY QUEVEDO",2018000050026,"MEJORAMIENTO DE VÍAS EN LA PROVINCIA DE SUMAPAZ PARA LA CONSOLIDACIÓN DE UNA PAZ ESTABLE Y DURADERA EN EL DEPARTAMENTO DE CUNDINAMARCA","TRANSPORTE",11457047617,"CONTRATADO EN EJECUCIÓN",44316,{"$f":"VLOOKUP(Tabla22[[#This Row],[BPIN ]],[1]Base1!F$3:Z$223,21,0)","v":"30/04/2021\n"},45012,{"$f":"Tabla22[[#This Row],[FECHA ]]-Tabla22[[#This Row],[HOY]]","v":-696},{"$f":"Tabla22[[#This Row],[FECHA ]]-Tabla22[[#This Row],[FECHA DE TERMINACIÓN2]]","v":{"$error":"#VALUE!"}}]
["DECENTRALIZADOS","ICCU - GESPROY GB","DIEGO TORRES / JEIMY FORERO","GIOVANY QUEVEDO",2018000050059,"Mejoramiento de la vía Gusbita - Tibirita del Departamento de Cundinamarca","TRANSPORTE",5500531740,"TERMINADO",44469,{"$f":"VLOOKUP(Tabla22[[#This Row],[BPIN ]],[1]Base1!F$3:Z$223,21,0)","v":"30/09/2021\n"},45012,{"$f":"Tabla22[[#This Row],[FECHA ]]-Tabla22[[#This Row],[HOY]]","v":-543},{"$f":"Tabla22[[#This Row],[FECHA ]]-Tabla22[[#This Row],[FECHA DE TERMINACIÓN2]]","v":{"$error":"#VALUE!"}}]
["DECENTRALIZADOS","ICCU - GESPROY GB","DIEGO TORRES / JEIMY FORERO","GIOVANY QUEVEDO",2019000050011,"Mejoramiento de la vía Supatá - Pacho, departamento de Cundinamarca","TRANSPORTE",7339441010,"CONTRATADO EN EJECUCIÓN",44712,{"$f":"VLOOKUP(Tabla22[[#This Row],[BPIN ]],[1]Base1!F$3:Z$223,21,0)","v":"31/05/2022\n"},45012,{"$f":"Tabla22[[#This Row],[FECHA ]]-Tabla22[[#This Row],[HOY]]","v":-300},{"$f":"Tabla22[[#This Row],[FECHA ]]-Tabla22[[#This Row],[FECHA DE TERMINACIÓN2]]","v":{"$error":"#VALUE!"}}]
["DECENTRALIZADOS","ICCU - GESPROY GB","DIEGO TORRES / JEIMY FORERO","GIOVANY QUEVEDO",2019000050013,"Construcción de la Plaza de Mercado del municipio de Choachí Cundinamarca","TRANSPORTE",4481109943,"CONTRATADO EN EJECUCIÓN",44651,{"$f":"VLOOKUP(Tabla22[[#This Row],[BPIN ]],[1]Base1!F$3:Z$223,21,0)","v":"31/03/2022\n"},45012,{"$f":"Tabla22[[#This Row],[FECHA ]]-Tabla22[[#This Row],[HOY]]","v":-361},{"$f":"Tabla22[[#This Row],[FECHA ]]-Tabla22[[#This Row],[FECHA DE TERMINACIÓN2]]","v":{"$error":"#VALUE!"}}]
["DECENTRALIZADOS","ICCU - GESPROY GB","DIEGO TORRES / JEIMY FORERO","GIOVANY QUEVEDO",2019000050016,"Mejoramiento de la vía Anolaima Corralejas (Inspección de Corralejas), departamento de Cundinamarca","TRANSPORTE",5718724028,"TERMINADO",44469,{"$f":"VLOOKUP(Tabla22[[#This Row],[BPIN ]],[1]Base1!F$3:Z$223,21,0)","v":"30/09/2021\n"},45012,{"$f":"Tabla22[[#This Row],[FECHA ]]-Tabla22[[#This Row],[HOY]]","v":-543},{"$f":"Tabla22[[#This Row],[FECHA ]]-Tabla22[[#This Row],[FECHA DE TERMINACIÓN2]]","v":{"$error":"#VALUE!"}}]
["DECENTRALIZADOS","ICCU - GESPROY GB","DIEGO TORRES / JEIMY FORERO","GIOVANY QUEVEDO",2019000050023,"Mejoramiento de la vía Lenguazaque - Villapinzón, departamento de Cundinamarca","TRANSPORTE",8636278689,"TERMINADO",44227,{"$f":"VLOOKUP(Tabla22[[#This Row],[BPIN ]],[1]Base1!F$3:Z$223,21,0)","v":"31/01/2021\n"},45012,{"$f":"Tabla22[[#This Row],[FECHA ]]-Tabla22[[#This Row],[HOY]]","v":-785},{"$f":"Tabla22[[#This Row],[FECHA ]]-Tabla22[[#This Row],[FECHA DE TERMINACIÓN2]]","v":{"$error":"#VALUE!"}}]
["DECENTRALIZADOS","ICCU - GESPROY GB","DIEGO TORRES / JEIMY FORERO","GIOVANY QUEVEDO",2019000050029,"Mejoramiento de la vía Gachetá - Gama, Departamento de Cundinamarca","TRANSPORTE",5477582208,"TERMINADO",44469,{"$f":"VLOOKUP(Tabla22[[#This Row],[BPIN ]],[1]Base1!F$3:Z$223,21,0)","v":"30/09/2021\n"},45012,{"$f":"Tabla22[[#This Row],[FECHA ]]-Tabla22[[#This Row],[HOY]]","v":-543},{"$f":"Tabla22[[#This Row],[FECHA ]]-Tabla22[[#This Row],[FECHA DE TERMINACIÓN2]]","v":{"$error":"#VALUE!"}}]
["DECENTRALIZADOS","ICCU - GESPROY GB","DIEGO TORRES / JEIMY FORERO","GIOVANY QUEVEDO",2019000050047,"Mejoramiento de la vía Susa - Carmen de Carupa, Departamento de Cundinamarca","TRANSPORTE",5203497468,"TERMINADO",44469,{"$f":"VLOOKUP(Tabla22[[#This Row],[BPIN ]],[1]Base1!F$3:Z$223,21,0)","v":"30/09/2021\n"},{"$f":"+TODAY()","v":45012},{"$f":"Tabla22[[#This Row],[FECHA ]]-Tabla22[[#This Row],[HOY]]","v":-543},{"$f":"Tabla22[[#This Row],[FECHA ]]-Tabla22[[#This Row],[FECHA DE TERMINACIÓN2]]","v":{"$error":"#VALUE!"}}]
["DECENTRALIZADOS","ICCU - GESPROY GB","DIEGO TORRES / JEIMY FORERO","GIOVANY QUEVEDO",2019000050056,"Mejoramiento de la vía que conduce del municipio de Nimaima al municipio de Nocaima, departamento de Cundinamarca","TRANSPORTE",5082491570,"TERMINADO",44560,{"$f":"VLOOKUP(Tabla22[[#This Row],[BPIN ]],[1]Base1!F$3:Z$223,21,0)","v":"30/12/2021\n"},45012,{"$f":"Tabla22[[#This Row],[FECHA ]]-Tabla22[[#This Row],[HOY]]","v":-452},{"$f":"Tabla22[[#This Row],[FECHA ]]-Tabla22[[#This Row],[FECHA DE TERMINACIÓN2]]","v":{"$error":"#VALUE!"}}]
["DECENTRALIZADOS","ICCU - GESPROY GB","DIEGO TORRES / JEIMY FORERO","GIOVANY QUEVEDO",2019000050060,"Estudios y diseños de vías para mejorar la competitividad del departamento de Cundinamarca","TRANSPORTE",7089369627,"TERMINADO",44438,{"$f":"VLOOKUP(Tabla22[[#This Row],[BPIN ]],[1]Base1!F$3:Z$223,21,0)","v":"30/08/2021\n"},45012,{"$f":"Tabla22[[#This Row],[FECHA ]]-Tabla22[[#This Row],[HOY]]","v":-574},{"$f":"Tabla22[[#This Row],[FECHA ]]-Tabla22[[#This Row],[FECHA DE TERMINACIÓN2]]","v":{"$error":"#VALUE!"}}]
["DECENTRALIZADOS","ICCU - GESPROY GB","DIEGO TORRES / JEIMY FORERO","GIOVANY QUEVEDO",2019000050075,"Mejoramiento de la vía que conduce del municipio de Viani al municipio de Chaguani, (de la y de San Vicente a Chaguani), departamento de Cundinamarca","TRANSPORTE",7504443091,"CONTRATADO EN EJECUCIÓN",44651,{"$f":"VLOOKUP(Tabla22[[#This Row],[BPIN ]],[1]Base1!F$3:Z$223,21,0)","v":"31/03/2022\n"},45012,{"$f":"Tabla22[[#This Row],[FECHA ]]-Tabla22[[#This Row],[HOY]]","v":-361},{"$f":"Tabla22[[#This Row],[FECHA ]]-Tabla22[[#This Row],[FECHA DE TERMINACIÓN2]]","v":{"$error":"#VALUE!"}}]
["DECENTRALIZADOS","ICCU - GESPROY GB","DIEGO TORRES / JEIMY FORERO","GIOVANY QUEVEDO",2019000050079,"MEJORAMIENTO DE LA VÍA SERREZUELA - EL TRIUNFO, MUNICIPIO DE LA CALERA, DEPARTAMENTO DE CUNDINAMARCA","TRANSPORTE",7614258187,"TERMINADO",44316,{"$f":"VLOOKUP(Tabla22[[#This Row],[BPIN ]],[1]Base1!F$3:Z$223,21,0)","v":"30/04/2021\n"},45012,{"$f":"Tabla22[[#This Row],[FECHA ]]-Tabla22[[#This Row],[HOY]]","v":-696},{"$f":"Tabla22[[#This Row],[FECHA ]]-Tabla22[[#This Row],[FECHA DE TERMINACIÓN2]]","v":{"$error":"#VALUE!"}}]
["DECENTRALIZADOS","ICCU - GESPROY GB","DIEGO TORRES / JEIMY FORERO","GIOVANY QUEVEDO",2019000050085,"MEJORAMIENTO DE LA VÍA QUE CONDUCE DEL MUNICIPIO DE LA MESA AL MUNICIPIO DE CACHIPAY, (DE LA INSPECCIÓN DE PEÑA NEGRA AL MUNICIPIO DE CACHIPAY), DEPARTAMENTO DE CUNDINAMARCA","TRANSPORTE",7019896083,"CONTRATADO EN EJECUCIÓN",44620,{"$f":"VLOOKUP(Tabla22[[#This Row],[BPIN ]],[1]Base1!F$3:Z$223,21,0)","v":"28/02/2022\n"},45012,{"$f":"Tabla22[[#This Row],[FECHA ]]-Tabla22[[#This Row],[HOY]]","v":-392},{"$f":"Tabla22[[#This Row],[FECHA ]]-Tabla22[[#This Row],[FECHA DE TERMINACIÓN2]]","v":{"$error":"#VALUE!"}}]
["CUNDINAMARCA","SECRETARIA DE CIENCIA, TECNOLOGIA E INNOVACIÓN","YAHIR ARCINIEGAS","LUIS MANUEL GONZALEZ",2021000100327,"Desarrollo de un sistema de producción lechero para la obtención de leches inocuas de alta calidad y con un perfil lipídico saludable en el Departamento de Cundinamarca","CTEL",3833042862,"SIN CONTRATAR",null,{"$f":"VLOOKUP(Tabla22[[#This Row],[BPIN ]],[1]Base1!F$3:Z$223,21,0)","v":"No definido"},{"$f":"+TODAY()","v":45012},{"$f":"Tabla22[[#This Row],[FECHA ]]-Tabla22[[#This Row],[HOY]]","v":-45012},{"$f":"Tabla22[[#This Row],[FECHA ]]-Tabla22[[#This Row],[FECHA DE TERMINACIÓN2]]","v":{"$error":"#VALUE!"}}]
["CUNDINAMARCA","SECRETARIA DE CIENCIA, TECNOLOGIA E INNOVACIÓN","YAHIR ARCINIEGAS","LUIS MANUEL GONZALEZ",2021000100208,"Fortalecimiento de los niveles de Apropiación social del Conocimiento de la CTeI en comunidades de las provincias de Almeidas y Ubaté del Departamento de Cundinamarca","CTEL",2191964751,"SIN CONTRATAR",null,{"$f":"VLOOKUP(Tabla22[[#This Row],[BPIN ]],[1]Base1!F$3:Z$223,21,0)","v":"No definido"},45012,{"$f":"Tabla22[[#This Row],[FECHA ]]-Tabla22[[#This Row],[HOY]]","v":-45012},{"$f":"Tabla22[[#This Row],[FECHA ]]-Tabla22[[#This Row],[FECHA DE TERMINACIÓN2]]","v":{"$error":"#VALUE!"}}]
["CUNDINAMARCA","SECRETARIA DE CIENCIA, TECNOLOGIA E INNOVACIÓN","YAHIR ARCINIEGAS","LUIS MANUEL GONZALEZ",2021000100243,"Desarrollo participativo de una plataforma tecnológica de teledetección para la gestión sostenible de suelos en agroecosistemas del Departamento de Cundinamarca","CTEL",3042693625,"SIN CONTRATAR",null,{"$f":"VLOOKUP(Tabla22[[#This Row],[BPIN ]],[1]Base1!F$3:Z$223,21,0)","v":"No definido"},45012,{"$f":"Tabla22[[#This Row],[FECHA ]]-Tabla22[[#This Row],[HOY]]","v":-45012},{"$f":"Tabla22[[#This Row],[FECHA ]]-Tabla22[[#This Row],[FECHA DE TERMINACIÓN2]]","v":{"$error":"#VALUE!"}}]
["CUNDINAMARCA","SECRETARIA DE MINAS, ENERGIA Y GAS","DIEGO TORRES / LIYUGETH ALFONSO","YAHIR",2021000050019,"Ampliación DE LA COBERTURA DEL SERVICIO DE GAS COMBUTIBLE POR REDES A TRAVES DE LA FINANCIACIÓN DEL CARGO POR CONEXIÓN Y LA RED INTERNA PARA USUARIOS DE BARRIOS PERIFÉRICOS VEREDAS Y CENTROS POBLADOS DE LOS MUNICIPIOS DE Cundinamarca","MINAS Y ENERGÍA",10613927436,"SIN CONTRATAR",null,{"$f":"VLOOKUP(Tabla22[[#This Row],[BPIN ]],[1]Base1!F$3:Z$223,21,0)","v":"No definido"},45012,{"$f":"Tabla22[[#This Row],[FECHA ]]-Tabla22[[#This Row],[HOY]]","v":-45012},{"$f":"Tabla22[[#This Row],[FECHA ]]-Tabla22[[#This Row],[FECHA DE TERMINACIÓN2]]","v":{"$error":"#VALUE!"}}]
["CUNDINAMARCA","SECRETARIA DE EDUCACIÓN","YAHIR ARCINIEGAS","GENNY PADILLA",2022000050007,"Fortalecimiento a la Estrategia de Alimentación Escolar en los municipios no certificados del Departamento de Cundinamarca para la vigencia 2022 Cundinamarca\t","EDUCACIÓN","\t42.966.037.310,00","SIN CONTRATAR",null,{"$f":"VLOOKUP(Tabla22[[#This Row],[BPIN ]],[1]Base1!F$3:Z$223,21,0)","v":"No definido"},45012,{"$f":"Tabla22[[#This Row],[FECHA ]]-Tabla22[[#This Row],[HOY]]","v":-45012},{"$f":"Tabla22[[#This Row],[FECHA ]]-Tabla22[[#This Row],[FECHA DE TERMINACIÓN2]]","v":{"$error":"#VALUE!"}}]
["CUNDINAMARCA","SECRETARIA DE CIENCIA, TECNOLOGIA E INNOVACIÓN","YAHIR ARCINIEGAS","LUIS MANUEL GONZALEZ",2021000100467,"Fortalecimiento de las capacidades institucionales para el desarrollo y gestión del Ecosistema Territorial de CTeI en todas las provincias del Departamento de Cundinamarca\n","CTEL",2801037429,"SIN CONTRATAR",null,{"$f":"VLOOKUP(Tabla22[[#This Row],[BPIN ]],[1]Base1!F$3:Z$223,21,0)","v":44760},45012,{"$f":"Tabla22[[#This Row],[FECHA ]]-Tabla22[[#This Row],[HOY]]","v":-45012},{"$f":"Tabla22[[#This Row],[FECHA ]]-Tabla22[[#This Row],[FECHA DE TERMINACIÓN2]]","v":-44760}]
["CUNDINAMARCA","SECRETARIA DE CIENCIA, TECNOLOGIA E INNOVACIÓN","YAHIR ARCINIEGAS","LUIS MANUEL GONZALEZ",2021000100276,"Desarrollo DE UN MODELO DE PROMOCIÓN TURÍSTICA SOSTENIBLE DESDE LA TECNOLOGÍA 4.0 EN LOS MUNICIPIOS DE LA PALMA Y YACOPI EN EL DEPARTAMENTO DE Cundinamarca\n","CTEL",2608055295,"SIN CONTRATAR",null,{"$f":"VLOOKUP(Tabla22[[#This Row],[BPIN ]],[1]Base1!F$3:Z$223,21,0)","v":"No definido"},45012,{"$f":"Tabla22[[#This Row],[FECHA ]]-Tabla22[[#This Row],[HOY]]","v":-45012},{"$f":"Tabla22[[#This Row],[FECHA ]]-Tabla22[[#This Row],[FECHA DE TERMINACIÓN2]]","v":{"$error":"#VALUE!"}}]
["CUNDINAMARCA","SECRETARIA DE CIENCIA, TECNOLOGIA E INNOVACIÓN","YAHIR ARCINIEGAS","LUIS MANUEL GONZALEZ",2021000100523,"Desarrollo de Microredes y almacenamiento (ESS) prestadores de servicios complementarios para incrementar la cobertura eficiencia y confiabilidad del servicio en el departamento de Cundinamarca\n","CTEL",3942973233,"SIN CONTRATAR",null,{"$f":"VLOOKUP(Tabla22[[#This Row],[BPIN ]],[1]Base1!F$3:Z$223,21,0)","v":"No definido"},45012,{"$f":"Tabla22[[#This Row],[FECHA ]]-Tabla22[[#This Row],[HOY]]","v":-45012},{"$f":"Tabla22[[#This Row],[FECHA ]]-Tabla22[[#This Row],[FECHA DE TERMINACIÓN2]]","v":{"$error":"#VALUE!"}}]
["CUNDINAMARCA","SECRETARIA DE EDUCACIÓN","YAHIR ARCINIEGAS","GENNY PADILLA",2022004250011,"Fortalecimiento a la Estrategia de subsidio de Transporte Escolar en municipios no certificados del Departamento de Cundinamarca para la vigencia 2022 Cundinamarca","CTEL",24666685502,"CONTRATADO EN EJECUCIÓN",null,{"$f":"VLOOKUP(E124,[1]Base1!$A$3:$AD$220,21,0)","v":{"$error":"#N/A"}},45012,{"$f":"Tabla22[[#This Row],[FECHA ]]-Tabla22[[#This Row],[HOY]]","v":{"$error":"#VALUE!"}}]
["ENTIDAD APORTANTE RECURSOS","EMTEL","ALEXANDER RIVEROS/JEIMY FORERO","FABIAN CUESTA",2022004250006,"Implementación de una estrategia de reactivación económica para el progreso y la competitividad de micronegocios y unidades productivas en el Departamento de Cundinamarca","AGRICULTURA ",8993872200.5599995,"SIN CONTRATAR",null,{"$f":"VLOOKUP(Tabla22[[#This Row],[BPIN ]],[1]Base1!F$3:Z$223,21,0)","v":{"$error":"#VALUE!"}},45012,{"$f":"Tabla22[[#This Row],[FECHA ]]-Tabla22[[#This Row],[HOY]]","v":{"$error":"#VALUE!"}}]
["CUNDINAMARCA","SECRETARIA DE CIENCIA, TECNOLOGIA E INNOVACIÓN","YAHIR ARCINIEGAS","Implementación de una estrategia de reactivación económica para el progreso y la competitividad de micronegocios y unidades productivas en el Departamento de Cundinamarca",2021000100500,"Fortalecimiento del equilibrio ecosistémico mediante la innovación en los procesos de propagación vegetal orientados a la generación de conocimiento y uso sostenible en el Departamento de Cundinamarca","CTEL",4114706771,"NO HA MIGRADO A GESPROY",null,{"$f":"VLOOKUP(Tabla22[[#This Row],[BPIN ]],[1]Base1!F$3:Z$223,21,0)","v":{"$error":"#VALUE!"}},45012,{"$f":"Tabla22[[#This Row],[FECHA ]]-Tabla22[[#This Row],[HOY]]","v":{"$error":"#VALUE!"}}]
["CUNDINAMARCA","SECRETARIA DE HABITAT Y VIVIENDA","ALEXANDER RIVEROS/JEIMY FORERO","BEATRIZ GAMEZ",2018000050050,"Mejoramiento vivienda rural mediante construcción de cocinas habitaciones y pisos en los municipios de Cundinamarca","AGRICULTURA ",null,"EN PROCESO DE CONTRATACIÓN",null,{"$f":"VLOOKUP(Tabla22[[#This Row],[BPIN ]],[1]Base1!F$3:Z$223,21,0)","v":{"$error":"#VALUE!"}},45012,{"$f":"Tabla22[[#This Row],[FECHA ]]-Tabla22[[#This Row],[HOY]]","v":{"$error":"#VALUE!"}}]
["CUNDINAMARCA","SECRETARIA DE COMPETITIVIDAD","ALEXANDER RIVEROS/JEIMY FORERO","FABIAN CUESTA",2020000050035,"Fortalecimiento de los sistemas productivos a través de la reactivación del sector agrícola en el Departamento de Cundinamarca","AGRICULTURA ",8993872200.5599995,"EN PROCESO DE CONTRATACIÓN",null,{"$f":"VLOOKUP(Tabla22[[#This Row],[BPIN ]],[1]Base1!F$3:Z$223,21,0)","v":{"$error":"#VALUE!"}},45012,{"$f":"Tabla22[[#This Row],[FECHA ]]-Tabla22[[#This Row],[HOY]]","v":{"$error":"#VALUE!"}}]
["CUNDINAMARCA","SECRETARIA DE COMPETITIVIDAD","ALEXANDER RIVEROS/JEIMY FORERO","FABIAN CUESTA",2020000050038,"Optimización de los sistemas Ganaderos bovinos de carne leche y doble propósito a partir de la implementación de mejoramiento genético productivo y entrega de maquinaria y equipos en municipios del Departamento de Cundinamarca","AGRICULTURA ",8732449919,"SIN CONTRATAR",null,{"$f":"VLOOKUP(Tabla22[[#This Row],[BPIN ]],[1]Base1!F$3:Z$223,21,0)","v":{"$error":"#VALUE!"}},45012,{"$f":"Tabla22[[#This Row],[FECHA ]]-Tabla22[[#This Row],[HOY]]","v":{"$error":"#VALUE!"}}]

{"sheet":"Riesgo de liberación","index":2,"n_rows":7,"n_cols":18,"rows_kept":7,"cut":false,"hidden":true,"merged":[]}
[]
["N°","EJECUTOR (Dpto / Entidad)","EJECUTOR INTERNO","ENCARGADO DE LA ENTIDAD ","ENLACE EMTIDAD EJECUTORA","BPIN ","PROYECTO","SECTOR","VALOR PROYECTO","VALOR SGR","OTRAS FUENTES","FECHA DE APROBACIÓN OCAD","ACUERDO DE APROBACIÓN","ESTADO","FECHA LIMITE","DÍAS TRANSCURRIDOS DESDE EL ACUERDO DE APROBACIÓN  ","Columna1","DÍAS HABILES PARA REALIZAR ACTO DE APERTURA"]
[164,"ENTIDAD APORTANTE RECURSOS","UNIVERSIDAD DE CUNDINAMARCA","YAHIR ARCINIEGAS","LUIS MANUEL GONZALEZ",2020000100158,"FORTALECIMIENTO DE LA INFRAESTRUCTURA FÍSICA Y TECNOLÓGICA DEL CENTRO DE ESTUDIOS AGROAMBIENTALES DE LA UNIVERSIDAD DE CUNDINAMARCA AGROU CUNDINAMARCA ","CTEL",2024433669,1997753509,{"$f":"I3-J3","v":26680160},44111,"098 DE 2020","SIN CONTRATAR",{"$f":"IF(L3=0,\"-\",EDATE(L3,6))","v":44293},{"$f":"IF(L3=0,\"-\",_xlfn.DAYS(TODAY(),L3))","v":901},{"$f":"IF(O3=\"-\",\"-\",_xlfn.DAYS(TODAY(),O3))","v":719},{"$f":"-Tabla25[[#This Row],[Columna1]]","v":-719}]
[218,"CUNDINAMARCA","SECRETARIA DE AMBIENTE",null,null,2022004250025,"Fortalecimiento de la producción de material vegetal arbustivo y arbóreo para la recuperación de la cobertura arbórea en el departamento de Cundinamarca","AMBIENTE Y DESARROLLO SOSTENIBLE",3387966925,2857824455,{"$f":"I4-J4","v":530142470},44907,"474 DE 2022","SIN CONTRATAR",{"$f":"IF(L4=0,\"-\",EDATE(L4,6))","v":45089},{"$f":"IF(L4=0,\"-\",_xlfn.DAYS(TODAY(),L4))","v":105},{"$f":"IF(O4=\"-\",\"-\",_xlfn.DAYS(TODAY(),O4))","v":-77},{"$f":"-Q4","v":77}]
[219,"CUNDINAMARCA","ICCU - GESPROY GB","ALEXANDER RIVEROS/JEIMY FORERO","GIOVANY QUEVEDO",2022004250032,"Mejoramiento de la vía que comunica a los municipios de san Cayetano y Cogua tramo vereda cardonal vereda mortiño del municipio de san Cayetano departamento de Cundinamarca","TRANSPORTE",9976205175,9976205175,0,44907,"474 DE 2022","NO HA MIGRADO A GESPROY",{"$f":"IF(L5=0,\"-\",EDATE(L5,6))","v":45089},{"$f":"IF(L5=0,\"-\",_xlfn.DAYS(TODAY(),L5))","v":105},{"$f":"IF(O5=\"-\",\"-\",_xlfn.DAYS(TODAY(),O5))","v":-77},{"$f":"-Q5","v":77}]
[]
[null,null,null,null,null,null,null,null,null,{"$f":"SUM(J3:J5)","v":14831783139}]

{"sheet":"Control de avances","index":3,"n_rows":1651,"n_cols":33,"rows_kept":1651,"cut":false,"hidden":true,"merged":[[216,19,216,21],[217,19,217,21],[0,0,0,14],[0,18,0,19],[0,21,0,22],[214,19,214,21],[215,19,215,21]]}
[" SISTEMAS GENERAL DEL REGALÍAS-BASE DE PROYECTOS APROBADOS",null,null,null,null,null,null,null,null,null,null,null,null,null,null,null,null,null,"\tAVANCE FÍSICO Y FINANCIERO",null,null,"ESTADO"]
["N°","EJECUTOR (Dpto / Entidad)","EJECUTOR INTERNO","ENCARGADO DE LA ENTIDAD ","ENLACE EMTIDAD EJECUTORA","BPIM","PROYECTO","SECTOR","VALOR PROYECTO","VALOR SGR","OTRAS FUENTES","FECHA DE APROBACIÓN OCAD","ESTADO","\tAVANCE FÍSICO","\tAVANCE FINANCIERO",null,null,null,"presento avance en el mes vigente ",null,null,"presento avance en el mes vigente ",null,null,null,null,"ESTADO"]
[1,"CUNDINAMARCA","SECRETARIA DE AMBIENTE","ALEXANDER RIVEROS Y YAHIR ARCINIEGAS","EDUARDO ",2012000050005,"ESTUDIOS Y DISEÑOS DE DETALLE EMBALSE CALANDAIMA MUNICIPIO DE EL COLEGIO DEPARTAMENTO DE CUNDINAMARCA","AMBIENTE Y DESARROLLO SOSTENIBLE",4000000000,1000000000,{"$f":"I3-J3","v":3000000000},41271,"CERRADO",1,1,null,null,null,"lleva 1 mes sin reportar avance",null,null,"lleva 3 mes sin reportar avance",null,null,null,null,44972,44607,{"$f":"IF(AA3=0,0,_xlfn.DAYS(AA3,TODAY()))","v":-40},{"$f":"IF(AB3=0,0,_xlfn.DAYS(AB3,TODAY()))","v":-405},{"$f":"IF(Z3=0,0,_xlfn.DAYS(Z3,TODAY()))","v":0}]
[2,"DESENTRALIZADOS","ICCU - GESPROY GB","DIEGO TORRES / JEIMY FORERO","GIOVANY QUEVEDO",2012000050006,"CONSTRUCCIÓN CUBIERTA COLISEO DEL CENTRO AGROTECNOLOGICO DE EXPOSICIONES Y COMERCIALIZACION DE LA REGION DEL SUMAPAZ EN EL MUNICIPIO DE FUSAGASUGA - CUNDINAMARCA","TRANSPORTE",6352617736,3581530801,2771086935,41271,"CERRADO",1,0.99539999999999995,null,null,null,"lleva 3 mes sin reportar avance",null,null,"lleva 6 mes sin reportar avance",null,null,null,null,44972,44607,{"$f":"IF(AA4=0,0,_xlfn.DAYS(AA4,TODAY()))","v":-40},{"$f":"IF(AB4=0,0,_xlfn.DAYS(AB4,TODAY()))","v":-405},{"$f":"IF(Z4=0,0,_xlfn.DAYS(Z4,TODAY()))","v":0}]
[3,"CUNDINAMARCA","SECRETARIA DE AGRICULTURA","DIEGO TORRES/VALENTINA PORTILLO","JAVIER HERREDIA",2012000050007,"FORTALECIMIENTO DE LAS CADENAS HORTIFRUTICOLA Y AROMATICAS EN CUNDINAMARCA","AGRICULTURA ",2490400000,1300000000,1190400000,41271,"CERRADO",1,1,null,null,null,"lleva 4 mes sin reportar avance",null,null,"lleva 9 mes sin reportar avance",null,null,null,null,44607,44607,{"$f":"IF(AA5=0,0,_xlfn.DAYS(AA5,TODAY()))","v":-405},-405,{"$f":"IF(Z5=0,0,_xlfn.DAYS(Z5,TODAY()))","v":0}]
[4,"CUNDINAMARCA","SECRETARIA DE AGRICULTURA","DIEGO TORRES/VALENTINA PORTILLO","JAVIER HERREDIA",2012000050009,"FORTALECIMIENTO DE LA PRODUCTIVIDAD Y COMPETITIVIDAD DEL SECTOR CACAOTERO EN EL DEPARTAMENTO DE CUNDINAMARCA ","AGRICULTURA ",2334689275,1200000000,1134689275,41271,"CERRADO",1,0.96340000000000003,null,null,null,"lleva 6 mes sin reportar avance",null,null,"lleva 1 año sin reportar avance",null,null,null,null,44607,44607,{"$f":"IF(AA6=0,0,_xlfn.DAYS(AA6,TODAY()))","v":-405},-405,0]
[5,"CUNDINAMARCA","SECRETARIA GENERAL","YAHIR ARCINIEGAS","JIMENA TAFUR",2012000050010,"ESTUDIOS Y DISEÑOS PARA LA RECUPERACIÓN Y ADECUACION DEL PATRIMONIO HISTORICO CULTURAL PALACIO DE SAN FRANCISCO EN BOGOTA D.C. DEPARTAMENTO DE CUNDINAMARCA ","CULTURA ",1000000000,1000000000,0,41271,"TERMINADO",1,0.94640000000000002,null,null,null,null,null,null,null,null,null,null,null,44607,44607,-405,-405,0]
[6,"CUNDINAMARCA","SECRETARIA DE EDUCACIÓN","YAHIR ARCINIEGAS Y ALEXANDER RIVEROS","GENNY PADILLA",2012000050011,"FORTALECIMIENTO DE LA PERMANENCIA DE LOS ESTUDIANTES EN LOS MUNICIPIOS DEL DEPARTAMENTO DE CUNDINAMARCA DEPARTAMENTO DE CUNDINAMARCA\n","EDUCACIÓN",6000000000,6000000000,0,41187,"CERRADO",1,0.58189999999999997,null,null,null,null,null,null,null,null,null,null,null,44607,44607,-405,-405,0]
[7,"CUNDINAMARCA","SECRETARIA DE DESARROLLO E INCLUSIÓN SOCIAL","ALEXANDER RIVEROS Y JEIMY FORERO","TATIANA HERNANDEZ",2012000050012,"IMPLEMENTACIÓN DEL PROGRAMA DE COMPLEMENTACION ALIMENTARIA Y NUTRICIONAL EN MENORES DE 5 AÑOS, MUJERES GESTANTES Y LACTANTES EN TODO EL DEPARTAMENTO DE CUNDINAMARCA","SALUD Y PROTECCIÓN SOCIAL",4531022720,3000000000,1531022720,41187,"CERRADO",0.99039999999999995,0.99719999999999998,null,null,null,null,null,null,null,null,null,null,null,44607,44607,-405,-405,0]
[8,"CUNDINAMARCA","SECRETARIA DE TRANSPORTE Y MOVILIDAD","DAYANA FERNANDEZ Y EDGAR YAHIR ARCINIEGAS","JORGE PINZON",2012000050013,"ACTUALIZACION Y FORMULACION DE LOS ESTUDIOS Y DISEÑOS FASE II Y III DE LA EXTENCION NORTE - QUITO - SUR DEL SISTEMA TRANSMILENIO AL MUNICIPIO DE SOACHA DEPARTAMENTO DE CUNDINAMARCA ","SALUD Y PROTECCIÓN SOCIAL",4026917304,3130787355,896129949,41187,"CERRADO",0.96220000000000006,0.97030000000000005,null,null,null,null,null,null,null,null,null,null,null,44607,44607,-405,-405,0]
[9,"CUNDINAMARCA","SECRETARIA DE AGRICULTURA","DIEGO TORRES/VALENTINA PORTILLO","JAVIER HERREDIA",2012000050014,"MEJORAMIENTO DE LA COMPETITIVIDAD Y SOSTENIBILIDAD DEL SUB SECTOR PANELERO DE CUNDINAMARCA","AGRICULTURA ",1559272190,1300000000,259272190,41271,"CERRADO",1,1,null,null,null,null,null,null,null,null,null,null,null,44607,44607,-405,-405,0]
[10,"CUNDINAMARCA","SECRETARIA DE AGRICULTURA","DIEGO TORRES/VALENTINA PORTILLO","JAVIER HERREDIA",2012000050023,"FORTALECIMIENTO DE LA ACTIVIDAD CAFETERA COMO ALTERNATIVA SOSTENIBLE DE DESARROLLO REGIONAL EN EL DEPARTAMENTO DE CUNDINAMARCA ","AGRICULTURA ",77168795512,1300000000,75868795512,41271,"CERRADO",1,0.99990000000000001,null,null,null,null,null,null,null,null,null,null,null,44607,44607,-405,-405,0]
[11,"CUNDINAMARCA","SECRETARIA DE AGRICULTURA","DIEGO TORRES/VALENTINA PORTILLO","JAVIER HERREDIA",2012000050024,"IMPLEMENTACION DE UN MODELO DE PRODUCCION EN SISTEMAS DE DOBLE PROPOSITO EN PEQUEÑOS PRODUCTORES DEL DEPARTAMENTO DE CUNDINAMARCA","AGRICULTURA ",3371686373,1823985000,1547701373,41271,"CERRADO",1,0.99439999999999995,null,null,null,null,null,null,null,null,null,null,null,44607,44607,-405,-405,0]
[12,"CUNDINAMARCA","SECRETARIA DE GOBIERNO","YESID CASTAÑO","EDUARDO ",2012000050025,"ESTUDIOS Y DISEÑOS PARA LA CONSTRUCCIÓN DE UN CENTRO ESPECIALIZADO AL SERVICIO DE ADOLESCENTES INFRACTORES DE LA LEY EN EL DEPARTAMENTO DE CUNDINAMARCA","DEFENSA",200000000,200000000,0,41271,"CERRADO",1,1,null,null,null,null,null,null,null,null,null,null,null,44607,44607,-405,-405,0]
[13,"ENTIDAD APORTANTE RECURSOS","MUNICIPIO DE COGUA","ALEXANDER RIVEROS","SANDRA SHUAIB",2012000050026,"MEJORAMIENTO DE LA VA COGUA-SAN CAYETANO (SECTOR LAS MARGARITAS K8+300 SECTOR LAS MARGARITAS HASTA K10+300) CON K0+00 EN COGUA DEPARTAMENTO DE CUNDINAMARCA","TRANSPORTE",2000000000,2000000000,0,41271,"CERRADO",1,1,null,null,null,null,null,null,null,null,null,null,null,44607,44607,-405,-405,0]
[14,"DESENTRALIZADOS","ICCU - GESPROY GB","DIEGO TORRES / JEIMY FORERO","LUZ MARINA GALINDO",2012000050027,"MEJORAMIENTO DE LA VA UBALA-PALOMAS-MAMBITA (K0+00 UBICADO EN EL SITIO PROFESIONALES MUNICIPIO DE UBALA), DEPARTAMENTO DE CUNDINAMARCA ","TRANSPORTE",3359160462,3000000000,359160462,41271,"CERRADO",1,0.98660000000000003,null,null,null,null,null,null,null,null,null,null,null,44607,44607,-405,-405,0]
[15,"DESENTRALIZADOS","ICCU - GESPROY GB","DIEGO TORRES / JEIMY FORERO","GIOVANY QUEVEDO",2012000050028,"MEJORAMIENTO Y MANTENIMIENTO DE LA RED VIAL SECUNDARIA Y TERCIARIA MEDIANTE LA DOTACIÓN DE MAQUINARIA A LOS MUNICIPIOS DEL DEPARTAMENTO DE CUNDINAMARCA ","TRANSPORTE",19769772343,8103535586,11666236757,41271,"CERRADO",1,0.93179999999999996,null,null,null,null,null,null,null,null,null,null,null,44607,44607,-405,-405,0]
[16,"CUNDINAMARCA","SECRETARIA DE MINAS, ENERGIA Y GAS","DIEGO TORRES","JAHIR HERNANDEZ",2012000050029,"IMPLEMENTACIÓN Y MASIFICACION DEL SERVICIO DE GAS COMBUSTIBLE POR REDES PARA MUNICIPIOS DE ANOLAIMA, CACHIPAY, CHOACHI, FOMEQUE, UBAQUE Y VIOTA CUNDINAMARCA","MINAS Y ENERGÍA",15253036000,2199142000,13053894000,41271,"CERRADO",1,0.94499999999999995,null,null,null,null,null,null,null,null,null,null,null,44607,44607,-405,-405,0]
[17,"CUNDINAMARCA","SECRETARIA DE COMPETITIVIDAD","ALEXANDER RIVEROS/JEIMY FORERO","FABIAN CUESTA",2012000050030,"DESARROLLO CREACION Y FORTALECIMIENTO DE NUEVE (9) CENTROS DE EMPREDIMIENTO Y FORTALECIMIENTO EMPRESARIAL EN EL DEPARTAMENTO DE CUNDINAMARCA ","COMERCIO, INDUSTRIA Y TURISMO ",1752501814,1708104361,44397453,41271,"PARA CIERRE",1,0.95069999999999999,null,null,null,null,null,null,null,null,null,null,null,44607,44607,-405,-405,0]
[18,"ENTIDAD APORTANTE RECURSOS","MUNICIPIO DE MOSQUERA","DAYANA FERNANDEZ","GIOVANY QUEVEDO",2012000050039,"MEJORAMIENTO DE LA VIA CALLE 23 ENTRE CRA 3 Y 9B EN MOSQUERA CLL 7 ENTRE CRA 13 Y 24 EN FUNZA DEPARTAMENTO DE CUNDINAMARCA","TRANSPORTE",2816415712,1000000000,1816415712,41271,"CERRADO",1,1,null,null,null,null,null,null,null,null,null,null,null,44607,44607,-405,-405,0]
[19,"ENTIDAD APORTANTE RECURSOS","MUNICIPIO DE SOACHA","ALEXANDER RIVEROS","LUZ MARINA GALINDO",2012000050044,"REHABILITACIÓN Y MEJORAMIENTO DE LA VIA PARALELA ( TRANSVERSAL 8 Y CARRERA 7) ENTRE CARRERA 13 CON AUTOPISTA SUR BARRIO LA DESPENSA, HASTA LA CALLE 27 DEL CENTRO DEL MUNICIPIO DE SOACHA CUNDINAMARCA (TRAMO N 1 - K0+000 HASTA K0+262)","TRANSPORTE",1000000000,1000000000,0,41271,"CERRADO",1,1,null,null,null,null,null,null,null,null,null,null,null,44607,44607,-405,-405,0]
[20,"DESENTRALIZADOS","ICCU - GESPROY GB","DIEGO TORRES / JEIMY FORERO","GIOVANY QUEVEDO",2012000050051,"MEJORAMIENTO DEL PUENTE GUATIMBOL SOBRE EL RIO SUMAPAZ EN LA VA VENECIA - ICONONZO DEPARTAMENTO DE CUNDINAMARCA","TRANSPORTE",827195639,620304130,206891509,41271,"CERRADO",1,0.98089999999999999,null,null,null,null,null,null,null,null,null,null,null,44607,44607,-405,-405,0]
[21,"DESENTRALIZADOS","ICCU - GESPROY GB","DIEGO TORRES / JEIMY FORERO","GIOVANY QUEVEDO",2012000050052,"FORMULACIÓN Y ACTUALIZACION DE LOS ESTUDIOS Y DISEÑOS DE LA VIA UBAQUE - LOS CEREZOS - CHIPAQUE DEPARTAMENTO DE CUNDINAMARCA","TRANSPORTE",257457261,250000000,7457261,41271,"CERRADO",1,0.99960000000000004,null,null,null,null,null,null,null,null,null,null,null,44607,44607,-405,-405,0]
[22,"DESENTRALIZADOS","ICCU - GESPROY GB","DIEGO TORRES / JEIMY FORERO","GIOVANY QUEVEDO",2012000050054,"FORMULACIÓN Y ACTUALIZACION DE LOS ESTUDIOS Y DISEÑOS PARA EL MEJORAMIENTO DE LA TRONCAL DEL CARBON EN LONGITUD DE 43 KMS (K0+00 LOCALIZADO EN TIERRA NEGRA) DEPARTAMENTO DE CUNDINAMARCA","TRANSPORTE",777429075,755000000,22429075,41271,"CERRADO",1,0.99839999999999995,null,null,null,null,null,null,null,null,null,null,null,44607,44607,-405,-405,0]
[23,"CUNDINAMARCA","SECRETARIA DE CIENCIA, TECNOLOGIA E INNOVACIÓN","ALEXANDER RIVEROS Y YAHIR ARCINIEGAS","LUIS MANUEL GONZALEZ",2012000100010,"FORTALECIMIENTO DE LAS REGIONES COLOMBIANAS EN SUS CAPACIDADES DE CTI - CUNDINAMARCA","CTEL",8721806744,8721806744,0,41263,"CONTRATADO EN EJECUCIÓN",0.8488,0.97289999999999999,null,null,null,null,null,null,null,null,null,null,44972,44972,44972,-40,-40,-40]
[24,"CUNDINAMARCA","SECRETARIA DE CIENCIA, TECNOLOGIA E INNOVACIÓN","ALEXANDER RIVEROS Y YAHIR ARCINIEGAS","LUIS MANUEL GONZALEZ",2012000100056,"INVESTIGACIÓN ESTRATEGIAS DE VALORACION Y APROPIACION DE LOS RECURSOS NATURALES MECANISMOS DE ADAPTACION A CAMBIO CLIMATICO. REGION DEL BAJO MAGDALENA","CTEL",7184175232,4100000000,3084175232,41263,"CERRADO",1,0.99970000000000003,null,null,null,null,null,null,null,null,null,null,null,44607,44607,-405,-405,0]
[25,"CUNDINAMARCA","SECRETARIA DE CIENCIA, TECNOLOGIA E INNOVACIÓN","ALEXANDER RIVEROS Y YAHIR ARCINIEGAS","LUIS MANUEL GONZALEZ",2012000100063,"FORTALECIMIENTO DE LAS CAPACIDADES DE INNOVACIÓN SOCIAL POR MEDIO DEL PARQUE CIENTIFICO EN BOGOTA - CUNDINAMARCA","CTEL",16942704000,8250704000,8692000000,41263,"CERRADO",1,0.94730000000000003,null,null,null,null,null,null,null,null,null,null,null,44607,44607,-405,-405,0]
[26,"CUNDINAMARCA","SECRETARIA DE CIENCIA, TECNOLOGIA E INNOVACIÓN","ALEXANDER RIVEROS Y YAHIR ARCINIEGAS","LUIS MANUEL GONZALEZ",2012000100118,"FORMACION EN CIENCIA, TECNOLOGIA E INNOVACION EN LA COMUNIDAD EDUCATIVA DE LAS INSTITUCIONES EDUCATIVAS OFICIALES DE LOS MUNICIPIOS NO CERTIFICADOS DEL DEPARTAMENTO","CTEL",22788739251,17739839251,5048900000,41295,"CERRADO",0.98180000000000001,0.94810000000000005,null,null,null,null,null,null,null,null,null,null,null,44607,44607,-405,-405,0]
[27,"CUNDINAMARCA","SECRETARIA DE CIENCIA, TECNOLOGIA E INNOVACIÓN","ALEXANDER RIVEROS Y YAHIR ARCINIEGAS","LUIS MANUEL GONZALEZ",2012000100144,"INVESTIGACIÓN INVESTIGACION, DESARROLLO Y TRANSFERENCIA TECNOLOGICA EN EL SECTOR AGROPECUARIO Y AGROINDUSTRIAL CON EL FIN DE MEJORAR L TODO EL DEPARTAMENTO, CUNDINAMARCA, CENTRO ORIENTE","CTEL",50514736439,34707000000,15807736439,41263,"CONTRATADO EN EJECUCIÓN",0.84099999999999997,0.81569999999999998,null,null,null,null,null,null,null,null,null,null,45002,44635,45000,-377,-12,-10]
[28,"CUNDINAMARCA","SECRETARIA DE CIENCIA, TECNOLOGIA E INNOVACIÓN","ALEXANDER RIVEROS Y YAHIR ARCINIEGAS","LUIS MANUEL GONZALEZ",2012000100156,"CONSTRUCCIÓN DEL ECOSISTEMA DE INNOVACION TIC PARA EL DEPTO DE CUNDINAMARCA","CTEL",7088000000,5000000000,2088000000,41263,"CERRADO",0.98980000000000001,0.93179999999999996,null,null,null,null,null,null,null,null,null,null,null,44607,44607,-405,-405,0]
[29,"DESENTRALIZADOS","ICCU - GESPROY GB","DIEGO TORRES / JEIMY FORERO","GIOVANY QUEVEDO",2013000050003,"ESTUDIOS Y DISEÑOS PARA EL MEJORAMIENTO DE LA VA VILLAPINZON-TURMEQUE EN LONGITUD DE 11 KMS (K0+00 LOCALIZADO EN VILLAPINZON DEPARTAMENTO DE CUNDINAMARCA","TRANSPORTE",245000000,245000000,0,41400,"CERRADO",1,0.73470000000000002,null,null,null,null,null,null,null,null,null,null,null,44607,44607,-405,-405,0]
[30,"DESENTRALIZADOS","ICCU - GESPROY GB","DIEGO TORRES / JEIMY FORERO","EDWIN",2013000050004,"ESTUDIOS Y DISEÑOS PARA EL MEJORAMIENTO DE LA VA YACOPI - LA VICTORIA CON K0+00 EN YACOPI DEPARTAMENTO DE CUNDINAMARCA","TRANSPORTE",250000000,250000000,0,41400,"CERRADO",1,0.74909999999999999,null,null,null,null,null,null,null,null,null,null,null,44607,44607,-405,-405,0]
[31,"CUNDINAMARCA","SECRETARIA DE DESARROLLO E INCLUSIÓN SOCIAL","YAHIR ARCINIEGAS Y ALEXANDER RIVEROS","TATIANA HERNANDEZ",2013000050005,"IMPLEMENTACIÓN DEL PROGRAMA DE COMPLEMENTACION ALIMENTARIA Y NUTRICIONAL PARA MENORES DE CINCO AÑOS Y MUJERES GESTANTES Y LACTANTES EN TODO EL DEPARTAMENTO DE CUNDINAMARCA","EDUCACIÓN",6189832118,6000000000,189832118,41400,"CERRADO",0.99819999999999998,0.9899,null,null,null,null,null,null,null,null,null,null,null,44607,44607,-405,-405,0]
[32,"CUNDINAMARCA","SECRETARIA DE EDUCACIÓN","YAHIR ARCINIEGAS Y ALEXANDER RIVEROS","GENNY PADILLA",2013000050011,"FORTALECIMIENTO DE LA PERMANENCIA DE LOS ESTUDIANTES EN LOS MUNICIPIOS DEL DEPARTAMENTO DE CUNDINAMARCA 2013-2014 CUNDINAMARCA, CENTRO ORIENTE","EDUCACIÓN",13360387595,13360387595,0,41400,"CERRADO",0.998,0.9234,null,null,null,null,null,null,null,null,null,null,null,44607,44607,-405,-405,0]
[33,"CUNDINAMARCA","SECRETARIA DE MINAS, ENERGIA Y GAS","DIEGO TORRES","ALVARO CHACON",2013000050026,"CONSTRUCCIÓN REDES ELECTRICAS EN LA ZONA RURAL DE LOS MUNICIPIOS DE PARATEBUENO Y GUTIERREZ EN EL DEPARTAMENTO DE CUNDINAMARCA","MINAS Y ENERGÍA",1068319227,1045119227,23200000,41502,"PARA CIERRE",0.44929999999999998,0.44700000000000001,null,null,null,null,null,null,null,null,null,null,44793,45000,44607,-12,-405,-219]
[34,"CUNDINAMARCA","SECRETARIA DE AGRICULTURA","DIEGO TORRES/VALENTINA PORTILLO","JAVIER HERREDIA",2013000050027,"FORTALECIMIENTO DE LA ACTIVIDAD CAFETERA COMO ESTRATEGIA DE MEJORAMIENTO DE LA PRODUCTIVIDAD Y LA COMPETITIVIDAD EN EL DEPARTAMENTO DE CUNDINAMARCA, CENTRO ORIENTE","AGRICULTURA ",18756930869,3000000000,15756930869,41502,"CERRADO",1,0.99490000000000001,null,null,null,null,null,null,null,null,null,null,null,44607,44607,-405,-405,0]
[35,"CUNDINAMARCA","SECRETARIA DE AGRICULTURA","DIEGO TORRES/VALENTINA PORTILLO","JAVIER HERREDIA",2013000050028,"FORTALECIMIENTO DEL SUBSECTOR PANELERO EN EL DEPARTAMENTO DE CUNDINAMARCA","AGRICULTURA ",3427279826,2599564478,827715348,41502,"CERRADO",1,0.99960000000000004,null,null,null,null,null,null,null,null,null,null,null,44607,44607,-405,-405,0]
[36,"DESENTRALIZADOS","ICCU - GESPROY GB","DIEGO TORRES / JEIMY FORERO","GIOVANY QUEVEDO",2013000050043,"MEJORAMIENTO Y REHABILITACION DE LA VIA GUACHETA - CAPELLANIA (SECTOR K0+780 AL K2+240) K0+000 LOCALIZADO EN EL RIO UBATE GUACHET, CUNDINAMARCA, CENTRO ORIENTE","TRANSPORTE",1019047619,1000000000,19047619,41639,"CERRADO",1,0.98060000000000003,null,null,null,null,null,null,null,null,null,null,null,44607,44607,-405,-405,0]
[37,"ENTIDAD APORTANTE RECURSOS","BANCO AGRARIO DE COLOMBIA","DIEGO TORRES / JEIMY FORERO",null,2013000050044,"CONSTRUCCIÓN CUNDINAMARCA VISR 2013 TODO EL DEPARTAMENTO, CUNDINAMARCA, CENTRO ORIENTE","AGRICULTURA ",60041780218,15888838218,44152942000,41569,"CONTRATADO EN EJECUCIÓN",0.81020000000000003,0.85289999999999999,null,null,null,null,null,null,null,null,null,null,null,44607,44607,-405,-405,0]
[38,"DESENTRALIZADOS","ICCU - GESPROY GB","DIEGO TORRES / JEIMY FORERO","GIOVANY QUEVEDO",2013000050045,"MEJORAMIENTO Y PAVIMENTACIÓN DE LA VIA FOSCA - GUTIERREZ, DESDE EL KM 2+000 AL KM 3+000 (K0+000 LOCALIZADO EN FOSCA), DEPARTAMENTO DE CUNDINAMARCA","TRANSPORTE",2534999997,2000000000,534999997,41579,"CERRADO",1,0.97450000000000003,null,null,null,null,null,null,null,null,null,null,null,44607,44607,-405,-405,0]
[39,"CUNDINAMARCA","SECRETARIA DE MINAS, ENERGIA Y GAS","DIEGO TORRES","JAHIR HERNANDEZ",2013000050046,"IMPLEMENTACIÓN Y MASIFICACION DEL SERVICIO DE GAS COMBUSTIBLE POR REDES PARA LOS MUNICIPIOS DE CAPARRAPI, EL PEÑON, LA PALMA, PAIME, TOPAIPI Y VILLAGOMEZ CUNDINAMARCA","MINAS Y ENERGÍA",6609136508,2118963154,4490173354,41579,"CERRADO",1,1,null,null,null,null,null,null,null,null,null,null,null,44607,44607,-405,-405,0]
[40,"DESENTRALIZADOS","ICCU - GESPROY GB","DIEGO TORRES / JEIMY FORERO","GIOVANY QUEVEDO",2013000050047,"MEJORAMIENTO Y PAVIMENTACIÓN VIA GUANACAS - EL PEÑON DESDE EL K0+000 AL K2+000 (K0+000 UBICADO EN GUANACAS) MUNICIPIO EL PEÑON, CUNDINAMARCA","TRANSPORTE",3000000000,3000000000,0,41808,"CERRADO",1,0.99639999999999995,null,null,null,null,null,null,null,null,null,null,null,44607,44607,-405,-405,0]
[41,"DESENTRALIZADOS","ICCU - GESPROY GB","DIEGO TORRES / JEIMY FORERO","GIOVANY QUEVEDO",2013000050049,"MEJORAMIENTO Y MANTENIMIENTO DE LA RE VIAL MEDIANTE LA ADQUISICION DE MAQUINARIA AÑO 2013-2014 PARA LOS MUNICIPIOS DEL DEPARTAMENTO DE CUNDINAMARCA","TRANSPORTE",14330854376,12431431552,1899422824,41609,"CERRADO",1,0.99960000000000004,null,null,null,null,null,null,null,null,null,null,null,44607,44607,-405,-405,0]
[42,"DESENTRALIZADOS","ICCU - GESPROY GB","DIEGO TORRES / JEIMY FORERO","GIOVANY QUEVEDO",2013000050050,"MEJORAMIENTO Y PAVIMENTACIÓN DE LA VIA SANAME - PUENTE QUETAME DESDE K0+000 AL K1+500 (K0+000 LOCALIZADO EN PUENTE QUEMADO) MUNICIPIO FOSCA, CUNDINAMARCA","TRANSPORTE",6000000000,6000000000,0,41639,"CERRADO",1,0.49209999999999998,null,null,null,null,null,null,null,null,null,null,null,44607,44607,-405,-405,0]
[43,"CUNDINAMARCA","SECRETARIA DE AMBIENTE","ALEXANDER RIVEROS Y YAHIR ARCINIEGAS",null,2013000050051,"FORTALECIMIENTO DE LA GESTION INTEGRAL DE RESIDUOS SOLIDOS, A TRAVES DE SISTEMAS RECIONALES EN LAS PROVINCIAS DE UBATE Y RIONEGRO EN EL DEPARTAMENTO DE CUNDINAMARCA","VIVIENDA, CIUDAD Y TERRITORIO ",3000000000,3000000000,0,41579,"CERRADO",0.48280000000000001,0.47399999999999998,null,null,null,null,null,null,null,null,null,null,null,44607,44607,-405,-405,0]
[44,"CUNDINAMARCA","SECRETARIA DE AGRICULTURA","DIEGO TORRES/VALENTINA PORTILLO","JAVIER HERREDIA",2013000050054,"MEJORAMIENTO DE LA PRODUCTIVIDAD Y COMPETITIVIDAD DEL SECTOR CAUCHERO EN EL DEPARTAMENTO DE CUNDINAMARCA","AGRICULTURA ",3765860000,2459000000,1306860000,41639,"CERRADO",1,1,null,null,null,null,null,null,null,null,null,null,null,44607,44607,-405,-405,0]
[45,"CUNDINAMARCA","SECRETARIA DE GOBIERNO","YESID CASTAÑO","EDUARDO ",2013000050056,"PREVENCIN DE INCENDIOS FORESTALES CON LA ADQUISICION DE VEHICULOS 4X4 ACCION RAPIDA TIPO FORESTAL PARA EL DEPARTAMENTO DE CUNDINAMARCA","AMBIENTE Y DESARROLLO SOSTENIBLE",4000000000,4000000000,0,41579,"CERRADO",1,0.99990000000000001,null,null,null,null,null,null,null,null,null,null,null,44607,44607,-405,-405,0]
[46,"CUNDINAMARCA","SECRETARIA DE AGRICULTURA","DIEGO TORRES/VALENTINA PORTILLO","JAVIER HERREDIA",2013000050081,"MEJORAMIENTO DE LA PRODUCTIVIDAD, CALIDAD, POSCOSECHA Y MERCADEO DE LAS CADENAS HORTIFRUTCOLA Y AROMATICAS DE CUNDINAMARCA","AGRICULTURA ",4900400000,2600000000,2300400000,41808,"CERRADO",1,1,null,null,null,null,null,null,null,null,null,null,null,44607,44607,-405,-405,0]
[47,"CUNDINAMARCA","SECRETARIA DE AGRICULTURA","DIEGO TORRES/VALENTINA PORTILLO","JAVIER HERREDIA",2013000050083,"IMPLEMENTACIÓN Y PUESTA EN MARCHA DE UNA PLANTA HOMOGENIZADORA DE MIELES PARA LA PRODUCCION DE PANELA EN CAPARRAPI CUNDINAMARCA, CENTRO ORIENTE","AGRICULTURA ",3322683076.3200002,3126242524.3200002,196440552,41808,"CERRADO",1,1,null,null,null,null,null,null,null,null,null,null,null,44607,44607,-405,-405,0]
[48,"DESENTRALIZADOS","ICCU - GESPROY GB","DIEGO TORRES / JEIMY FORERO","GIOVANY QUEVEDO",2013000050094,"MEJORAMIENTO Y REHABILITACION DE LA VIA TABIO - CHIA DEL K1+100 AL K3+200","TRANSPORTE",2000000000,2000000000,0,41639,"DESAPROBADO",0,0,null,null,null,null,null,null,null,null,null,null,null,44607,44607,-405,-405,0]
[49,"CUNDINAMARCA","SECRETARIA DE CIENCIA, TECNOLOGIA E INNOVACIÓN","ALEXANDER RIVEROS Y YAHIR ARCINIEGAS","LUIS MANUEL GONZALEZ",2013000100129,"INCREMENTO EN LAS ESTRATEGIAS SUSTENTABLES EN EL USO DEL RECURSO DE ENERGA ELECTRICA PARA LA POBLACION VULNERABLE EN EL DPTO. DE CUNDINAMARCA","CTEL",5264002961,4097083299,1166919662,41789,"CONTRATADO EN EJECUCIÓN",0.82420000000000004,0.68520000000000003,null,null,null,null,null,null,null,null,null,null,44972,44607,44972,-405,-40,-40]
[50,"CUNDINAMARCA","SECRETARIA DE CIENCIA, TECNOLOGIA E INNOVACIÓN","ALEXANDER RIVEROS Y YAHIR ARCINIEGAS","LUIS MANUEL GONZALEZ",2013000100131,"INVESTIGACIÓN ESTIMAR VULNERABILIDAD AL CAMBIO CLIMATICO DE SISTEMAS CAFETEROS Y DISEÑO DE ARREGLOS AGROFORESTALES CON BIOTECNOLOGIA PACHO, TIBACUY, SAN JUAN DE RIO SECO, CUNDINAMARCA","AGRICULTURA ",3287867000,2622860000,665007000,41474,"CERRADO",0.98450000000000004,0.89039999999999997,null,null,null,null,null,null,null,null,null,null,null,44607,44607,-405,-405,0]
[51,"CUNDINAMARCA","SECRETARIA DE CIENCIA, TECNOLOGIA E INNOVACIÓN","ALEXANDER RIVEROS Y YAHIR ARCINIEGAS","LUIS MANUEL GONZALEZ",2013000100149,"INNOVACIÓN EN EL MODELO DE GESTION DE MEDICAMENTO EN EL DEPARTAMENTO DE CUNDINAMARCA FASE II","CTEL",3079583047,2490946916,588636131,41474,"CERRADO",1,1,null,null,null,null,null,null,null,null,null,null,null,44607,44607,-405,-405,0]
[52,"CUNDINAMARCA","SECRETARIA DE CIENCIA, TECNOLOGIA E INNOVACIÓN","ALEXANDER RIVEROS Y YAHIR ARCINIEGAS","LUIS MANUEL GONZALEZ",2013000100176,"INNOVACIÓN SISTEMA DE PRODUCCION DE FRUTAS/HORTALIZAS FRESCAS/PROCESADAS TIPO EXPORTACION CON TECNOLOGIA BIOLOGICA /INTEGRAL INOCUA SUBACHOQUE, CUNDINAMARCA, CENTRO ORIENTE","CTEL",9285096292,6556945302,2728150990,41474,"TERMINADO",1,0.68710000000000004,null,null,null,null,null,null,null,null,null,null,44972,44972,44972,-40,-40,-40]
[53,"CUNDINAMARCA","SECRETARIA DE CIENCIA, TECNOLOGIA E INNOVACIÓN","ALEXANDER RIVEROS Y YAHIR ARCINIEGAS","LUIS MANUEL GONZALEZ",2013000100180,"DISEÑO SMART TON: TALENTO E INNOVACION APLICADA AL TERRITORIO","CTEL",3089954000,2497510000,592444000,41509,"CERRADO",1,0.86539999999999995,null,null,null,null,null,null,null,null,null,null,null,44607,44607,-405,-405,0]
[54,"CUNDINAMARCA","SECRETARIA DE CIENCIA, TECNOLOGIA E INNOVACIÓN","ALEXANDER RIVEROS Y YAHIR ARCINIEGAS","LUIS MANUEL GONZALEZ",2013000100215,"FORTALECIMIENTO DE LA GESTIN COMUNITARIA DEL RECURSO HIDRICO, POR MEDIO DE LA DISMINUCION DEL CONSUMO DE ESTE, UTILIZANDO TP Y TICS , CUNDINAMARCA, CENTRO ORIENTE","CTEL",1811292700,1608461700,202831000,41565,"CERRADO",1,0.90739999999999998,null,null,null,null,null,null,null,null,null,null,null,44607,44607,-405,-405,0]
[55,"CUNDINAMARCA","SECRETARIA DE CIENCIA, TECNOLOGIA E INNOVACIÓN","ALEXANDER RIVEROS Y YAHIR ARCINIEGAS","LUIS MANUEL GONZALEZ",2013000100217,"FORTALECIMIENTO DE LA COMPETITIVIDAD DEL SECTOR FLORICULTOR COLOMBIANO MEDIANTE EL USO DE CIENCIA, TECNOLOGA E INNOVACION APLICADAS EN EL DEPARTAMENTO DE CUNDINAMARCA","CTEL",7204002875,4618409839,2585593036,41789,"CERRADO",1,0.9859,null,null,null,null,null,null,null,null,null,null,null,44607,44607,-405,-405,0]
[56,"CUNDINAMARCA","SECRETARIA DE CIENCIA, TECNOLOGIA E INNOVACIÓN","ALEXANDER RIVEROS Y YAHIR ARCINIEGAS","LUIS MANUEL GONZALEZ",2013000100247,"INVESTIGACIÓN E INNOVACIÓN TECNOLÓGICA Y APROPIACIÓN SOCIAL DE CONOCIMIENTO CIENTÍFICO DE ORQUÍDEAS NATIVAS DE CUNDINAMARCA","CTEL",3400306874,2551931927,848374947,41856,"CERRADO",0.96699999999999997,0.9526,null,null,null,null,null,null,null,null,null,null,null,44607,44607,-405,-405,0]
[57,"CUNDINAMARCA","SECRETARIA DE CIENCIA, TECNOLOGIA E INNOVACIÓN","ALEXANDER RIVEROS Y YAHIR ARCINIEGAS","LUIS MANUEL GONZALEZ",2013000100248,"INNOVACIÓN , CIENCIA Y TECNOLOGIA PARA PRODUCTORES DE LECHE EN LA PROVINCIA DE UBATE, CUNDINAMARCA.","CTEL",11619725567,9380319099,2239406468,41565,"TERMINADO",0.80249999999999999,0.81969999999999998,null,null,null,null,null,null,null,null,null,null,44740,44793,44760,-219,-252,-272]
[58,"ENTIDAD APORTANTE RECURSOS","MUNICIPIO DE MADRID","ALEXANDER RIVEROS",null,2013000050048,"MEJORAMIENTO Y PAVIMENTACIÓN DE LA VIA AJOVER-SANTA CRUZ EN 2 KILOMETROS, MUNICIPIO DE MADRID, CUNDINAMARCA","TRANSPORTE",8946944399,8700000000,246944399,41689,"CERRADO",1,1,null,null,null,null,null,null,null,null,null,null,null,44607,44607,-405,-405,0]
[59,"ENTIDAD APORTANTE RECURSOS","CORMAGDALENA","ALEXANDER RIVEROS",null,20132401060001,"MANTENIMIENTO Y RECUPERACIÓN DE LA NAVEGABILIDAD DEL RIO MAGDALENA","TRANSPORTE",3527443454052,117000000000,3410443454052,41514,"CERRADO",4.4999999999999998E-2,3.8300000000000001E-2,null,null,null,null,null,null,null,null,null,null,null,44607,44607,-405,-405,0]
[60,"DESENTRALIZADOS","ICCU - GESPROY GB","DIEGO TORRES / JEIMY FORERO","GIOVANY QUEVEDO",2014000050033,"MEJORAMIENTO Y REHABILITACIÓN DE LA VIA TABIO - CHIA DEL K0+000 AL K1+800","TRANSPORTE",2570000000,2000000000,570000000,41893,"CERRADO",1,1,null,null,null,null,null,null,null,null,null,null,null,44607,44607,-405,-405,0]
[61,"DESENTRALIZADOS","ICCU - GESPROY GB","DIEGO TORRES / JEIMY FORERO","GIOVANY QUEVEDO",2014257720001,"MEJORAMIENTO Y PAVIMENTACIÓN DE LA VIA SUESCA LA PLAYA - SESQUILE DEPARTAMENTO DE CUNDINAMARCA","TRANSPORTE",4191000000,1391000000,2800000000,41743,"CERRADO",1,0.98670000000000002,null,null,null,null,null,null,null,null,null,null,null,44607,44607,-405,-405,0]
[62,"CUNDINAMARCA","SECRETARIA DE GOBIERNO","DAYANA FERNANDEZ ","EDUARDO ",2014000050010,"CONSTRUCCIÓN DE UN CENTRO DE ATENCION ESPECIALIZADA AL SERVICIO DE ADOLESCENTES INFRACTORES DE LA LEY PENAL EN EL DEPARTAMENTO DE CUNDINAMARCA","JUSTICIA Y DEL DERECHO ",12758137579,8500000000,4258137579,41808,"PARA CIERRE",1,1,null,null,null,null,null,null,null,null,null,null,null,44607,44607,-405,-405,0]
[63,"ENTIDAD APORTANTE RECURSOS","MUNICIPIO DE VILLETA","ALEXANDER RIVEROS",null,2014000050048,"MEJORAMIENTO Y PAVIMENTACIÓN DE LA VIA VILLETA-PANTANILLO-CORREDOR CHUGUACAL -CAMBAO DEL K0+360 AL K1+060 VILLETA, CUNDINAMARCA, CENTRO ORIENTE","TRANSPORTE",1701612797,1489209370.23,212403426.76999998,42089,"CERRADO",1,1,null,null,null,null,null,null,null,null,null,null,null,44607,44607,-405,-405,0]
[64,"DESENTRALIZADOS","ICCU - GESPROY GB","DIEGO TORRES / JEIMY FORERO","GIOVANY QUEVEDO",2015000050010,"MEJORAMIENTO DE LA VA SAN CAYETANO - COGUA SECTOR K6+670 - K8+366 (K0+000 LOCALIZADO EN EL CASCO URBANO DEL MUNICIPIO DE SAN CAYETANO) CUNDINAMARCA","TRANSPORTE",3796247522,3000000000,796247522,42158,"CERRADO",1,0.98760000000000003,null,null,null,null,null,null,null,null,null,null,null,44607,44607,-405,-405,0]
[65,"DESENTRALIZADOS","ICCU - GESPROY GB","DIEGO TORRES / JEIMY FORERO","GIOVANY QUEVEDO",2015000050013,"MEJORAMIENTO DE LA VA UBAQUE - LOS CEREZOS - CHIPAQUE SECTORES DEL K0+000 AL K2+040 Y DEL K16+000 AL K18+260 (K0+000 LOCALIZADO EN UBAQUE) DEPARTAMENTO DE CUNDINAMARCA","TRANSPORTE",8000000000,8000000000,{"$f":"I67-J67","v":0},42159,"CERRADO",0.99709999999999999,0.98750000000000004,null,null,null,null,null,null,null,null,null,null,null,44607,44607,-405,-405,0]
[66,"CUNDINAMARCA","SECRETARIA DE HABITAT Y VIVIENDA","ALEXANDER RIVEROS/JEIMY FORERO","BEATRIZ GAMEZ",2015000050014,"CONSTRUCCIÓN DE VIVIENDAS NUEVAS RURALES VISR 2015 EN EL DEPARTAMENTO DE CUNDINAMARCA-SGR","AGRICULTURA ",7588896000,6840269782,748626218,42173,"CERRADO",1,0.92759999999999998,null,null,null,null,null,null,null,null,null,null,null,44607,44607,{"$f":"IF(AA68=0,0,_xlfn.DAYS(AA68,TODAY()))","v":-405},-405,0]
[67,"CUNDINAMARCA","SECRETARIA DE EDUCACIÓN","DAYANA FERNANDEZ","GENNY PADILLA",2015000050015,"FORTALECIMIENTO DE LA PERMANENCIA DE LOS ESTUDIANTES EN LOS MUNICIPIOS DEL DEPARTAMENTO DE CUNDINAMARCA, CENTRO ORIENTE - 2015","EDUCACIÓN",8373797030,8373797030,0,42159,"CERRADO",0.97070000000000001,0.85189999999999999,null,null,null,null,null,null,null,null,null,null,null,44607,44607,-405,-405,{"$f":"IF(Z69=0,0,_xlfn.DAYS(Z69,TODAY()))","v":0}]
[68,"DESENTRALIZADOS","ICCU - GESPROY GB","DIEGO TORRES / JEIMY FORERO","GIOVANY QUEVEDO",2015000050025,"MEJORAMIENTO Y PAVIMENTACIÓN DE LA TRONCAL DEL CARBON SECTOR K0+000 AL K2+860 (K0+000 LOCALIZADO EN TIERRA NEGRA, MUNICIPIO DE TAUSA), DEPARTAMENTO DE CUNDINAMARCA","TRANSPORTE",7913699780,6000000000,1913699780,42159,"CERRADO",1,1,null,null,null,null,null,null,null,null,null,null,null,44607,44607,-405,-405,0]
[69,"CUNDINAMARCA","SECRETARIA DE EDUCACIÓN","DAYANA FERNANDEZ","GENNY PADILLA",2015000050026,"FORTALECIMIENTO A LA ESTRATEGIA DE ALIMENTACIÓN ESCOLAR PARA MUNICIPIOS NO CERTIFICADOS DEL DEPARTAMENTO DE CUNDINAMARCA, CENTRO ORIENTE","EDUCACIÓN",2100000000,2100000000,0,42159,"CERRADO",1,0.85509999999999997,null,null,null,null,null,null,null,null,null,null,null,44607,44607,-405,-405,0]
[70,"CUNDINAMARCA","SECRETARIA DE AGRICULTURA","DIEGO TORRES/VALENTINA PORTILLO","JAVIER HERREDIA",2015000050029,"IMPLEMENTACIÓN Y PUESTA EN MARCHA DE UNA PLANTA HOMOGENIZADORA DE MIELES PARA LA PRODUCCION DE PANELA EN EL MUNICIPIO DE QUIPILE, CUNDINAMARCA, CENTRO ORIENTE","AGRICULTURA ",3395531657,3139511657,256020000,42180,"CERRADO",1,1,null,null,null,null,null,null,null,null,null,null,null,44607,44607,-405,-405,0]
[71,"CUNDINAMARCA","SECRETARIA DE AGRICULTURA","DIEGO TORRES/VALENTINA PORTILLO","JAVIER HERREDIA",2015000050030,"FORTALECIMIENTO A LA CADENA PRODUCTIVA DEL CACAO EN EL DEPARTAMENTO DE CUNDINAMARCA","AGRICULTURA ",2253334400,1200000000,1053334400,42159,"CERRADO",1,1,null,null,null,null,null,null,null,null,null,null,null,44607,44607,-405,-405,0]
[72,"CUNDINAMARCA","SECRETARIA DE GOBIERNO","DAYANA FERNANDEZ","EDUARDO ",2015000050031,"ADQUISICIÓN DE VEHICULOS PARA LOS CUERPOS OPERATIVOS (BOMBEROS) PARA LAS PROVINCIAS DEL DEPARTAMENTO DE CUNDINAMARCA","AMBIENTE Y DESARROLLO SOSTENIBLE",3670000000,3670000000,0,42159,"CERRADO",1,0.98,null,null,null,null,null,null,null,null,null,null,null,44607,44607,-405,-405,0]
[73,"CUNDINAMARCA","SECRETARIA DE AGRICULTURA","DIEGO TORRES/VALENTINA PORTILLO","JAVIER HERREDIA",2015000050034,"FORTALECIMIENTO DE LA PRODUCTIVIDAD Y COMPETITIVIDAD DEL SECTOR CAUCHERO EN EL DEPARTAMENTO DE CUNDINAMARCA","AGRICULTURA ",2158800000,1500000000,658800000,42159,"CERRADO",1,1,null,null,null,null,null,null,null,null,null,null,null,44607,44607,-405,-405,0]
[74,"DESENTRALIZADOS","ICCU - GESPROY GB","DIEGO TORRES / JEIMY FORERO","GIOVANY QUEVEDO",2015000050041,"MEJORAMIENTO DE LA VA UBALA - PALOMAS - MAMBITA - MEDINA (K0+000 UBICADO EN EL SITIO PROFESIONALES MUNICIPIO DE UBALA, DEPARTAMENTO DE CUNDINAMARCA","TRANSPORTE",13663491451,12663491451,1000000000,42180,"CERRADO",1,1,null,null,null,null,null,null,null,null,null,null,null,44607,44607,-405,-405,0]
[75,"CUNDINAMARCA","SECRETARIA DE DESARROLLO E INCLUSIÓN SOCIAL","DAYANA FERNANDEZ","TATIANA HERNANDEZ",2015000050048,"IMPLEMENTACIÓN DEL PROGRAMA DE COMPLEMENTACION ALIMENTARIA Y NUTRICIONAL PARA MENORES DE 5 AÑOS, MADRES GESTANTES Y LACTANTES EN TODO EL DEPARTAMENTO DE CUNDINAMARCA 2015","SALUD Y PROTECCIÓN SOCIAL",2900000000,2900000000,0,42348,"CERRADO",1,1,null,null,null,null,null,null,null,null,null,null,null,44607,44607,-405,-405,0]
[76,"CUNDINAMARCA","SECRETARIA DE EDUCACIÓN","YAHIR ARCINIEGAS Y ALEXANDER RIVEROS",null,2016000050005,"FORTALECIMIENTO DE LA PERMANENCIA DE LOS ESTUDIANTES EN LOS MUNICIPIOS DEL DEPARTAMENTO DE CUNDINAMARCA, CENTRO ORIENTE - 2016","EDUCACIÓN",14963757156,14963757156,0,42605,"CERRADO",0.96699999999999997,0.56169999999999998,null,null,null,null,null,null,null,null,null,null,null,44607,44607,-405,-405,0]
[77,"CUNDINAMARCA","SECRETARIA DE EDUCACIÓN","DAYANA FERNANDEZ","GENNY PADILLA",2016000050014,"FORTALECIMIENTO A LA ESTRATEGIA DE ALIMENTACION ESCOLAR PARA MUNICIPIOS NO CERTIFICADOS DEL DEPARTAMENTO DE CUNDINAMARCA, SGR 2016.","EDUCACIÓN",12339894658,12339894658,0,42625,"CERRADO",0.76700000000000002,0.74729999999999996,null,null,null,null,null,null,null,null,null,null,null,44607,44607,-405,-405,0]
[78,"DESENTRALIZADOS","ICCU - GESPROY GB","DIEGO TORRES / JEIMY FORERO","GIOVANY QUEVEDO",2016000050023,"MANTENIMIENTO DE LA RED VIAL EN AFIRMADO A TRAVS DE LA ADQUISICION DE MAQUINARIA PESADA Y EQUIPO DE TRANSPORTE EN EL DEPARTAMENTO DE CUNDINAMARCA","TRANSPORTE",24179817530,24179817530,0,43066,"CERRADO",0.9133,0.62809999999999999,null,null,null,null,null,null,null,null,null,null,null,44607,44607,-405,-405,0]
[79,"DESENTRALIZADOS","ICCU - GESPROY GB","DIEGO TORRES / JEIMY FORERO","GIOVANY QUEVEDO",2016000050025,"REHABILITACIÓN DE LA VIA BOQUERON - PANDI DEL DEPARTAMENTO DE CUNDINAMARCA","TRANSPORTE",4991550669,4991550669,0,42825,"CERRADO",1,0.98740000000000006,null,null,null,null,null,null,null,null,null,null,null,44607,44607,-405,-405,0]
[80,"DESENTRALIZADOS","ICCU - GESPROY GB","DIEGO TORRES / JEIMY FORERO","GIOVANY QUEVEDO",2016000050029,"REHABILITACIÓN DE LA VIA LA QUINTA - REPRESA DEL NEUSA, MUNICIPIO DE COGUA, DEPARTAMENTO DE CUNDINAMARCA","TRANSPORTE",6798676732,5625757063,1172919669,42846,"CERRADO",1,0.99990000000000001,null,null,null,null,null,null,null,null,null,null,null,44607,44607,-405,-405,0]
[81,"DESENTRALIZADOS","ICCU - GESPROY GB","DIEGO TORRES / JEIMY FORERO","GIOVANY QUEVEDO",2016000050032,"REHABILITACIÓN DE LA VIA CLUB EL BOSQUE - TIBACUY - CUMACA DEL DEPARTAMENTO DE CUNDINAMARCA","TRANSPORTE",4022150134,3022150134,1000000000,42825,"CERRADO",1,0.99980000000000002,null,null,null,null,null,null,null,null,null,null,null,44607,44607,-405,-405,0]
[82,"ENTIDAD APORTANTE RECURSOS","ALCALDIA MAYOR DE BOGOTA","ALEXANDER RIVEROS","ESPERANZA GUZMAN",2016000050033,"ELABORACIÓN DE LA ENCUESTA MULTIPROPOSITO 2017 : BOGOTA - CUNDINAMARCA","VIVIENDA, CIUDAD Y TERRITORIO ",17282722269,16761722269,521000000,42825,"CERRADO",1,0.99950000000000006,null,null,null,null,null,null,null,null,null,null,null,44607,44607,-405,-405,0]
[83,"CUNDINAMARCA","SECRETARIA DE HABITAT Y VIVIENDA","ALEXANDER RIVEROS/JEIMY FORERO","BEATRIZ GAMEZ",2016000050052,"CONSTRUCCIÓN DE VIVIENDAS NUEVAS RURALES EN EL DEPARTAMENTO DE CUNDINAMARCA","AGRICULTURA ",5983779025.1700001,5343748804.6800003,640030220.48999977,43090,"CONTRATADO EN EJECUCIÓN",0.99990000000000001,0.99360000000000004,null,null,null,null,null,null,null,null,null,null,44972,44607,44793,-405,-219,-40]
[84,"CUNDINAMARCA","SECRETARIA DE CIENCIA, TECNOLOGIA E INNOVACIÓN","ALEXANDER RIVEROS Y YAHIR ARCINIEGAS","LUIS MANUEL GONZALEZ",2016000100027,"ANLISIS DE FACTORES GENETICOS, SANITARIOS Y MEDIOAMBIENTALES QUE AFECTAN LAS TASAS DE PREÑEZ A PARTIR DE EMBRIONES IN VITRO EN EL DEPARTAMENTO DE CUNDINAMARCA","CTEL",8135504363,6359045755,{"$f":"I86-J86","v":1776458608},43098,"CONTRATADO EN EJECUCIÓN",0.2409,0.86880000000000002,null,null,null,null,null,null,null,null,null,null,44760,44607,44972,-405,-40,-252]
[85,"CUNDINAMARCA","ENTIDAD DESIGNADA PARA LA SUPERVISIÓN DEL PROYECTO O PARA CONTRATAR LA INTERVENTORÍA RAPE - INTERVENTORIA SECRETARIA DE PLANEACIÓN","YAHIR ARCINIEGAS","ANGELA MARTINEZ",2016000050012,"Implementación DE ACCIONES DE CONSERVACIoN Y RESTAURACIoN DE LOS COMPLEJOS DE PaRAMO, BOSQUE ALTO-ANDINO Y SERVICIOS ECOSISTeMICOS DE LA REGIoN CENTRAL","AMBIENTE Y DESARROLLO SOSTENIBLE",32499987282,{"$f":"I87","v":32499987282},0,42829,"TERMINADO",0.99809999999999999,0.99880000000000002,null,null,null,null,null,null,null,null,null,null,44793,44793,44972,-219,-40,-219]
[86,"CUNDINAMARCA","SECRETARIA DE DESARROLLO E INCLUSIÓN SOCIAL","ALEXANDER RIVEROS Y JEIMY FORERO","TATIANA HERNANDEZ",2017000050017,"FORTALECIMIENTO DEL PROGRAMA DE COMPLEMENTACIÓN ALIMENTARIA Y NUTRICIONAL PARA NIÑAS, NIÑOS MENORES DE 5 AÑOS Y MADRES GESTANTES Y LACTANTES EN RIESGO DE DESNUTRICIÓN DEL DEPARTAMENTO DE CUNDINAMARCA","INCLUSIÓN SOCIAL Y RECONCILIACIÓN",8199993544,8199993544,0,42915,"CERRADO",1,null,null,null,null,null,null,null,null,null,null,null,44793,44607,44607,-405,-405,-219]
[87,"CUNDINAMARCA","SECRETARIA DE EDUCACIÓN","YAHIR ARCINIEGAS Y ALEXANDER RIVEROS","PABLO CAJAMARCA",2017000050027,"FORTALECIMIENTO DE LA PERMANENCIA DE LOS ESTUDIANTES EN LOS MUNICIPIOS DEL DEPARTAMENTO DE CUNDINAMARCA , CENTRO ORIENTE 2017 CUNDINAMARCA","EDUCACIÓN",14995289800,14995289800,0,42961,"CERRADO",1,0.88590000000000002,null,null,null,null,null,null,null,null,null,null,44740,44760,44607,-252,-405,-272]
[88,"ENTIDAD APORTANTE RECURSOS","MUNICIPIO DE ZIPAQUIRA","ALEXANDER RIVEROS","JAIRO JARA",2017000050029,"CONSERVACIÓN  Y GESTIÓN INTEGRAL DEL RECURSO HÍDRICO MEDIANTE LA ADQUISICIÓN Y RESTAURACIÓN DE PREDIOS DE INTERÉS ECOSISTÉMICO EN ELDEPARTAMENTO DE   CUNDINAMARCA","AMBIENTE Y DESARROLLO SOSTENIBLE",900000000,467000000,433000000,43340,"CONTRATADO EN EJECUCIÓN",0.3327,0.47539999999999999,null,null,null,null,null,null,null,null,null,null,null,44607,44607,-405,-405,0]
[89,"CUNDINAMARCA","SECRETARIA DE EDUCACIÓN","YAHIR ARCINIEGAS Y ALEXANDER RIVEROS","GENNY PADILLA",2017000050033,"FORTALECIMIENTO A LA ESTRATEGIA DE ALIMENTACIÓN ESCOLAR PARA MUNICIPIOS NO CERTIFICADOS DEL DEPARTAMENTO DE CUNDINAMARCA","EDUCACIÓN",14000000000,14000000000,0,42977,"CERRADO",1,0.26939999999999997,null,null,null,null,null,null,null,null,null,null,null,44607,44607,-405,-405,0]
[90,"CUNDINAMARCA","SECRETARIA DE MINAS, ENERGIA Y GAS","DIEGO TORRES / LIYUGETH ALFONSO","JAHIR HERNANDEZ",2017000050036,"IMPLEMENTACIÓN Y EXPANSIÓN DEL SERVICIO DE GAS COMBUSTIBLE POR REDES PARA VEREDAS Y CENTROS POBLADOS DEL DEPARTAMENTO DE CUNDINAMARCA","MINAS Y ENERGÍA",4751658472,3069656503,1682001969,43356,"CERRADO",0.91510000000000002,0.92069999999999996,null,null,null,null,null,null,null,null,null,null,null,44972,44635,-40,-377,0]
[91,"CUNDINAMARCA","SECRETARIA DE PLANEACIÓN","YESID CASTAÑO Y JEIMY FORERO","RUSVEL NIETO",2017000050039,"MEJORAMIENTO DE VÍAS TERCIARIAS MEDIANTE EL USO DE PLACA HUELLA EN LOS MUNICIPIOS DE GUATAVITA, PACHO, SAN JUAN DE RIOSECO, SUBACHOQUE, TENA Y ZIPAQUIRÁ, DEPARTAMENTO DE CUNDINAMARCA","TRANSPORTE",6791102421.6400003,6725380621.6400003,65721800,43124,"CONTRATADO EN EJECUCIÓN",0.98519999999999996,0.92030000000000001,null,null,null,null,null,null,null,null,null,null,44760,44607,44607,-405,-405,-252]
[92,"CUNDINAMARCA","SECRETARIA DE HABITAT Y VIVIENDA","ALEXANDER RIVEROS/JEIMY FORERO","BEATRIZ GAMEZ",2017000050042,"MEJORAMIENTO DE VIVIENDAS RURALES DE LA PROVINCIA DE UBATÉ - CUNDINAMARCA"," ",2354318125,2354318125,0,43096,"TERMINADO",1,0.99729999999999996,null,null,null,null,null,null,null,null,null,null,44972,44741,44980,-271,-32,-40]
[93,"CUNDINAMARCA","SECRETARIA DE SALUD","DAYANA FERNANDEZ Y EDGAR YAHIR ARCINIEGAS","OLGA LUCIA GARZON",2017000050061,"ADQUISICIÓN AMBULANCIAS DE TRANSPORTE ASISTENCIAL BÁSICO (TAB) Y TRANSPORTE ASISTENCIAL MEDICALIZADA (TAM), PARA EL APOYO DEL SISTEMA DE REFERENCIA Y CONTRA REFERENCIA DE LA RED HOSPITALARIA DEL DEPARTAMENTO DE CUNDINAMARCA","SALUD Y PROTECCIÓN SOCIAL",3764666699,2000553024,1764113675,43081,"CERRADO",1,0.9708,null,null,null,null,null,null,null,null,null,null,null,44607,44607,-405,-405,0]
[94,"CUNDINAMARCA","SECRETARIA DE AGRICULTURA","DIEGO TORRES/VALENTINA PORTILLO","JAVIER HERREDIA",2017000050062,"FORTALECIMIENTO DE LAS CADENAS PRODUCTIVAS DE MANGO, AGUACATE Y CÍTRICOS EN EL DEPARTAMENTO DE CUNDINAMARCA","AGRICULTURA ",3000129600,2100129600,900000000,43124,"CERRADO",1,1,null,null,null,null,null,null,null,null,null,null,null,44607,44607,-405,-405,0]
[95,"CUNDINAMARCA","SECRETARIA DE MINAS, ENERGIA Y GAS","DIEGO TORRES / LIYUGETH ALFONSO","JAHIR HERNANDEZ",2017000050064,"CONSTRUCCIÓN DE REDES ELÉCTRICAS EN ZONA RURAL DE 13 MUNICIPIOS, EN EL MARCO DEL PROYECTO ILUMINANDO VIDAS DEL DEPARTAMENTO DE CUNDINAMARCA","MINAS Y ENERGÍA",2972842689,2532327281,440515408,43273,"CERRADO",0.82330000000000003,0.81879999999999997,null,null,null,null,null,null,null,null,null,null,null,44607,44607,-405,-405,0]
[96,"CUNDINAMARCA","SECRETARIA DE AGRICULTURA","DIEGO TORRES/VALENTINA PORTILLO","JAVIER HERREDIA",2017000050065,"MEJORAMIENTO DE LA PRODUCTIVIDAD Y RENTABILIDAD DE LOS CAFICULTORES DEL DEPARTAMENTO DE CUNDINAMARCA","AGRICULTURA ",6523880054,4220000000,2303880054,43096,"TERMINADO",0.86480000000000001,0.84630000000000005,null,null,null,null,null,null,null,null,null,null,44972,44793,44972,-219,-40,-40]
[97,"CUNDINAMARCA","SECRETARIA DE CIENCIA, TECNOLOGIA E INNOVACIÓN","ALEXANDER RIVEROS Y YAHIR ARCINIEGAS","LUIS MANUEL GONZALEZ",2017000100016,"IMPLEMENTACIÓN PROGRAMA DE INNOVACIÓN PARA LA VALIDACIÓN Y GENERACIÓN DE PRODUCTOS DERIVADOS DE LA BIODIVERSIDAD EN EL DEPARTAMENTO DE CUNDINAMARCA","CTEL",4825004077.9799995,3664086788.1700001,1160917289.8099995,42941,"CONTRATADO EN EJECUCIÓN",0.7883,0.94320000000000004,null,null,null,null,null,null,null,null,null,null,44972,44607,45002,-405,-10,-40]
[98,"CUNDINAMARCA","SECRETARIA DE CIENCIA, TECNOLOGIA E INNOVACIÓN","ALEXANDER RIVEROS Y YAHIR ARCINIEGAS","LUIS MANUEL GONZALEZ",2017000100034,"IMPLEMENTACIÓN DE UN SISTEMA DE GESTIÓN DE INNOVACIÓN PARA LA INDUSTRIA DE CUNDINAMARCA","CTEL",3925471448,3714407118,211064330,42941,"CONTRATADO EN EJECUCIÓN",0.99209999999999998,0.94179999999999997,null,null,null,null,null,null,null,null,null,null,null,44607,44706,-405,-306,0]
[99,"CUNDINAMARCA","SECRETARIA DE CIENCIA, TECNOLOGIA E INNOVACIÓN","ALEXANDER RIVEROS Y YAHIR ARCINIEGAS","LUIS MANUEL GONZALEZ",2017000100074,"IMPLEMENTACIÓN DE ESTRATEGIAS DE FOMENTO A LA CULTURA Y SERVICIOS DE INNOVACIÓN EN LAS PROVINCIAS SABANA OCCIDENTE, SABANA CENTRAL, SOACHA Y SUMAPAZ CUNDINAMARCA","CTEL",6183633276,5533633276,650000000,43098,"TERMINADO",1,0.99709999999999999,null,null,null,null,null,null,null,null,null,null,44972,44706,44980,-306,-32,-40]
[100,"CUNDINAMARCA","SECRETARIA DE CIENCIA, TECNOLOGIA E INNOVACIÓN","ALEXANDER RIVEROS Y YAHIR ARCINIEGAS","LUIS MANUEL GONZALEZ",2017000100076,"FORTALECIMIENTO DE CAPACIDADES DE GESTIÓN DEL RIESGO A TRAVÉS DE APROPIACIÓN SOCIAL DE LA CIENCIA, LA TECNOLOGÍA Y LA INNOVACIÓN EN EL DEPARTAMENTO DE CUNDINAMARCA","CTEL",4404970720,4000000000,404970720,43322,"CONTRATADO EN EJECUCIÓN",0.70069999999999999,0.96120000000000005,null,null,null,null,null,null,null,null,null,null,44972,44607,45002,-405,-10,-40]
[101,"CUNDINAMARCA","SECRETARIA DE CIENCIA, TECNOLOGIA E INNOVACIÓN","ALEXANDER RIVEROS Y YAHIR ARCINIEGAS","LUIS MANUEL GONZALEZ",2017000100087,"FORMACIÓN DE TALENTO HUMANO DE ALTO NIVEL EN MAESTRÍAS EN EL DEPARTAMENTO DE CUNDINAMARCA","CTEL",5148022960,5048022960,100000000,43698,"CONTRATADO EN EJECUCIÓN",0.60589999999999999,0.91639999999999999,null,null,null,null,null,null,null,null,null,null,44915,44972,45003,-40,-9,-97]
[102,"CUNDINAMARCA","SECRETARIA DE CIENCIA, TECNOLOGIA E INNOVACIÓN","ALEXANDER RIVEROS Y YAHIR ARCINIEGAS","LUIS MANUEL GONZALEZ",2017000100104,"FORTALECIMIENTO DE LA CULTURA DE LA GESTIÓN Y UTILIZACIÓN DEL CONOCIMIENTO EN CTEI EN NIÑOS, JÓVENES Y COMUNIDADES DEL DEPARTAMENTO DE CUNDINAMARCA","CTEL",9498967749,7498967749,2000000000,43565,"CONTRATADO EN EJECUCIÓN",0.93269999999999997,0.82489999999999997,null,null,null,null,null,null,null,null,null,null,44972,44607,45000,-405,-12,-40]
[103,"CUNDINAMARCA","UNIDAD ADMINISTRATIVA DE GESTIÓN DEL RIESGO.","DIEGO TORRES/VALENTINA PORTILLO","GINNA HERRERA",20172401060022,"ESTUDIOS DETALLADOS PARA LA INCORPORACIÓN DE LA GESTIÓN DEL RIESGO PARA LOS MUNICIPIOS DE GIRARDOT, RICAURTE","AMBIENTE Y DESARROLLO SOSTENIBLE",3084907873,3084907873,0,43802,"CONTRATADO EN EJECUCIÓN",0.20300000000000001,0.20269999999999999,null,null,null,null,null,null,null,null,null,null,44915,44607,44915,-405,-97,-97]
[104,"CUNDINAMARCA","SECRETARIA DE CIENCIA, TECNOLOGIA E INNOVACIÓN","ALEXANDER RIVEROS Y YAHIR ARCINIEGAS","LUIS MANUEL GONZALEZ",20170000100012,"CONFORMACIÓN DE UNA CONVOCATORIA REGIONAL DE PROYECTOS I+D EN FOCOS PRIORIZADOS CTEI PARA EL FORTALECIMIENTO DE LOS GRUPOS DE INVESTIGACIÓN CUNDINAMARCA","CTEL",7586358670.8000002,7375550629.0600004,210808041.73999977,42941,"CONTRATADO EN EJECUCIÓN",0.88100000000000001,0.9708,null,null,null,null,null,null,null,null,null,null,45000,44972,45003,-40,-9,-12]
[105,"ENTIDAD APORTANTE RECURSOS","CAR","YESID CASTAÑO","CARLOS MURCIA",2017000050063,"RECUPERACIÓN HIDRÁULICA Y AMBIENTAL DEL COMPLEJO LAGUNAR  FÚQUENE","AMBIENTE Y DESARROLLO SOSTENIBLE",18000000000,18000000000,0,43364,"CONTRATADO EN EJECUCIÓN",0.56879999999999997,0.58589999999999998,null,null,null,null,null,null,null,null,null,null,45000,44607,45000,-405,-12,-12]
[106,"ENTIDAD APORTANTE RECURSOS","CAR","YESID CASTAÑO","CARLOS MURCIA",2017000050070,"CONSTRUCCIÓN DE OBRAS DE MITIGACIÓN DEL RIESGO POR EVENTOS CLIMÁTICOS EN LA CUENCA DE LA QUEBRADA LA PARROQUIA EN EL CERRO DE FUSACATÁN DEL MUNICIPIO DE  FUSAGASUGÁ, CUNDINAMARCA","AMBIENTE Y DESARROLLO SOSTENIBLE",1976558725,1376558725,600000000,43417,"DESAPROBADO",0,0,null,null,null,null,null,null,null,null,null,null,null,44607,44607,-405,-405,0]
[107,"ENTIDAD APORTANTE RECURSOS","MUNICIPIO DE UTICA","JUAN CARLOS TORRES","CESAR SIMANCAS",2017000050087,"MEJORAMIENTO DEL SENDERO TURÍSTICO DE LA PROVINCIA DEL GUALIVÁ  – ÚTICA  CUNDINAMARCA","COMERCIO, INDUSTRIA Y TURISMO ",2347004868,2123058880,223945988,43211,"CONTRATADO EN EJECUCIÓN",0.78920000000000001,0.94520000000000004,null,null,null,null,null,null,null,null,null,null,44915,44607,44915,-405,-97,-97]
[108,"CUNDINAMARCA","SECRETARIA DE EDUCACIÓN","YAHIR ARCINIEGAS Y ALEXANDER RIVEROS","PABLO CAJAMARCA",2018000050019,"FORTALECIMIENTO DE LA PERMANENCIA DE LOS ESTUDIANTES EN LOS MUNICIPIOS DEL DEPARTAMENTO DE CUNDINAMARCA, CENTRO ORIENTE 2018 CUNDINAMARCA","EDUCACIÓN",19395559645,19395559645,0,43336,"CERRADO",1,0.66120000000000001,null,null,null,null,null,null,null,null,null,null,null,44607,44607,-405,-405,0]
[109,"DESENTRALIZADOS","ICCU - GESPROY GB","DIEGO TORRES / JEIMY FORERO","GIOVANY QUEVEDO",2018000050022,"MEJORAMIENTO Y REHABILITACIÓN DE VÍAS SECUNDARIAS EN LA PROVINCIA DE UBATÉ, DEPARTAMENTO DE CUNDINAMARCA","TRANSPORTE",7524876363,7441105086,83771277,43320,"CERRADO",0.98829999999999996,0.97309999999999997,null,null,null,null,null,null,null,null,null,null,44706,44760,44607,-252,-405,-306]
[110,"DESENTRALIZADOS","ICCU - GESPROY GB","DIEGO TORRES / JEIMY FORERO","GIOVANY QUEVEDO",2018000050024,"MEJORAMIENTO Y REHABILITACIÓN DE LA VÍA LA MARÍA – TOBIA - PASO EL REJO - LA PEÑA, DEPARTAMENTO DE CUNDINAMARCA","TRANSPORTE",9149162991,8983328881,165834110,43417,"TERMINADO",0.96450000000000002,0.94279999999999997,null,null,null,null,null,null,null,null,null,null,44972,44607,44980,-405,-32,-40]
[111,"DESENTRALIZADOS","ICCU - GESPROY GB","DIEGO TORRES / JEIMY FORERO","GIOVANY QUEVEDO",2018000050026,"MEJORAMIENTO DE VÍAS EN LA PROVINCIA DE SUMAPAZ PARA LA CONSOLIDACIÓN DE UNA PAZ ESTABLE Y DURADERA EN EL DEPARTAMENTO DE CUNDINAMARCA","TRANSPORTE",11457047617,11457047617,0,43462,"CONTRATADO EN EJECUCIÓN",0.52569999999999995,0.57879999999999998,null,null,null,null,null,null,null,null,null,null,44915,44607,44915,-405,-97,-97]
[112,"CUNDINAMARCA","UNIDAD ADMINISTRATIVA DE GESTIÓN DEL RIESGO.","DIEGO TORRES/VALENTINA PORTILLO","GINNA HERRERA",2018000050036,"CONSTRUCCIÓN DE OBRAS PARA LA MITIGACIÓN DEL RIESGO EN EL MUNICIPIO DE SAN BERNARDO, BENEFICIANDO A COMUNIDADES DE LOS MUNICIPIOS DE ARBELAEZ, PANDI Y VENECIA CUNDINAMARCA","AMBIENTE Y DESARROLLO SOSTENIBLE",2305788182,2305788182,0,43629,"DESAPROBADO",0,0,null,null,null,null,null,null,null,null,null,null,null,44607,44607,-405,-405,0]
[113,"CUNDINAMARCA","SECRETARIA DE HABITAT Y VIVIENDA","ALEXANDER RIVEROS/JEIMY FORERO","BEATRIZ GAMEZ",2018000050039,"MEJORAMIENTO DE VIVIENDA RURAL EN LOS MUNICIPIOS DE CUCUNUBÁ, JERUSALEN, QUEBRADANEGRA Y VIOTÁ - DEPARTAMENTO DE CUNDINAMARCA","AGRICULTURA ",4024793625,4024793625,0,43571,"PARA CIERRE",1,1,null,null,null,null,null,null,null,null,null,null,44760,44760,44671,-252,-341,-252]
[114,"DESENTRALIZADOS","ICCU - GESPROY GB","DIEGO TORRES / JEIMY FORERO","GIOVANY QUEVEDO",2018000050049,"MEJORAMIENTO DE LA VÍA SESQUILÉ – GUATAVITA - GACHETÁ, DEPARTAMENTO DE CUNDINAMARCA","TRANSPORTE",3997714045,3935792642,61921403,43455,"CERRADO",0.80930000000000002,0.80869999999999997,null,null,null,null,null,null,null,null,null,null,44706,44760,44740,-252,-272,-306]
[115,"DESENTRALIZADOS","ICCU - GESPROY GB","DIEGO TORRES / JEIMY FORERO","GIOVANY QUEVEDO",2018000050055,"MEJORAMIENTO DE LA TRONCAL DE RIONEGRO, SECTOR LA PALMA CHARCO LARGO PARA LA CONSOLIDACIÓN DE UNA PAZ ESTABLE Y DURADERA EN EL DEPARTAMENTO DE CUNDINAMARCA","TRANSPORTE",17928531277,17928531277,0,43532,"CERRADO",0.95509999999999995,0.92210000000000003,null,null,null,null,null,null,null,null,null,null,null,44740,44607,-272,-405,0]
[116,"DESENTRALIZADOS","ICCU - GESPROY GB","DIEGO TORRES / JEIMY FORERO","GIOVANY QUEVEDO",2018000050059,"MEJORAMIENTO DE LA VÍA GUSBITA - TIBIRITA DEL DEPARTAMENTO DE CUNDINAMARCA","TRANSPORTE",5500531740,4870657724,629874016,43532,"TERMINADO",0.99580000000000002,0.88549999999999995,null,null,null,null,null,null,null,null,null,null,44915,44972,44607,-40,-405,-97]
[117,"CUNDINAMARCA","SECRETARIA DE CIENCIA, TECNOLOGIA E INNOVACIÓN","ALEXANDER RIVEROS Y YAHIR ARCINIEGAS","LUIS MANUEL GONZALEZ",2018000100106,"INNOVACIÓN EN EL MODELO DE GESTIÓN DEL MEDICAMENTO FASE III EN EL DEPARTAMENTO DE  CUNDINAMARCA","CTEL",3452890062,3071356262,381533800,43830,"DESAPROBADO",0,0,null,null,null,null,null,null,null,null,null,null,null,44887,44607,-125,-405,0]
[118,"CUNDINAMARCA","SECRETARIA DE CIENCIA, TECNOLOGIA E INNOVACIÓN","ALEXANDER RIVEROS Y YAHIR ARCINIEGAS","LUIS MANUEL GONZALEZ",2018000100160,"FORMACIÓN DE CAPITAL HUMANO DE ALTO NIVEL PARA LA INVESTIGACIÓN, EL DESARROLLO TECNOLÓGICO Y LA INNOVACIÓN MAESTRÍAS DE INVESTIGACIÓN PARA DOCENTES DEL DEPARTAMENTO DE CUNDINAMARCA","CTEL",5217415747,3519725709,1697690038,43731,"CONTRATADO EN EJECUCIÓN",0.1638,0.45700000000000002,null,null,null,null,null,null,null,null,null,null,44972,44607,45003,-405,-9,-40]
[119,"CUNDINAMARCA","ENTIDAD DESIGNADA PARA LA SUPERVISIÓN DEL PROYECTO O PARA CONTRATAR LA INTERVENTORÍA-EMPRESAS PUBLICAS DE CUNDINAMARCA -EPC","ALEXANDER RIVEROS/LIYUGETH ALFONSO","PAULA ACUÑA",20181301010555,"CONSTRUCCIÓN DE UNIDADES SANITARIAS EN EL ÁREA RURAL DEL DEPARTAMENTO DE CUNDINAMARCA","VIVIENDA, CIUDAD Y TERRITORIO ",4999900475,4999900475,0,43378,"CONTRATADO EN EJECUCIÓN",0.87680000000000002,0.78310000000000002,null,null,null,null,null,null,null,null,null,null,44972,44607,44915,-405,-97,-40]
[120,"DESENTRALIZADOS","ICCU - GESPROY GB","DIEGO TORRES / JEIMY FORERO","GIOVANY QUEVEDO",2019000050002,"MEJORAMIENTO DE LA VÍA DEPARTAMENTAL LA VICTORIA (EL COLEGIO) SAN GABRIEL (VIOTÁ), TRAMO LA VICTORIA ALTO DE LA MULA, DEPARTAMENTO DE CUNDINAMARCA","TRANSPORTE",5745879373,5745879373,0,43532,"CERRADO",0.97219999999999995,0.98519999999999996,null,null,null,null,null,null,null,null,null,null,null,44607,44607,-405,-405,0]
[121,"DESENTRALIZADOS","ICCU - GESPROY GB","DIEGO TORRES / JEIMY FORERO","GIOVANY QUEVEDO",2019000050003,"MEJORAMIENTO DE LA VÍA CÁQUEZA FOSCA, DEPARTAMENTO DE CUNDINAMARCA","TRANSPORTE",4049029755,4049029755,0,43585,"CERRADO",0.93269999999999997,0.98540000000000005,null,null,null,null,null,null,null,null,null,null,null,44740,44607,-272,-405,0]
[122,"DESENTRALIZADOS","ICCU - GESPROY GB","DIEGO TORRES / JEIMY FORERO","GIOVANY QUEVEDO",2019000050005,"MEJORAMIENTO DE LA VÍA FÓMEQUE UBAQUE, DEPARTAMENTO DE CUNDINAMARCA","TRANSPORTE",16514204213,14057373703,2456830510,43629,"CERRADO",0.99919999999999998,0.99919999999999998,null,null,null,null,null,null,null,null,null,null,null,44740,44607,-272,-405,0]
[123,"DESENTRALIZADOS","ICCU - GESPROY GB","DIEGO TORRES / JEIMY FORERO","GIOVANY QUEVEDO",2019000050011,"MEJORAMIENTO DE LA VÍA SUPATÁ - PACHO, DEPARTAMENTO DE CUNDINAMARCA","TRANSPORTE",7339441010,7339441010,0,43585,"CONTRATADO EN EJECUCIÓN",0.71309999999999996,0.71899999999999997,null,null,null,null,null,null,null,null,null,null,null,44607,44607,-405,-405,0]
[124,"DESENTRALIZADOS","ICCU - GESPROY GB","DIEGO TORRES / JEIMY FORERO","GIOVANY QUEVEDO",2019000050013,"CONSTRUCCIÓN DE LA PLAZA DE MERCADO DEL MUNICIPIO DE CHOACHÍ CUNDINAMARCA","AGRICULTURA ",4481109943.3100004,3152125044,1328984899.3100004,43687,"CONTRATADO EN EJECUCIÓN",1,0.67859999999999998,null,null,null,null,null,null,null,null,null,null,44972,44635,44980,-377,-32,-40]
[125,"DESENTRALIZADOS","ICCU - GESPROY GB","DIEGO TORRES / JEIMY FORERO","GIOVANY QUEVEDO",2019000050016,"MEJORAMIENTO DE LA VÍA ANOLAIMA CORRALEJAS (INSPECCIÓN DE CORRALEJAS), DEPARTAMENTO DE CUNDINAMARCA","TRANSPORTE",6898362469,5718724028,1179638441,43629,"CERRADO",0.99850000000000005,0.99960000000000004,null,null,null,null,null,null,null,null,null,null,44972,44972,44980,-40,-32,-40]
[126,"CUNDINAMARCA","SECRETARIA DE EDUCACIÓN","YAHIR ARCINIEGAS Y ALEXANDER RIVEROS","PABLO CAJAMARCA",2019000050020,"FORTALECIMIENTO DE LA PERMANENCIA DE LOS ESTUDIANTES PARA EL AÑO 2019 EN LOS MUNICIPIOS DEL DEPARTAMENTO DE CUNDINAMARCA","EDUCACIÓN",20536293937,20536293937,0,43629,"TERMINADO",1,0.9103,null,null,null,null,null,null,null,null,null,null,44972,44607,44980,-405,-32,-40]
[127,"DESENTRALIZADOS","ICCU - GESPROY GB","DIEGO TORRES / JEIMY FORERO","GIOVANY QUEVEDO",2019000050023,"MEJORAMIENTO DE LA VÍA LENGUAZAQUE - VILLAPINZÓN, DEPARTAMENTO DE CUNDINAMARCA","TRANSPORTE",8636278689,7310087087,1326191602,43629,"TERMINADO",1,0.83830000000000005,null,null,null,null,null,null,null,null,null,null,null,44972,44607,-40,-405,0]
[128,"CUNDINAMARCA","SECRETARIA DE AGRICULTURA","DIEGO TORRES/VALENTINA PORTILLO","JAVIER HERREDIA",2019000050027," MEJORAMIENTO DE LA COMPETITIVIDAD  DE LA CADENA PRODUCTIVA DE CACAO EN EL DEPARTAMENTO DE CUNDINAMARCA","AGRICULTURA ",5862983962,4397237971,1465745991,43819,"PARA CIERRE",1,1,null,null,null,null,null,null,null,null,null,null,44973,44760,44973,-252,-39,-39]
[129,"DESENTRALIZADOS","ICCU - GESPROY GB","DIEGO TORRES / JEIMY FORERO","GIOVANY QUEVEDO",2019000050029,"MEJORAMIENTO DE LA VÍA GACHETÁ - GAMA, DEPARTAMENTO DE CUNDINAMARCA","TRANSPORTE",5477582208,5322582208,{"$f":"I131-J131","v":155000000},43629,"TERMINADO",0.95509999999999995,0.9425,null,null,null,null,null,null,null,null,null,null,44973,44671,44973,-341,-39,-39]
[130,"CUNDINAMARCA","SECRETARIA DE SALUD","DAYANA FERNANDEZ Y EDGAR YAHIR ARCINIEGAS","OLGA LUCIA GARZON",2019000050036,"ADQUISICIÓN DE AMBULANCIAS PARA EL FORTALECIMIENTO DE LA RED HOSPITALARIA DEL DEPARTAMENTO CUNDINAMARCA","SALUD Y PROTECCIÓN SOCIAL",42966037310,2385000000,{"$f":"I132-J132","v":40581037310},43656,"CERRADO",1,0.82809999999999995,null,null,null,null,null,null,null,null,null,null,null,44607,44607,{"$f":"IF(AA132=0,0,_xlfn.DAYS(AA132,TODAY()))","v":-405},-405,0]
[131,"CUNDINAMARCA","UNIDAD ADMINISTRATIVA DE GESTIÓN DEL RIESGO.","DIEGO TORRES/VALENTINA PORTILLO","GINNA HERRERA",2019000050037," FORTALECIMIENTO DEL SISTEMA DEPARTAMENTAL PARA LA GESTIÓN DEL RIESGO DE DESASTRES DEL DEPARTAMENTO DE CUNDINAMARCA","PRESIDENCIA DE LA REPÚBLICA",24666685502,4936307506,19730377996,43748,"DESAPROBADO",0,0,null,null,null,null,null,null,null,null,null,null,null,44607,44607,-405,-405,{"$f":"IF(Z133=0,0,_xlfn.DAYS(Z133,TODAY()))","v":0}]
[132,"ENTIDAD APORTANTE RECURSOS","MEDICINA LEGAL Y CIENCIAS FORENSES","ALEXANDER RIVEROS","MARTIN SEPULVEDA",2019000050025,"ESTUDIOS Y DISEÑOS PARA LA CONSTRUCCIÓN DE LA SEDE DE MEDICINA LEGAL EN EL DEPARTAMENTO DE CUNDINAMARCA","FISCALIA",904521100,904521100,0,43677,"TERMINADO",1,1,null,null,null,null,null,null,null,null,null,null,44973,44980,44980,-32,-32,-39]
[133,"CUNDINAMARCA","SECRETARIA DE MINAS, ENERGIA Y GAS","DIEGO TORRES / LIYUGETH ALFONSO","JAHIR HERNANDEZ",2019000050039," ESTUDIO Y DISEÑO PARA LA CONSTRUCCIÓN DE REDES ELÉCTRICAS AÉREAS EN ZONAS RURALES DEL DEPARTAMENTO DE CUNDINAMARCA","MINAS Y ENERGÍA",1616407501,1616407501,0,43714,"DESAPROBADO",0,0,null,null,null,null,null,null,null,null,null,null,null,44607,44607,-405,-405,0]
[134,"CUNDINAMARCA","SECRETARIA DE EDUCACIÓN","YAHIR ARCINIEGAS Y ALEXANDER RIVEROS","GENNY PADILLA",2019000050044,"FORTALECIMIENTO A LA ESTRATEGIA DE ALIMENTACIÓN ESCOLAR PARA MUNICIPIOS NO CERTIFICADOS, VIGENCIA 2019 DEL DEPARTAMENTO DE CUNDINAMARCA","EDUCACIÓN",18301749135,18301749135,0,43656,"CERRADO",0.2152,0.53269999999999995,null,null,null,null,null,null,null,null,null,null,null,44607,44607,-405,-405,0]
[135,"DESENTRALIZADOS","ICCU - GESPROY GB","DIEGO TORRES / JEIMY FORERO","GIOVANY QUEVEDO",2019000050047,"MEJORAMIENTO DE LA VÍA SUSA - CARMEN DE CARUPA, DEPARTAMENTO DE CUNDINAMARCA","TRANSPORTE",5203497467.6199999,4131178258,1072319209.6199999,43677,"TERMINADO",1,0.79390000000000005,null,null,null,null,null,null,null,null,null,null,null,44607,44607,-405,-405,0]
[136,"DESENTRALIZADOS","ICCU - GESPROY GB","DIEGO TORRES / JEIMY FORERO","GIOVANY QUEVEDO",2019000050056,"MEJORAMIENTO DE LA VÍA QUE CONDUCE DEL MUNICIPIO DE NIMAIMA AL MUNICIPIO DE NOCAIMA, DEPARTAMENTO DE CUNDINAMARCA","TRANSPORTE",5082491569.8000002,4614214508,468277061.80000019,43748,"TERMINADO",1,0.87219999999999998,null,null,null,null,null,null,null,null,null,null,44823,44706,44607,-306,-405,-189]
[137,"DESENTRALIZADOS","IDECUT","DIEGO TORRES Y YAHIR ARCINIEGAS","MARTHA VANEGAS",2019000050059,"FORTALECIMIENTO A LAS ESCUELAS MUNICIPALES DE MÚSICA, DANZA, TEATRO Y ARTES PLÁSTICAS Y VISUALES EN EL DEPARTAMENTO DE CUNDINAMARCA","CULTURA ",1972606058,1972606058,0,43748,"CERRADO",1,0.96099999999999997,null,null,null,null,null,null,null,null,null,null,44915,44973,44706,-39,-306,-97]
[138,"DESENTRALIZADOS","ICCU - GESPROY GB","DIEGO TORRES / JEIMY FORERO","GIOVANY QUEVEDO",2019000050060,"ESTUDIOS Y DISEÑOS DE VÍAS PARA MEJORAR LA COMPETITIVIDAD DEL DEPARTAMENTO DE CUNDINAMARCA","TRANSPORTE",7089369627,7089369627,0,43714,"TERMINADO",0.98650000000000004,0.95530000000000004,null,null,null,null,null,null,null,null,null,null,44973,44607,44980,-405,-32,-39]
[139,"CUNDINAMARCA","SECRETARIA DE MINAS, ENERGIA Y GAS","DIEGO TORRES / LIYUGETH ALFONSO","JAHIR HERNANDEZ",2019000050073,"AMPLIACIÓN DE LA COBERTURA DEL SERVICIO DE GAS COMBUSTIBLE DOMICILIARIO A TRAVÉS DE LA FINANCIACIÓN DE LA CONEXIÓN Y LA RED INTERNA PARA USUARIOS DE BARRIOS PERIFÉRICOS, VEREDAS Y CENTROS POBLADOS DEL DEPARTAMENTO DE CUNDINAMARCA","MINAS Y ENERGÍA",12461377100,6651376060,5810001040,43805,"TERMINADO",0.93589999999999995,1.0329999999999999,null,null,null,null,null,null,null,null,null,null,44973,45001,44980,-11,-32,-39]
[140,"DESENTRALIZADOS","ICCU - GESPROY GB","DIEGO TORRES / JEIMY FORERO","GIOVANY QUEVEDO",2019000050075,"MEJORAMIENTO DE LA VÍA QUE CONDUCE DEL MUNICIPIO DE VIANI AL MUNICIPIO DE CHAGUANI, (DE LA Y DE SAN VICENTE A CHAGUANI), DEPARTAMENTO DE CUNDINAMARCA","TRANSPORTE",7504443091,7504443091,0,43819,"TERMINADO",1,0.9516,null,null,null,null,null,null,null,null,null,null,44973,44607,44980,-405,-32,-39]
[141,"DESENTRALIZADOS","ICCU - GESPROY GB","DIEGO TORRES / JEIMY FORERO","GIOVANY QUEVEDO",2019000050079,"MEJORAMIENTO DE LA VÍA SERREZUELA - EL TRIUNFO, MUNICIPIO DE LA CALERA, DEPARTAMENTO DE CUNDINAMARCA","TRANSPORTE",7614258187,7614258187,0,43748,"TERMINADO",0.94289999999999996,0.86319999999999997,null,null,null,null,null,null,null,null,null,null,44973,44607,44980,-405,-32,-39]
[142,"DESENTRALIZADOS","ICCU - GESPROY GB","DIEGO TORRES / JEIMY FORERO","GIOVANY QUEVEDO",2019000050085,"MEJORAMIENTO DE LA VÍA QUE CONDUCE DEL MUNICIPIO DE LA MESA AL MUNICIPIO DE CACHIPAY, (DE LA INSPECCIÓN DE PEÑA NEGRA AL MUNICIPIO DE CACHIPAY), DEPARTAMENTO DE CUNDINAMARCA","TRANSPORTE",7019896083,7019896083,0,43852,"CONTRATADO EN EJECUCIÓN",0.71350000000000002,0.6774,null,null,null,null,null,null,null,null,null,null,44973,44607,45004,-405,-8,-39]
[143,"ENTIDAD APORTANTE RECURSOS","TV ANDINA","ALEXANDER RIVEROS","EDWIN",2019000050064,"PROTECCIÓN Y PRESERVACIÓN DEL PATRIMONIO AUDIOVISUAL COLOMBIANO QUE SE ENCUENTRA EN EL CANAL PÚBLICO TEVEANDINA LOCALIZADO EN EL DEPARTAMENTO DE  CUNDINAMARCA","CULTURA ",5923285198,"$ 5.597.840.098",325445100,43774,"CERRADO",1,0.99350000000000005,null,null,null,null,null,null,null,null,null,null,null,44706,44607,-306,-405,0]
[144,"ENTIDAD APORTANTE RECURSOS","UNAD","ALEXANDER RIVEROS","ANDRES ACOSTA",2019000050069,"MEJORAMIENTO DE INFRAESTRUCTURA FÍSICA, DOTACIÓN DE MOBILIARIO Y EQUIPAMIENTO TECNOLÓGICO DE LA UNIVERSIDAD NACIONAL ABIERTA Y A DISTANCIA EN MUNICIPIOS DEL DEPARTAMENTO DE CUNDINAMARCA","EDUCACIÓN",16011115461,16011115461,0,43774,"CERRADO",1,1,null,null,null,null,null,null,null,null,null,null,44760,44823,44607,-189,-405,-252]
[145,"ENTIDAD APORTANTE RECURSOS","U TECNOLOGICA DE PEREIRA","YAHIR ARCINIEGAS","LUIS MANUEL GONZALEZ",2019000100009,"FORMACIÓN DE CAPITAL HUMANO DE ALTO NIVEL UNIVERSIDAD TECNOLÓGICA DE PEREIRA  NACIONAL","CTEL",4360028215,3950208215,409820000,43781,"CONTRATADO EN EJECUCIÓN",0.62090000000000001,0.65339999999999998,null,null,null,null,null,null,null,null,null,null,45004,45001,45001,-11,-11,-8]
[146,"ENTIDAD APORTANTE RECURSOS","U EAN","YAHIR ARCINIEGAS","LUIS MANUEL GONZALEZ",2019000100015,"FORMACIÓN DE CAPITAL HUMANO DE ALTO NIVEL - UNIVERSIDAD EAN -  NACIONAL","CTEL",1294375000,1250000000,44375000,43830,"CONTRATADO EN EJECUCIÓN",0.70289999999999997,0.69020000000000004,null,null,null,null,null,null,null,null,null,null,45001,44635,45001,-377,-11,-11]
[147,"ENTIDAD APORTANTE RECURSOS","U CATOLICA","YAHIR ARCINIEGAS","LUIS MANUEL GONZALEZ",2019000100022,"FORMACIÓN DE CAPITAL HUMANO DE ALTO NIVEL - UNIVERSIDAD CATÓLICA DE COLOMBIA -  NACIONAL","CTEL",343595000,299220000,44375000,43812,"CONTRATADO EN EJECUCIÓN",0.84750000000000003,0.83789999999999998,null,null,null,null,null,null,null,null,null,null,45001,44607,45001,-405,-11,-11]
[148,"ENTIDAD APORTANTE RECURSOS","UNIVERSIDAD MILITAR NUEVA GRANADA","YAHIR ARCINIEGAS","LUIS MANUEL GONZALEZ",2019000100025,"FORMACIÓN DE CAPITAL HUMANO DE ALTO NIVEL UNIVERSIDAD MILITAR NUEVA GRANADA  NACIONAL","CTEL",294375000,250000000,44375000,43812,"CONTRATADO EN EJECUCIÓN",0.64019999999999999,0.69910000000000005,null,null,null,null,null,null,null,null,null,null,45004,44635,45004,-377,-8,-8]
[149,"ENTIDAD APORTANTE RECURSOS","UNIVERSIDAD NACIONAL DE COLOMBIA","YAHIR ARCINIEGAS","LUIS MANUEL GONZALEZ",2019000100026,"FORMACIÓN DE CAPITAL HUMANO DE ALTO NIVEL UNIVERSIDAD NACIONAL DE COLOMBIA   NACIONAL","CTEL",21162064500,20233937500,928127000,43781,"CONTRATADO EN EJECUCIÓN",0.6159,0.6573,null,null,null,null,null,null,null,null,null,null,45004,44635,45004,-377,-8,-8]
[150,"ENTIDAD APORTANTE RECURSOS","U DISTRITAL","YAHIR ARCINIEGAS","LUIS MANUEL GONZALEZ",2019000100027,"FORMACIÓN DE CAPITAL HUMANO DE ALTO NIVEL EN DOCTORADO PARA EL DESARROLLO REGIONAL, UNIVERSIDAD DISTRITAL FRANCISCO JOSÉ DE CALDAS, A NIVEL  NACIONAL","CTEL",1218668841,1113595753,105073088,43798,"CONTRATADO EN EJECUCIÓN",0.59330000000000005,0.47670000000000001,null,null,null,null,null,null,null,null,null,null,45004,44607,45001,-405,-11,-8]
[151,"ENTIDAD APORTANTE RECURSOS","U JAVERIANA","YAHIR ARCINIEGAS","LUIS MANUEL GONZALEZ",2019000100028,"FORMACIÓN DE CAPITAL HUMANO DE ALTO NIVEL PONTIFICIA UNIVERSIDAD JAVERIANA SEDE CENTRAL  NACIONAL","CTEL",6524500000,6524500000,0,43781,"CONTRATADO EN EJECUCIÓN",0.68010000000000004,0.67510000000000003,null,null,null,null,null,null,null,null,null,null,45001,44607,45004,-405,-8,-11]
[152,"ENTIDAD APORTANTE RECURSOS","U DE LOS ANDES","YAHIR ARCINIEGAS","LUIS MANUEL GONZALEZ",2019000100036,"FORMACIÓN  DE CAPITAL HUMANO DE ALTO NIVEL UNIVERSIDAD DE LOS ANDES   NACIONAL","CTEL",2814671307,2748000000,66671307,43798,"CONTRATADO EN EJECUCIÓN",0.76729999999999998,0.77690000000000003,null,null,null,null,null,null,null,null,null,null,45001,44635,45004,-377,-8,-11]
[153,"ENTIDAD APORTANTE RECURSOS","UNIVERSIDAD NACIONAL DE COLOMBIA","YAHIR ARCINIEGAS","LUIS MANUEL GONZALEZ",2019000100061,"FORTALECIMIENTO DE LA CAPACIDAD TECNOLÓGICA INSTALADA EN EL CENTRO AGROPECUARIO MARENGO PARA LA INVESTIGACIÓN EN LOS SISTEMAS AGROPRODUCTIVOS DEL TRÓPICO ALTO, BAJO EL EFECTO DE LA VARIABILIDAD Y CAMBIO CLIMÁTICO -  CUNDINAMARCA","CTEL",2521388540,1994146760,527241780,43830,"CONTRATADO EN EJECUCIÓN",0.83560000000000001,0.56920000000000004,null,null,null,null,null,null,null,null,null,null,45004,44635,45004,-377,-8,-8,null,2019000100061]
[154,"CUNDINAMARCA","SECRETARIA DE CIENCIA, TECNOLOGIA E INNOVACIÓN","ALEXANDER RIVEROS Y YAHIR ARCINIEGAS","LUIS MANUEL GONZALEZ",2020000100137,"FORTALECIMIENTO DE LAS CAPACIDADES DE INVESTIGACIÓN Y DESARROLLO PARA ATENDER PROBLEMÁTICAS ASOCIADAS CON AGENTES BIOLÓGICOS PARA LA SALUD PÚBLICA, A TRAVÉS DEL MEJORAMIENTO DEL LABORATORIO DE SALUD PÚBLICA DE CUNDINAMARCA","CTEL",4506359274,4048003426,458355848,43966,"CONTRATADO EN EJECUCIÓN",0.70689999999999997,0.59599999999999997,null,null,null,null,null,null,null,null,null,null,44973,44636,44973,-376,-39,-39,null,2020000100137]
[155,"CUNDINAMARCA","SECRETARIA DE SALUD","DAYANA FERNANDEZ/ LIYUGETH ALFONSO","OLGA LUCIA GARZON",2020000050003,"ADQUISICIÓN DE AMBULANCIAS,EQUIPOS BIOMÉDICOS, ELEMENTOS DE PROTECCIÓN PERSONAL, ASEO Y DESINFECCIÓN PARA LA ATENCIÓN DE LA CALAMIDAD SANITARIA POR COVID-19 EN LAS E.S.E DEL DEPARTAMENTO DE   CUNDINAMARCA","SALUD Y PROTECCIÓN SOCIAL",43433295564,43433295564,0,43986,"PARA CIERRE",0.54379999999999995,0.54759999999999998,null,null,null,null,null,null,null,null,null,null,44740,44637,44607,-375,-405,-272,null,2020000050003]
[156,"CUNDINAMARCA","UNIDAD ADMINISTRATIVA DE GESTIÓN DEL RIESGO.","DIEGO TORRES/VALENTINA PORTILLO","GINNA HERRERA",2020000050012,"ADQUISICIÓN DE ELEMENTOS DE PROTECCIÓN DE CONTAGIO DEL VIRUS COVID-19 PARA LOS CUERPOS OPERATIVOS DE EMERGENCIA, EN ATENCIÓN DE LA CALAMIDAD SANITARIA EN EL DEPARTAMENTO DE   CUNDINAMARCA","GOBIERNO TERRITORIAL",5419592232,5419592232,0,43986,"CERRADO",0.67,0.67,null,null,null,null,null,null,null,null,null,null,null,44607,44607,-405,-405,0,null,2020000050012]
[157,"CUNDINAMARCA","SECRETARIA DE EDUCACIÓN","YAHIR ARCINIEGAS Y ALEXANDER RIVEROS","GENNY PADILLA",2020000050019,"FORTALECIMIENTO A LA ESTRATEGIA DE ALIMENTACIÓN ESCOLAR PARA EL AÑO 2020, EN LOS MUNICIPIOS DEL DEPARTAMENTO DE CUNDINAMARCA ","EDUCACIÓN",26240955000,26240955000,0,44040,"CERRADO",1,0.995,null,null,null,null,null,null,null,null,null,null,44760,44760,44607,-252,-405,-252,null,2020000050019]
[158,"CUNDINAMARCA","SECRETARIA DE CIENCIA, TECNOLOGIA E INNOVACIÓN","ALEXANDER RIVEROS Y YAHIR ARCINIEGAS","LUIS MANUEL GONZALEZ",2020000100266,"GENERACIÓN DE ESPACIOS DE ENCUENTRO DE LA SOCIEDAD CON LA CIENCIA Y LA TECNOLOGÍA - UN VIAJE CON LA CIENCIA EN EL DEPARTAMENTO DE CUNDINAMARCA","CTEL",2241429590,2218862102,22567488,44111,"CONTRATADO EN EJECUCIÓN",0.76980000000000004,0.68330000000000002,null,null,null,null,null,null,null,null,null,null,44973,44607,45001,-405,-11,-39,null,2020000100266]
[159,"CUNDINAMARCA","SECRETARIA DE CIENCIA, TECNOLOGIA E INNOVACIÓN","ALEXANDER RIVEROS Y YAHIR ARCINIEGAS","LUIS MANUEL GONZALEZ",2020000100246,"FORTALECIMIENTO DE LA COMPETITIVIDAD DE LA CADENA PRODUCTIVA DE LA GUADUA POR MEDIO DEL DESARROLLO E IMPLEMENTACIÓN DE DOS (2) PAQUETES TECNOLÓGICOS PARA LA GENERACIÓN DE PRODUCTOS CON VALOR AGREGADO EN EL DEPARTAMENTO DE CUNDINAMARCA ","CTEL",3144525520,2294345776,850179744,44111,"CONTRATADO EN EJECUCIÓN",0.88529999999999998,0.61950000000000005,null,null,null,null,null,null,null,null,null,null,45004,44973,45004,-39,-8,-8,null,2020000100246]
[160,"ENTIDAD APORTANTE RECURSOS","CONNECT BOGOTA REGIÓN","YAHIR ARCINIEGAS","LUIS MANUEL GONZALEZ",2020000100078,"DISEÑO E IMPLEMENTACIÓN DE UN MODELO DE GESTIÓN DE CONOCIMIENTO, INNOVACIÓN Y TRANSFERENCIA DE TECNOLOGÍA CON APLICACIÓN EN EL SECTOR AGROPECUARIO Y AGROINDUSTRIAL EN EL DEPARTAMENTO DE CUNDINAMARCA ","CTEL",3438832990.73,3028251016.23,410581974.5,44111,"CONTRATADO EN EJECUCIÓN",0.34670000000000001,0.4158,null,null,null,null,null,null,null,null,null,null,45004,44741,45004,-271,-8,-8,null,2020000100078]
[161,"ENTIDAD APORTANTE RECURSOS","FEDERACIÓN NACIONAL DE CAFETEROS","YAHIR ARCINIEGAS","LUIS MANUEL GONZALEZ",2020000100205,"TRASLADO DE TECNOLOGÍAS INNOVADORAS A CAFICULTORES CON IMPACTO SOBRE LA CALIDAD DEL CAFÉ Y LA GESTIÓN DEL RECURSO HÍDRICO DURANTE EL PROCESO DE BENEFICIO EN ZONA CAFETERA DEL DEPARTAMENTO DE CUNDINAMARCA ","CTEL",13783557324,12848931736,934625588,44111,"CONTRATADO EN EJECUCIÓN",0.2676,0.3458,null,null,null,null,null,null,null,null,null,null,45004,44635,45004,-377,-8,-8,null,2020000100205]
[162,"ENTIDAD APORTANTE RECURSOS","AGROSAVIA","YAHIR ARCINIEGAS","LUIS MANUEL GONZALEZ",2020000100197,"DESARROLLO DE BIOPLAGUICIDAS POTENCIADOS DE NUEVA GENERACIÓN PARA EL MEJORAMIENTO DE LA PRODUCTIVIDAD E INOCUIDAD DEL CULTIVO DE TOMATE Y CRUCÍFERAS EN EL DEPARTAMENTO DE CUNDINAMARCA ","CTEL",4583970033,3282745260,1301224773,44111,"CONTRATADO EN EJECUCIÓN",0.35510000000000003,0.35510000000000003,null,null,null,null,null,null,null,null,null,null,45004,44635,45004,-377,-8,-8,null,2020000100197]
[163,"ENTIDAD APORTANTE RECURSOS","UNIVERSIDAD NACIONAL DE COLOMBIA","YAHIR ARCINIEGAS","LUIS MANUEL GONZALEZ",2020000100240,"ESTUDIO DE PREFACTIBILIDAD PARA LA CREACIÓN DE UN CENTRO DE INNOVACIÓN Y DE PRODUCTIVIDAD PARA EL SECTOR AGROPECUARIO DE SABANA OCCIDENTE DE CUNDINAMARCA ","CTEL",1896154229,1707430133,188724096,44111,"CONTRATADO EN EJECUCIÓN",0.94059999999999999,0.82520000000000004,null,null,null,null,null,null,null,null,null,null,45004,44635,45004,-377,-8,-8,null,2020000100240]
[164,"ENTIDAD APORTANTE RECURSOS","UNIVERSIDAD DE CUNDINAMARCA","YAHIR ARCINIEGAS","LUIS MANUEL GONZALEZ",2020000100158,"FORTALECIMIENTO DE LA INFRAESTRUCTURA FÍSICA Y TECNOLÓGICA DEL CENTRO DE ESTUDIOS AGROAMBIENTALES DE LA UNIVERSIDAD DE CUNDINAMARCA AGROU CUNDINAMARCA ","CTEL",2024433669,1997753509,26680160,44111,"CONTRATADO EN EJECUCIÓN",0.58620000000000005,7.9000000000000008E-3,null,null,null,null,null,null,null,null,null,null,45004,44823,45004,-189,-8,-8,null,2020000100158]
[165,"ENTIDAD APORTANTE RECURSOS","ZIPAQUIRA","YESID CASTAÑO / JEIMY FORERO",null,2020000050013,"Mejoramiento de la vía que comunica a los municipios de Zipaquirá y Tocancipá, tramo barandillas - la fuente, departamento de Cundinamarca","TRANSPORTE","6.788.620.869,00",{"$f":"I167","v":"6.788.620.869,00"},0,44152,"CONTRATADO EN EJECUCIÓN",0.60589999999999999,0.86439999999999995,null,null,null,null,null,null,null,null,null,null,44973,44635,44980,-377,-32,-39,null,2020000050013]
[166,"ENTIDAD APORTANTE RECURSOS","ZIPAQUIRA","YESID CASTAÑO / JEIMY FORERO",null,2020000050015,"MEJORAMIENTO DE LA VÍA ZIPAQUIRÁ - SAN JORGE - TABIO DEPARTAMENTO DE CUNDINAMARCA","TRANSPORTE",7458735075,{"$f":"I168","v":7458735075},0,44152,"CONTRATADO EN EJECUCIÓN",0.23319999999999999,0,null,null,null,null,null,null,null,null,null,null,null,44740,44973,-272,-39,0,null,2020000050015]
[167,"CUNDINAMARCA","SECRETARIA DE CIENCIA, TECNOLOGIA E INNOVACIÓN","ALEXANDER RIVEROS Y YAHIR ARCINIEGAS","LUIS MANUEL GONZALEZ",2020000100695,"DESARROLLO, TRANSFERENCIA DE TECNOLOGÍA Y CONOCIMIENTO PARA LA INNOVACIÓN QUE FORTALEZCAN CAPACIDADES COMUNITARIAS EN LA COMPRENSIÓN Y/O MITIGACIÓN DE LOS PROBLEMAS DE VIOLENCIAS BASADAS EN GÉNERO, DERIVADAS DE LA EMERGENCIA POR COVID 19, EN CUNDINAMARCA","CTEL",3100000000,3000000000,100000000,44183,"CONTRATADO EN EJECUCIÓN",0.59240000000000004,0.90910000000000002,null,null,null,null,null,null,null,null,null,null,44973,44607,44973,-405,-39,-39,null,2020000100695]
[168,"CUNDINAMARCA","SECRETARIA DE CIENCIA, TECNOLOGIA E INNOVACIÓN","ALEXANDER RIVEROS Y YAHIR ARCINIEGAS","LUIS MANUEL GONZALEZ",2020000100650,"FORTALECIMIENTO DE CAPACIDADES DE CTEI PARALA INNOVACION EDUCATIVA EN LOS NIVELES DE BÁSICA Y\nMEDIA, MEDIANTE USO DE TICS EN INSTITUCIONES EDUCATIVAS OFICIALES DE LOS MUNICIPIOS NO\nCERTIFICADOS DEL DEPARTAMENTO DE CUNDINAMARCA","CTEL",10804663122,9999728696,804934426,44183,"CONTRATADO EN EJECUCIÓN",0.22939999999999999,0.123,null,null,null,null,null,null,null,null,null,null,45004,44635,45004,-377,-8,-8]
[169,"CUNDINAMARCA","SECRETARIA DE CIENCIA, TECNOLOGIA E INNOVACIÓN","ALEXANDER RIVEROS Y YAHIR ARCINIEGAS","LUIS MANUEL GONZALEZ",2020000100696,"FORTALECIMIENTO DE CAPACIDADES DE CTEI PARA LA REACTIVACIÓN ECONÓMICA Y LA TRANSFORMACIÓN\nPRODUCTIVA EN CUNDINAMARCA","CTEL",7370634083,6974290175,396343908,44183,"CONTRATADO EN EJECUCIÓN",0.5978,0.85089999999999999,null,null,null,null,null,null,null,null,null,null,44973,44607,45004,-405,-8,-39,null,2020000100696]
[170,"CUNDINAMARCA","SECRETARIA DE CIENCIA, TECNOLOGIA E INNOVACIÓN","ALEXANDER RIVEROS Y YAHIR ARCINIEGAS","LUIS MANUEL GONZALEZ",2020000100649,"FORTALECIMIENTO DE CAPACIDADES DE CTeI PARA EL RELACIONAMIENTO ESCUELA - CONTEXTO RURAL MEDIANTE LA APROPIACIÓN Y USO DE LAS TIC EN EL MUNICIPIO DE SIBATÉ, DEPARTAMENTO DE CUNDINAMARCA","CTEL",4292464018,2645464018,1647000000,44183,"CONTRATADO EN EJECUCIÓN",0.81559999999999999,0.77559999999999996,null,null,null,null,null,null,null,null,null,null,44973,44607,45004,-405,-8,-39,null,2020000100649]
[171,"ENTIDAD APORTANTE RECURSOS","FUNDACION UNIVERSIDAD DEL VALLE","YAHIR ARCINIEGAS","JOSE MARIA LEITON",2020000050044,"FORTALECIMIENTO DE LAS COMPETENCIAS COMUNICATIVAS EN INGLÉS DE LOS ESTUDIANTES DE LOS ESTABLECIMIENTOS EDUCATIVOS OFICIALES DEL DEPARTAMENTO CUNDINAMARCA","EDUCACIÓN",15011999229,14954799229,57200000,44195,"CONTRATADO EN EJECUCIÓN",0.85870000000000002,0.70279999999999998,null,null,null,null,null,null,null,null,null,null,45004,44635,45004,-377,-8,-8]
[172,"ENTIDAD APORTANTE RECURSOS","UNAD","YAHIR ARCINIEGAS","LUIS MANUEL GONZALEZ",2020000100433,"Investigación de los compuestos volátiles orgánicos e inducidos para el manejo de moscas plagas en gulupa y granadilla en el departamento de  Cundinamarca","CTEL",3412874201,1999985660,{"$f":"I174-J174","v":1412888541},44159,"CONTRATADO EN EJECUCIÓN",0.49330000000000002,0.54410000000000003,null,null,null,null,null,null,null,null,null,null,45004,44973,45004,-39,-8,-8]
[173,"ENTIDAD APORTANTE RECURSOS","UNIVERSIDAD INDUSTRIAL DE SANTANDER","YAHIR ARCINIEGAS","LUIS MANUEL GONZALEZ",2020000100415,"Desarrollo de un sistema óptico  computacional para estimar el contenido de carbono orgánico de suelos agrícolas a través de imágenes espectrales e inteligencia artificial en cultivos de cítricos de   Santander","CTEL",2184125885.29,1972224989.29,211900896,44160,"CONTRATADO EN EJECUCIÓN",0.67330000000000001,0.56989999999999996,null,null,null,null,null,null,null,null,null,null,45004,44635,45004,-377,-8,-8]
[174,"ENTIDAD APORTANTE RECURSOS","UNIVERSIDAD INDUSTRIAL DE SANTANDER","YAHIR ARCINIEGAS","LUIS MANUEL GONZALEZ",2020000100375,"Conformación de una plataforma para estudios celulares avanzados in vivo en tiempo real para el análisis de la respuesta inmunometabólica ante la reexpresión de interferón tipo I kappa en esferoides de células tumorales de cuello uterino en  Santander","CTEL",3123997801,1998887911,1125109890,44159,"CONTRATADO EN EJECUCIÓN",0.75390000000000001,0.65580000000000005,null,null,null,null,null,null,null,null,null,null,45004,44635,45004,-377,-8,-8]
[175,"ENTIDAD APORTANTE RECURSOS","UNIVERSIDAD INDUSTRIAL DE SANTANDER","YAHIR ARCINIEGAS","LUIS MANUEL GONZALEZ",2020000100351,"Desarrollo de un prototipo selectivo y sensible para monitorear contenido de cadmio in situ en diversas matrices asociadas a la producción de granos de cacao en el departamento de  Santander","CTEL",2585800000,2000000000,585800000,44159,"CONTRATADO EN EJECUCIÓN",1,0.82499999999999996,null,null,null,null,null,null,null,null,null,null,44915,44607,44973,-405,-39,-97,null,2020000100351]
[176,"ENTIDAD APORTANTE RECURSOS","INSTITUTO SUPERIOR DE EDUCACION RURAL DE PAMPLONA","YAHIR ARCINIEGAS","LUIS MANUEL GONZALEZ",2020000100343,"Implementación laboratorio de calidad fisicoquímica de alimentos para el fortalecimiento competitivo y sostenible de lascadenas agroalimentarias del departamento de  Norte de Santander","CTEL",1097306327,999999999,97306328,44159,"CONTRATADO EN EJECUCIÓN",0,0.2505,null,null,null,null,null,null,null,null,null,null,44973,44760,44979,-252,-33,-39,null,2020000100343]
[177,"ENTIDAD APORTANTE RECURSOS","UNIVERSIDAD NACIONAL DE COLOMBIA","YAHIR ARCINIEGAS","LUIS MANUEL GONZALEZ",2020000100342,"Estudio de potenciales insecticidas en matrices poliméricas para el control de plagas de granos almacenados basados en aceites esenciales provenientes de la biodiversidadflorística del departamento de  Cundinamarca","CTEL",2748237104,2000000000,748237104,44159,"CONTRATADO EN EJECUCIÓN",0.2661,0.52190000000000003,null,null,null,null,null,null,null,null,null,null,45004,44635,45004,-377,-8,-8]
[178,"ENTIDAD APORTANTE RECURSOS","UNIVERSIDAD MILITAR NUEVA GRANADA","YAHIR ARCINIEGAS","LUIS MANUEL GONZALEZ",2020000100728,"Generación y transferencia de conocimientos y tecnologías para elevar capacidades de CTel de pequeños productores de tomate para afrontar problemas derivados del COVID-19 asociadas a la Seg. Alimentaria en las Sab. Centro y Oriente  Cundinamarca","CTEL",4162541452,2123613452,2038928000,44183,"CONTRATADO EN EJECUCIÓN",0.74939999999999996,0.75739999999999996,null,null,null,null,null,null,null,null,null,null,45004,44635,45004,-377,-8,-8]
[179,"ENTIDAD APORTANTE RECURSOS","UNIVERSIDAD NACIONAL DE COLOMBIA","YAHIR ARCINIEGAS","LUIS MANUEL GONZALEZ",2020000100339,"Desarrollo de Nuevos Métodos No Destructivos para Monitoreo In Situ de Probabilidad de Ocurrencia de Falla en Tuberías en el Sector de Hidrocarburos en los Departamentos de  Bogotá Boyacá Santander","CTEL",2412084140,1999876300,412207840,44159,"CONTRATADO EN EJECUCIÓN",0.58550000000000002,0.60229999999999995,null,null,null,null,null,null,null,null,null,null,45004,44607,45004,-405,-8,-8,null,2020000100339]
[180,"ENTIDAD APORTANTE RECURSOS","UNIVERSIDAD MILITAR NUEVA GRANADA","YAHIR ARCINIEGAS","LUIS MANUEL GONZALEZ",2020000100216,"Innovación y transferencia tecnológica de UMNGBIO a productores de flores para el control biológico de Tetranychus urticae (Acari: Tetranychiidae) en cultivos de invernadero con el ácaro benéfico Neoseiulus californicus (Acari: Phytoseiidae)  Cundinamarca","CTEL",2431580000,1241580000,1190000000,44159,"CONTRATADO EN EJECUCIÓN",0.70620000000000005,0.81789999999999996,null,null,null,null,null,null,null,null,null,null,45004,44635,45004,-377,-8,-8]
[181,"CUNDINAMARCA","SECRETARIA DE COMPETITIVIDAD","DIEGO TORRES/VALENTINA PORTILLO","FABIAN CUESTA",2019000050026,"Desarrollo de un programa productivo, amigable con el medio ambiente del sector ganadero en el Departamento de Cundinamarca Cundinamarca","AGRICULTURA ",11567711442,8302543371,3265168071,44187,"CONTRATADO EN EJECUCIÓN",0.63480000000000003,0.72170000000000001,null,null,null,null,null,null,null,null,null,null,45004,44973,45004,-39,-8,-8,null,2019000050026]
[182,"ENTIDAD APORTANTE RECURSOS","UNIVERSIDAD NACIONAL DE COLOMBIA","YAHIR ARCINIEGAS","LUIS MANUEL GONZALEZ",2020000100169,"Investigación Desarrollo, innovación y transferencia de conocimiento para el procesamiento de la semilla de Sacha Inchi en productos de valor agregado, como estrategia para mejorar la productividad del sector agroindustrial de la Región  Cundinamarca","CTEL",2757697312,1997700000.0999999,759997311.9000001,44078,"CONTRATADO EN EJECUCIÓN",0.55410000000000004,0.48799999999999999,null,null,null,null,null,null,null,null,null,null,45004,44740,45004,-272,-8,-8]
[183,"ENTIDAD APORTANTE RECURSOS","UPTC","YAHIR ARCINIEGAS","LUIS MANUEL GONZALEZ",2020000100114,"Fortalecimiento del ecosistema de investigación científica para CTeI en la universidad pedagógica y tecnológica de Colombia UPTC, I-SPACIO  Sogamoso","CTEL",2310634882.4499998,1967031046.1500001,343603836.29999971,44078,"CONTRATADO EN EJECUCIÓN",0.70069999999999999,0.43690000000000001,null,null,null,null,null,null,null,null,null,null,45004,44915,45004,-97,-8,-8]
[184,"ENTIDAD APORTANTE RECURSOS","UNIVERSIDAD DE ANTIOQUIA","YAHIR ARCINIEGAS","LUIS MANUEL GONZALEZ",2020000100079,"Fortalecimiento de la infraestructura tecnológica y equipamiento del ambiente de formación industrial para el aumento de las capacidades institucionales en CTeI de la ETITC  Bogotá","CTEL",1090608306,998808306,91800000,44078,"CONTRATADO EN EJECUCIÓN",0.97319999999999995,0.93869999999999998,null,null,null,null,null,null,null,null,null,null,45004,44635,45004,-377,-8,-8]
[185,"ENTIDAD APORTANTE RECURSOS","UNIVERSIDAD NACIONAL DE COLOMBIA","YAHIR ARCINIEGAS","LUIS MANUEL GONZALEZ",2020000100075,"Aprovechamiento de la biodiversidad en agraz y papa para el desarrollo de cultivos promisorios en el departamento de   Santander","CTEL",3177259696,2000000000,1177259696,44078,"CONTRATADO EN EJECUCIÓN",0.32379999999999998,0.30380000000000001,null,null,null,null,null,null,null,null,null,null,45004,44607,45004,-405,-8,-8,null,2020000100075]
[186,"ENTIDAD APORTANTE RECURSOS","UNIVERSIDAD NACIONAL DE COLOMBIA","YAHIR ARCINIEGAS","LUIS MANUEL GONZALEZ",2020000100019,"Fortalecimiento de capacidades de investigación y desarrollo tecnológico de la Universidad Colegio Mayor de Cundinamarca a partir de tecnologías industria 4.0 para el diseño y construcción en   Bogotá","CTEL",2077571214,1930000000,147571214,44078,"CONTRATADO EN EJECUCIÓN",9.6500000000000002E-2,6.6699999999999995E-2,null,null,null,null,null,null,null,null,null,null,44973,44607,44973,-405,-39,-39,null,2020000100019]
[187,"ENTIDAD APORTANTE RECURSOS","UNIVERSIDAD INDUSTRIAL DE SANTANDER","YAHIR ARCINIEGAS","LUIS MANUEL GONZALEZ",2020000100017,"Fortalecimiento DE LA CAPACIDAD INSTITUCIONAL DE INVESTIGACIÓN DE LA UNIVERSIDAD INDUSTRIAL DESANTANDER  Nacional","CTEL",2808520000,2000000000,808520000,44078,"CONTRATADO EN EJECUCIÓN",0.18029999999999999,0,null,null,null,null,null,null,null,null,null,null,null,44607,45004,-405,-8,0,null,2020000100017]
[188,"ENTIDAD APORTANTE RECURSOS","UNIVERSIDAD MILITAR NUEVA GRANADA","YAHIR ARCINIEGAS","LUIS MANUEL GONZALEZ",2020000100103,"Fortalecimiento de capacidades instaladas de Ciencia y Tecnología del Laboratorio de Diagnóstico en el Campus de la Univ Militar Nueva Granada, para atender problemáticas asociadas con agentes biológicos de alto riesgo para la salud humana,  Cundinamarca","CTEL",5715742977,4168513565,1547229412,43966,"CONTRATADO EN EJECUCIÓN",0.2145,0.58389999999999997,null,null,null,null,null,null,null,null,null,null,44973,44635,45004,-377,-8,-39]
[189,"ENTIDAD APORTANTE RECURSOS","INSTITUTO UNIVERSITARIO DE LA PAZ – UNIPAZ","YAHIR ARCINIEGAS","LUIS MANUEL GONZALEZ",2020000100042,"Fortalecimiento de los procesos académicos en los programas ofrecidos por el Instituto Universitario de la Paz, UNIPAZ,   Barrancabermeja","CTEL",1178749590,996109590,182640000,43998,"TERMINADO",1,0.98870000000000002,null,null,null,null,null,null,null,null,null,null,44973,44635,44973,-377,-39,-39]
[190,"ENTIDAD APORTANTE RECURSOS","INSTITUTO UNIVERSITARIO DE LA PAZ – UNIPAZ","YAHIR ARCINIEGAS","LUIS MANUEL GONZALEZ",2020000100016,"Adecuación , DOTACIÓN E IMPLEMENTACIÓN DE UN LABORATORIO DE FABRICACIÓN DIGITAL PARA PROMOVER EL DESARROLLO DE LA CIENCIA, LAINNOVACIÓN Y EL EMPRENDIMIENTO EN LA UNIVERSIDAD FRANCISCO DE PAULA SANTANDER.  Cúcuta","CTEL",2921057589.04,1946843702.04,974213887,43950,"TERMINADO",1,1.002,null,null,null,null,null,null,null,null,null,null,44973,44973,44973,-39,-39,-39]
[191,"ENTIDAD APORTANTE RECURSOS","UNIVERSIDAD TECNOLOGICA DE SANTANDER","YAHIR ARCINIEGAS","LUIS MANUEL GONZALEZ",2020000100004,"Fortalecimiento y adecuación de equipos e infraestructura del Laboratorio de física del Departamento de Ciencias Básicas, para el mejoramiento de las capacidades institucionales y la investigación en las Unidades Tecnológicas de Santander -  Bucaramanga","CTEL",1511504755,980000000,531504755,43950,"CONTRATADO EN EJECUCIÓN",0.1719,0.15579999999999999,null,null,null,null,null,null,null,null,null,null,45005,44635,45005,-377,-7,-7]
[192,"CUNDINAMARCA","SECRETARIA DE EDUCACIÓN","YAHIR ARCINIEGAS","GENNY PADILLA",2020000050037,"Dotación del mobiliario escolar para las instituciones educativas de los municipios no certificados del Departamento de Cundinamarca","EDUCACIÓN",10093038848,10093038848,0,44195,"CERRADO",1,0.84530000000000005,null,null,null,null,null,null,null,null,null,null,44973,45005,44823,-7,-189,-39,null,2020000050037]
[193,"ENTIDAD APORTANTE RECURSOS","UNIVERSIDAD DEL NORTE","YAHIR ARCINIEGAS","LUIS MANUEL GONZALEZ",2020000100287,"Formación de Capital Humano de Alto Nivel Universidad del Norte 2do Corte Nacional","CTEL",6920233499,6750000000,170233499,44330,"CONTRATADO EN EJECUCIÓN",0.32800000000000001,0.39610000000000001,null,null,null,null,null,null,null,null,null,null,45005,44607,45005,-405,-7,-7,null,2020000100287]
[194,"ENTIDAD APORTANTE RECURSOS","UNIVERSIDAD DEL VALLE","YAHIR ARCINIEGAS","LUIS MANUEL GONZALEZ",2020000100345,"Formación de capital humano de alto Nivel segundo Corte Universidad del Valle Nacional","CTEL",5913070114,5335769261,{"$f":"I196-J196","v":577300853},44348,"CONTRATADO EN EJECUCIÓN",0.33339999999999997,0.3705,null,null,null,null,null,null,null,null,null,null,45005,44635,45005,{"$f":"IF(AA196=0,0,_xlfn.DAYS(AA196,TODAY()))","v":-377},-7,-7]
[195,"ENTIDAD APORTANTE RECURSOS","UNIVERSIDAD NACIONAL DE COLOMBIA","YAHIR ARCINIEGAS","LUIS MANUEL GONZALEZ",2021000100003,"Formación de Capital Humano de Alto Nivel Universidad  Nacional de Colombia Corte II Nacionl","CTEL",18418143500,17635937500,782206000,44330,"CONTRATADO EN EJECUCIÓN",0.31130000000000002,0.37090000000000001,null,null,null,null,null,null,null,null,null,null,45005,44607,45005,-405,-7,{"$f":"IF(Z197=0,0,_xlfn.DAYS(Z197,TODAY()))","v":-7},null,2021000100003]
[196,"ENTIDAD APORTANTE RECURSOS","UNIVERSIDAD DE LA SABANA","YAHIR ARCINIEGAS","LUIS MANUEL GONZALEZ",2021000100004,"Formación de Capital Humano de Alto Nivel Universidad de La Sabana Core 2 Nacional","CTEL",1519950000,1309600000,210350000,44348,"CONTRATADO EN EJECUCIÓN",0.39560000000000001,0.69899999999999995,null,null,null,null,null,null,null,null,null,null,45005,44635,45005,-377,-7,-7]
[197,"ENTIDAD APORTANTE RECURSOS","UNIVERSIDAD ANTONIO NARIÑO","YAHIR ARCINIEGAS","LUIS MANUEL GONZALEZ",2021000100014,"Formación de Capital Humano de Alto Nivel Universidad Antonio Nariño Core 2 Nacional","CTEL",4526652200,4250000000,276652200,44348,"CONTRATADO EN EJECUCIÓN",5.1400000000000001E-2,0.22939999999999999,null,null,null,null,null,null,null,null,null,null,45005,44607,45005,-405,-7,-7,null,2021000100014]
[198,"ENTIDAD APORTANTE RECURSOS","UNIVERSIDAD EAN","YAHIR ARCINIEGAS","LUIS MANUEL GONZALEZ",2021000100025,"Formación DE CAPITAL HUMANO DE ALTO NIVEL UNIVERSIDAD EAN NACIONAL COHORTE II Nacional","CTEL",2044506416,1750000000,294506416,44368,"CONTRATADO EN EJECUCIÓN",0.44629999999999997,0.43369999999999997,null,null,null,null,null,null,null,null,null,null,45005,44635,45005,-377,-7,-7]
[199,"ENTIDAD APORTANTE RECURSOS","UNIVERSIDAD MILITAR NUEVA GRANADA","YAHIR ARCINIEGAS","LUIS MANUEL GONZALEZ",2021000100026,"Formación de Capital Humano de Alto Nivel Universidad Militar Nueva Granada Segundo Corte Nacional","CTEL",751632481,650602304,101030177,44348,"CONTRATADO EN EJECUCIÓN",0.32,0.32,null,null,null,null,null,null,null,null,null,null,44973,44607,44973,-405,-39,-39,null,2021000100026]
[200,"ENTIDAD APORTANTE RECURSOS","PONIFICA UNIVERSIDAD JAVERIANA","YAHIR ARCINIEGAS","LUIS MANUEL GONZALEZ",2021000100027,"Formación de Capital Humano de Alto Nivel Pontificia Universidad Javeriana Sede Bogotá Corte II Nacional","CTEL",8577491761,7246312500,1331179261,44348,"CONTRATADO EN EJECUCIÓN",0.39850000000000002,0.37759999999999999,null,null,null,null,null,null,null,null,null,null,45005,44607,45005,-405,-7,-7,null,2021000100027]
[201,"ENTIDAD APORTANTE RECURSOS","UNIVERSIDAD DE CALDAS","YAHIR ARCINIEGAS","LUIS MANUEL GONZALEZ",2021000100028,"Formación de capital humano de alto nivel Corte 2 Universidad de Caldas - Nacional","CTEL",6358000000,6000000000,358000000,44348,"CONTRATADO EN EJECUCIÓN",0.41839999999999999,0.31759999999999999,null,null,null,null,null,null,null,null,null,null,45005,44607,45005,-405,-7,-7,null,2021000100028]
[202,"CUNDINAMARCA","SECRETARIA DE EDUCACIÓN","YAHIR ARCINIEGAS","GENNY PADILLA",2021004250258,"Fortalecimiento a la Estrategia de Alimentación Escolar para el año 2021 en los municipios del Departamento de Cundinamarca","EDUCACIÓN",16289941201,16289941201,0,44432,"PARA CIERRE",1,0.66559999999999997,null,null,null,null,null,null,null,null,null,null,44973,44973,44973,-39,-39,-39]
[203,"CUNDINAMARCA","SECRETARIA DE HABITAT Y VIVIENDA","ALEXANDER RIVEROS/JEIMY FORERO","BEATRIZ GAMEZ",2018000050050,"Mejoramiento vivienda rural mediante construcción de cocinas habitaciones y pisos en los municipios de Cundinamarca","AGRICULTURA ",5616585397,5616585397,0,44525,"CONTRATADO EN EJECUCIÓN",0,0,null,null,null,null,null,null,null,null,null,null,null,44793,44607,{"$f":"IF(AA205=0,0,_xlfn.DAYS(AA205,TODAY()))","v":-219},-405,0,null,2018000050050]
[204,"CUNDINAMARCA","SECRETARIA DE COMPETITIVIDAD","ALEXANDER RIVEROS/JEIMY FORERO","FABIAN CUESTA",2020000050035,"Fortalecimiento de los sistemas productivos a través de la reactivación del sector agrícola en el Departamento de Cundinamarca","AGRICULTURA ",9997098068,9997098068,0,44529,"CONTRATO SIN ACTA DE INICIO",0,0,null,null,null,null,null,null,null,null,null,null,null,44973,44959,-39,-53,0,null,2020000050035]
["205","CUNDINAMARCA","SECRETARIA DE MINAS, ENERGIA Y GAS","DIEGO TORRES / LIYUGETH ALFONSO","YAHIR",2021004250686,"Construcción Del Centro De Formación E Innovación Minero Energético De Cundinamarca","GOBIERNO TERRITORIAL","$ 13.770.893.382,00","$ 6.928.967.103,00",6841926279,44561,"CONTRATADO EN EJECUCIÓN",3.7000000000000002E-3,3.5999999999999999E-3,null,null,null,null,null,null,null,null,null,null,45005,44973,45005,-39,-7,-7,null,"2021004250686"]
[206,"CUNDINAMARCA","UNIDAD ADMINISTRATIVA DE GESTIÓN DEL RIESGO.","DIEGO TORRES/VALENTINA PORTILLO","GINNA HERRERA",2021004250690,"Fortalecimiento del sistema automotor para la gestión del riesgo de desastres del departamento de Cundinamarca","GOBIERNO TERRITORIAL",7299514100,7299514100,0,44547,"CONTRATADO EN EJECUCIÓN",0.99939999999999996,0.14069999999999999,null,null,null,null,null,null,null,null,null,null,44886,44793,44915,-219,-97,-126,null,2021004250690]
[207,"CUNDINAMARCA","SECRETARIA DE COMPETITIVIDAD","ALEXANDER RIVEROS/JEIMY FORERO","FABIAN CUESTA",2020000050038,"Optimización de los sistemas Ganaderos bovinos de carne leche y doble propósito a partir de la implementación de mejoramiento genético productivo y entrega de maquinaria y equipos en municipios del Departamento de Cundinamarca","AGRICULTURA ",9732446243,9732446243,0,44561,"CONTRATADO SIN ACTA DE INICIO",0,"0,00%",null,null,null,null,null,null,null,null,null,null,null,44973,44607,-39,-405,0,null,2020000050038]
[208,"CUNDINAMARCA","SECRETARIA DE CIENCIA, TECNOLOGIA E INNOVACIÓN","YAHIR ARCINIEGAS","LUIS MANUEL GONZALEZ",2021000100327,"Desarrollo de un sistema de producción lechero para la obtención de leches inocuas de alta calidad y con un perfil lipídico saludable en el Departamento de Cundinamarca","CTEL",3833042862,3044082702,788960160,44617,"CONTRATADO SIN ACTA DE INICIO",0,"0,00%",null,null,null,null,null,null,null,null,null,null,null,44973,44741,-39,-271,0]
[209,"CUNDINAMARCA","SECRETARIA DE CIENCIA, TECNOLOGIA E INNOVACIÓN","YAHIR ARCINIEGAS","LUIS MANUEL GONZALEZ",2021000100208,"Fortalecimiento de los niveles de Apropiación social del Conocimiento de la CTeI en comunidades de las provincias de Almeidas y Ubaté del Departamento de Cundinamarca","CTEL",2191964751,1839764876,352199875,44615,"CONTRATADO EN EJECUCIÓN",0.1928,0.24129999999999999,null,null,null,null,null,null,null,null,null,null,45005,44974,45005,-38,-7,-7]
[210,"CUNDINAMARCA","SECRETARIA DE CIENCIA, TECNOLOGIA E INNOVACIÓN","YAHIR ARCINIEGAS","LUIS MANUEL GONZALEZ",2021000100243,"Desarrollo participativo de una plataforma tecnológica de teledetección para la gestión sostenible de suelos en agroecosistemas del Departamento de Cundinamarca","CTEL",3042693625,2332094728,710598897,44617,"CONTRATADO EN EJECUCIÓN",0.13320000000000001,0.19189999999999999,null,null,null,null,null,null,null,null,null,null,44974,44974,45005,-38,-7,-38]
[211,"CUNDINAMARCA","SECRETARIA DE MINAS, ENERGIA Y GAS","DIEGO TORRES / LIYUGETH ALFONSO","YAHIR",2021000050019,"Ampliación DE LA COBERTURA DEL SERVICIO DE GAS COMBUTIBLE POR REDES A TRAVES DE LA FINANCIACIÓN DEL CARGO POR CONEXIÓN Y LA RED INTERNA PARA USUARIOS DE BARRIOS PERIFÉRICOS VEREDAS Y CENTROS POBLADOS DE LOS MUNICIPIOS DE Cundinamarca","MINAS Y ENERGÍA",10613927436,6059727436,4554200000,"2022-05-19","CONTRATADO EN EJECUCIÓN",7.4700000000000003E-2,4.8099999999999997E-2,null,null,null,null,null,null,null,null,null,null,44974,44915,44974,-97,-38,-38]
[212,"CUNDINAMARCA","SECRETARIA DE EDUCACIÓN","YAHIR ARCINIEGAS","GENNY PADILLA",2022000050007,"Fortalecimiento a la Estrategia de Alimentación Escolar en los municipios no certificados del Departamento de Cundinamarca para la vigencia 2022 Cundinamarca\t","EDUCACIÓN",42966037310,42966037310,0,"2022-05-19","CONTRATADO EN EJECUCIÓN",0.95489999999999997,0.54149999999999998,null,null,null,null,null,null,null,null,null,null,45005,44974,45005,-38,-7,-7]
[213,"CUNDINAMARCA","SECRETARIA DE CIENCIA, TECNOLOGIA E INNOVACIÓN","YAHIR ARCINIEGAS","LUIS MANUEL GONZALEZ",2021000100467,"Fortalecimiento de las capacidades institucionales para el desarrollo y gestión del Ecosistema Territorial de CTeI en todas las provincias del Departamento de Cundinamarca\n","CTEL",2801037429,2299692877,501344552,"2022-04-13","CONTRATADO EN EJECUCIÓN","0,00%","0,00%",null,null,null,1,"Hoy o menos de un mes desde que se modifico",null,null,null,null,null,null,45005,44771,-7,-241,0]
[214,"CUNDINAMARCA","SECRETARIA DE CIENCIA, TECNOLOGIA E INNOVACIÓN","YAHIR ARCINIEGAS","LUIS MANUEL GONZALEZ",2021000100276,"Desarrollo DE UN MODELO DE PROMOCIÓN TURÍSTICA SOSTENIBLE DESDE LA TECNOLOGÍA 4.0 EN LOS MUNICIPIOS DE LA PALMA Y YACOPI EN EL DEPARTAMENTO DE Cundinamarca\n","CTEL",2608055295,2401327735,206727560,"2022-03-17","CONTRATADO EN EJECUCIÓN",0.11020000000000001,0.24229999999999999,null,null,null,1,"1 mes desde que no se modifica",null,null,null,null,null,44974,44915,45005,-97,-7,-38]
[215,"CUNDINAMARCA","SECRETARIA DE CIENCIA, TECNOLOGIA E INNOVACIÓN","YAHIR ARCINIEGAS","LUIS MANUEL GONZALEZ",2021000100523,"Desarrollo de Microredes y almacenamiento (ESS) prestadores de servicios complementarios para incrementar la cobertura eficiencia y confiabilidad del servicio en el departamento de Cundinamarca\n","CTEL",3942973233,3296088001,646885232,"2022-05-04","CONTRATADO EN EJECUCIÓN",3.61E-2,"0,00%",null,null,null,null,"2meses desde que no se modifica",null,null,null,null,null,null,44974,45005,-38,-7,0]
[216,"CUNDINAMARCA","SECRETARIA DE EDUCACIÓN","YAHIR ARCINIEGAS","GENNY PADILLA",2022004250011,"Fortalecimiento a la Estrategia de subsidio de Transporte Escolar en municipios no certificados del Departamento de Cundinamarca para la vigencia 2022 Cundinamarca","EDUCACIÓN",24666685502,24666685502,0,44722,"CONTRATADO EN EJECUCIÓN",0.95120000000000005,0.98699999999999999,null,null,null,0.01,"3 meses desde que no se modifica",null,null,null,null,null,45005,44793,45005,-219,-7,-7]
[217,"ENTIDAD APORTANTE RECURSOS","EMTEL","ALEXANDER RIVEROS/JEIMY FORERO","FABIAN CUESTA",2022004250006,"Implementación de una estrategia de reactivación económica para el progreso y la competitividad de micronegocios y unidades productivas en el Departamento de Cundinamarca","COMERCIO, INDUSTRIA Y TURISMO",16921563805,16921563805,0,44529,"CONTRATADO EN EJECUCIÓN",0.1726,0.39389999999999997,null,null,null,null,null,null,null,null,null,null,45005,44823,45005,-189,-7,-7]
[218,"CUNDINAMARCA","SECRETARIA DE AMBIENTE",null,null,2022004250025,"Fortalecimiento de la producción de material vegetal arbustivo y arbóreo para la recuperación de la cobertura arbórea en el departamento de Cundinamarca","AMBIENTE Y DESARROLLO SOSTENIBLE",3387966925,2857824455,530142470,44907,"SIN CONTRATAR",0,0,null,null,null,null,null,null,null,null,null,null,44908,44915,44959,-97,-53,-104]
[219,"CUNDINAMARCA","ICCU - GESPROY GB","ALEXANDER RIVEROS/JEIMY FORERO","GIOVANY QUEVEDO",2022004250032,"Mejoramiento de la vía que comunica a los municipios de san Cayetano y Cogua tramo vereda cardonal vereda mortiño del municipio de san Cayetano departamento de Cundinamarca","TRANSPORTE",9976205175,9976205175,0,44907,"SIN CONTRATAR",0,0,null,null,null,null,null,null,null,null,null,null,null,44974,44908,-38,-104,0]
[220,"CUNDINAMARCA",null,null,null,2022004250031,"Construcción de obras para mitigar los riesgos que se presentan en la zonas aledañas a la urbanización Sasipa del municipio de Silvania Cundinamarca","GOBIERNO TERRITORIAL",3673954111,3673954111,0,44922,"SIN CONTRATAR",0,0,null,null,null,null,null,null,null,null,null,null,44974,44974,44974,-38,-38,-38]
[221,"CUNDINAMARCA",null,null,null,2022004250036,"Construcción de obras de mitigación y estabilización en centro poblado de cuatro caminos del municipio de Paime departamento de Cundinamarca","GOBIERNO TERRITORIAL",3745004883.4099998,3745004883.4099998,0,44922,"SIN CONTRATAR",0,0,null,null,null,null,null,null,null,null,null,null,44974,44974,44974,-38,-38,-38]
[222,"CUNDINAMARCA","FUNDACION UNIVERSIDAD DEL VALLE",null,null,2022004250028,"Fortalecimiento empresarial para el progreso y la competitividad de los micronegocios y unidades productivas en el departamento de Cundinamarca",null,16598832013,16598832013,0,44923,"CONTRATADO SIN ACTA DE INICIO",0,0,null,null,null,null,null,null,null,null,null,null,45000,45005,45000,-7,-12,-12]
[null,null,"SECRETARIA DE AMBIENTE",null,null,"20223201010038",null,"AMBIENTE Y DESARROLLO SOSTENIBLE"," $ 2.238.923.844 "," $ -   ",{"$error":"#VALUE!"},"20/01/2023",null,null,null,null,null,null,null,null,null,null,null,null,null,null,null,null,0,0,0]
[null,null,null,null,null,null,null,null,null,null,0,null,null,null,null,null,null,null,null,null,null,null,null,null,null,null,null,null,0,0,0]
[null,null,null,null,null,null,null,null,null,null,0,null,null,null,null,null,null,null,null,null,null,null,null,null,null,null,null,null,0,0,0]
[null,null,null,null,null,null,null,null,null,null,0,null,null,null,null,null,null,null,null,null,null,null,null,null,null,null,null,null,0,0,0]
[null,null,null,null,null,null,null,null,null,null,0,null,null,null,null,null,null,null,null,null,null,null,null,null,null,null,null,null,0,0,0]
[null,null,null,null,null,null,null,null,null,null,0,null,null,null,null,null,null,null,null,null,null,null,null,null,null,null,null,null,0,0,0]
[null,null,null,null,null,null,null,null,null,null,0,null,null,null,null,null,null,null,null,null,null,null,null,null,null,null,null,null,0,0,0]
[null,null,null,null,null,null,null,null,null,null,null,null,null,null,null,null,null,null,null,null,null,null,null,null,null,null,null,null,0,0,0]
[null,null,null,null,null,null,null,null,null,null,null,null,null,null,null,null,null,null,null,null,null,null,null,null,null,null,null,null,0,0,0]
[null,null,null,null,null,null,null,null,null,null,null,null,null,null,null,null,null,null,null,null,null,null,null,null,null,null,null,null,0,0,0]
[null,null,null,null,null,null,null,null,null,null,null,null,null,null,null,null,null,null,null,null,null,null,null,null,null,null,null,null,0,0,0]
[null,null,null,null,null,null,null,null,null,null,null,null,null,null,null,null,null,null,null,null,null,null,null,null,null,null,null,null,0,0,0]
[null,null,null,null,null,null,null,null,null,null,null,null,null,null,null,null,null,null,null,null,null,null,null,null,null,null,null,null,0,0,0]
[null,null,null,null,null,null,null,null,null,null,null,null,null,null,null,null,null,null,null,null,null,null,null,null,null,null,null,null,0,0,0]
[null,null,null,null,null,null,null,null,null,null,null,null,null,null,null,null,null,null,null,null,null,null,null,null,null,null,null,null,0,0,0]
[null,null,null,null,null,null,null,null,null,null,null,null,null,null,null,null,null,null,null,null,null,null,null,null,null,null,null,null,0,0,0]
[null,null,null,null,null,null,null,null,null,null,null,null,null,null,null,null,null,null,null,null,null,null,null,null,null,null,null,null,0,0,0]
[null,null,null,null,null,null,null,null,null,null,null,null,null,null,null,null,null,null,null,null,null,null,null,null,null,null,null,null,0,0,0]
[null,null,null,null,null,null,null,null,null,null,null,null,null,null,null,null,null,null,null,null,null,null,null,null,null,null,null,null,0,0,0]
[null,null,null,null,null,null,null,null,null,null,null,null,null,null,null,null,null,null,null,null,null,null,null,null,null,null,null,null,0,0,0]
[null,null,null,null,null,null,null,null,null,null,null,null,null,null,null,null,null,null,null,null,null,null,null,null,null,null,null,null,0,0,0]
[null,null,null,null,null,null,null,null,null,null,null,null,null,null,null,null,null,null,null,null,null,null,null,null,null,null,null,null,0,0,0]
[null,null,null,null,null,null,null,null,null,null,null,null,null,null,null,null,null,null,null,null,null,null,null,null,null,null,null,null,0,0,0]
[null,null,null,null,null,null,null,null,null,null,null,null,null,null,null,null,null,null,null,null,null,null,null,null,null,null,null,null,0,0,0]
[null,null,null,null,null,null,null,null,null,null,null,null,null,null,null,null,null,null,null,null,null,null,null,null,null,null,null,null,0,0,0]
[null,null,null,null,null,null,null,null,null,null,null,null,null,null,null,null,null,null,null,null,null,null,null,null,null,null,null,null,0,0,0]
[null,null,null,null,null,null,null,null,null,null,null,null,null,null,null,null,null,null,null,null,null,null,null,null,null,null,null,null,0,0,0]
[null,null,null,null,null,null,null,null,null,null,null,null,null,null,null,null,null,null,null,null,null,null,null,null,null,null,null,null,0,0,0]
[null,null,null,null,null,null,null,null,null,null,null,null,null,null,null,null,null,null,null,null,null,null,null,null,null,null,null,null,0,0,0]
[null,null,null,null,null,null,null,null,null,null,null,null,null,null,null,null,null,null,null,null,null,null,null,null,null,null,null,null,0,0,0]
[null,null,null,null,null,null,null,null,null,null,null,null,null,null,null,null,null,null,null,null,null,null,null,null,null,null,null,null,0,0,0]
[null,null,null,null,null,null,null,null,null,null,null,null,null,null,null,null,null,null,null,null,null,null,null,null,null,null,null,null,0,0,0]
[null,null,null,null,null,null,null,null,null,null,null,null,null,null,null,null,null,null,null,null,null,null,null,null,null,null,null,null,0,0,0]
[null,null,null,null,null,null,null,null,null,null,null,null,null,null,null,null,null,null,null,null,null,null,null,null,null,null,null,null,0,0,0]
[null,null,null,null,null,null,null,null,null,null,null,null,null,null,null,null,null,null,null,null,null,null,null,null,null,null,null,null,{"$f":"IF(AA259=0,0,_xlfn.DAYS(AA259,TODAY()))","v":0},0,0]
[null,null,null,null,null,null,null,null,null,null,null,null,null,null,null,null,null,null,null,null,null,null,null,null,null,null,null,null,0,0,0]
[null,null,null,null,null,null,null,null,null,null,null,null,null,null,null,null,null,null,null,null,null,null,null,null,null,null,null,null,0,0,{"$f":"IF(Z261=0,0,_xlfn.DAYS(Z261,TODAY()))","v":0}]
[null,null,null,null,null,null,null,null,null,null,null,null,null,null,null,null,null,null,null,null,null,null,null,null,null,null,null,null,0,0,0]
[null,null,null,null,null,null,null,null,null,null,null,null,null,null,null,null,null,null,null,null,null,null,null,null,null,null,null,null,0,0,0]
[null,null,null,null,null,null,null,null,null,null,null,null,null,null,null,null,null,null,null,null,null,null,null,null,null,null,null,null,0,0,0]
[null,null,null,null,null,null,null,null,null,null,null,null,null,null,null,null,null,null,null,null,null,null,null,null,null,null,null,null,0,0,0]
[null,null,null,null,null,null,null,null,null,null,null,null,null,null,null,null,null,null,null,null,null,null,null,null,null,null,null,null,0,0,0]
[null,null,null,null,null,null,null,null,null,null,null,null,null,null,null,null,null,null,null,null,null,null,null,null,null,null,null,null,0,0,0]
[null,null,null,null,null,null,null,null,null,null,null,null,null,null,null,null,null,null,null,null,null,null,null,null,null,null,null,null,0,0,0]
[null,null,null,null,null,null,null,null,null,null,null,null,null,null,null,null,null,null,null,null,null,null,null,null,null,null,null,null,0,0,0]
[null,null,null,null,null,null,null,null,null,null,null,null,null,null,null,null,null,null,null,null,null,null,null,null,null,null,null,null,0,0,0]
[null,null,null,null,null,null,null,null,null,null,null,null,null,null,null,null,null,null,null,null,null,null,null,null,null,null,null,null,0,0,0]
[null,null,null,null,null,null,null,null,null,null,null,null,null,null,null,null,null,null,null,null,null,null,null,null,null,null,null,null,0,0,0]
[null,null,null,null,null,null,null,null,null,null,null,null,null,null,null,null,null,null,null,null,null,null,null,null,null,null,null,null,0,0,0]
[null,null,null,null,null,null,null,null,null,null,null,null,null,null,null,null,null,null,null,null,null,null,null,null,null,null,null,null,0,0,0]
[null,null,null,null,null,null,null,null,null,null,null,null,null,null,null,null,null,null,null,null,null,null,null,null,null,null,null,null,0,0,0]
[null,null,null,null,null,null,null,null,null,null,null,null,null,null,null,null,null,null,null,null,null,null,null,null,null,null,null,null,0,0,0]
[null,null,null,null,null,null,null,null,null,null,null,null,null,null,null,null,null,null,null,null,null,null,null,null,null,null,null,null,0,0,0]
[null,null,null,null,null,null,null,null,null,null,null,null,null,null,null,null,null,null,null,null,null,null,null,null,null,null,null,null,0,0,0]
[null,null,null,null,null,null,null,null,null,null,null,null,null,null,null,null,null,null,null,null,null,null,null,null,null,null,null,null,0,0,0]
[null,null,null,null,null,null,null,null,null,null,null,null,null,null,null,null,null,null,null,null,null,null,null,null,null,null,null,null,0,0,0]
[null,null,null,null,null,null,null,null,null,null,null,null,null,null,null,null,null,null,null,null,null,null,null,null,null,null,null,null,0,0,0]
[null,null,null,null,null,null,null,null,null,null,null,null,null,null,null,null,null,null,null,null,null,null,null,null,null,null,null,null,0,0,0]
[null,null,null,null,null,null,null,null,null,null,null,null,null,null,null,null,null,null,null,null,null,null,null,null,null,null,null,null,0,0,0]
[null,null,null,null,null,null,null,null,null,null,null,null,null,null,null,null,null,null,null,null,null,null,null,null,null,null,null,null,0,0,0]
[null,null,null,null,null,null,null,null,null,null,null,null,null,null,null,null,null,null,null,null,null,null,null,null,null,null,null,null,0,0,0]
[null,null,null,null,null,null,null,null,null,null,null,null,null,null,null,null,null,null,null,null,null,null,null,null,null,null,null,null,0,0,0]
[null,null,null,null,null,null,null,null,null,null,null,null,null,null,null,null,null,null,null,null,null,null,null,null,null,null,null,null,0,0,0]
[null,null,null,null,null,null,null,null,null,null,null,null,null,null,null,null,null,null,null,null,null,null,null,null,null,null,null,null,0,0,0]
[null,null,null,null,null,null,null,null,null,null,null,null,null,null,null,null,null,null,null,null,null,null,null,null,null,null,null,null,0,0,0]
[null,null,null,null,null,null,null,null,null,null,null,null,null,null,null,null,null,null,null,null,null,null,null,null,null,null,null,null,0,0,0]
[null,null,null,null,null,null,null,null,null,null,null,null,null,null,null,null,null,null,null,null,null,null,null,null,null,null,null,null,0,0,0]
[null,null,null,null,null,null,null,null,null,null,null,null,null,null,null,null,null,null,null,null,null,null,null,null,null,null,null,null,0,0,0]
[null,null,null,null,null,null,null,null,null,null,null,null,null,null,null,null,null,null,null,null,null,null,null,null,null,null,null,null,0,0,0]
[null,null,null,null,null,null,null,null,null,null,null,null,null,null,null,null,null,null,null,null,null,null,null,null,null,null,null,null,0,0,0]
[null,null,null,null,null,null,null,null,null,null,null,null,null,null,null,null,null,null,null,null,null,null,null,null,null,null,null,null,0,0,0]
[null,null,null,null,null,null,null,null,null,null,null,null,null,null,null,null,null,null,null,null,null,null,null,null,null,null,null,null,0,0,0]
[null,null,null,null,null,null,null,null,null,null,null,null,null,null,null,null,null,null,null,null,null,null,null,null,null,null,null,null,0,0,0]
[null,null,null,null,null,null,null,null,null,null,null,null,null,null,null,null,null,null,null,null,null,null,null,null,null,null,null,null,0,0,0]
[null,null,null,null,null,null,null,null,null,null,null,null,null,null,null,null,null,null,null,null,null,null,null,null,null,null,null,null,0,0,0]
[null,null,null,null,null,null,null,null,null,null,null,null,null,null,null,null,null,null,null,null,null,null,null,null,null,null,null,null,0,0,0]
[null,null,null,null,null,null,null,null,null,null,null,null,null,null,null,null,null,null,null,null,null,null,null,null,null,null,null,null,0,0,0]
[null,null,null,null,null,null,null,null,null,null,null,null,null,null,null,null,null,null,null,null,null,null,null,null,null,null,null,null,0,0,0]
[null,null,null,null,null,null,null,null,null,null,null,null,null,null,null,null,null,null,null,null,null,null,null,null,null,null,null,null,0,0,0]
[null,null,null,null,null,null,null,null,null,null,null,null,null,null,null,null,null,null,null,null,null,null,null,null,null,null,null,null,0,0,0]
[null,null,null,null,null,null,null,null,null,null,null,null,null,null,null,null,null,null,null,null,null,null,null,null,null,null,null,null,0,0,0]
[null,null,null,null,null,null,null,null,null,null,null,null,null,null,null,null,null,null,null,null,null,null,null,null,null,null,null,null,0,0,0]
[null,null,null,null,null,null,null,null,null,null,null,null,null,null,null,null,null,null,null,null,null,null,null,null,null,null,null,null,0,0,0]
[null,null,null,null,null,null,null,null,null,null,null,null,null,null,null,null,null,null,null,null,null,null,null,null,null,null,null,null,0,0,0]
[null,null,null,null,null,null,null,null,null,null,null,null,null,null,null,null,null,null,null,null,null,null,null,null,null,null,null,null,0,0,0]
[null,null,null,null,null,null,null,null,null,null,null,null,null,null,null,null,null,null,null,null,null,null,null,null,null,null,null,null,0,0,0]
[null,null,null,null,null,null,null,null,null,null,null,null,null,null,null,null,null,null,null,null,null,null,null,null,null,null,null,null,0,0,0]
[null,null,null,null,null,null,null,null,null,null,null,null,null,null,null,null,null,null,null,null,null,null,null,null,null,null,null,null,0,0,0]
[null,null,null,null,null,null,null,null,null,null,null,null,null,null,null,null,null,null,null,null,null,null,null,null,null,null,null,null,0,0,0]
[null,null,null,null,null,null,null,null,null,null,null,null,null,null,null,null,null,null,null,null,null,null,null,null,null,null,null,null,0,0,0]
[null,null,null,null,null,null,null,null,null,null,null,null,null,null,null,null,null,null,null,null,null,null,null,null,null,null,null,null,0,0,0]
[null,null,null,null,null,null,null,null,null,null,null,null,null,null,null,null,null,null,null,null,null,null,null,null,null,null,null,null,0,0,0]
[null,null,null,null,null,null,null,null,null,null,null,null,null,null,null,null,null,null,null,null,null,null,null,null,null,null,null,null,0,0,0]
[null,null,null,null,null,null,null,null,null,null,null,null,null,null,null,null,null,null,null,null,null,null,null,null,null,null,null,null,0,0,0]
[null,null,null,null,null,null,null,null,null,null,null,null,null,null,null,null,null,null,null,null,null,null,null,null,null,null,null,null,0,0,0]
[null,null,null,null,null,null,null,null,null,null,null,null,null,null,null,null,null,null,null,null,null,null,null,null,null,null,null,null,0,0,0]
[null,null,null,null,null,null,null,null,null,null,null,null,null,null,null,null,null,null,null,null,null,null,null,null,null,null,null,null,0,0,0]
[null,null,null,null,null,null,null,null,null,null,null,null,null,null,null,null,null,null,null,null,null,null,null,null,null,null,null,null,0,0,0]
[null,null,null,null,null,null,null,null,null,null,null,null,null,null,null,null,null,null,null,null,null,null,null,null,null,null,null,null,{"$f":"IF(AA323=0,0,_xlfn.DAYS(AA323,TODAY()))","v":0},0,0]
[null,null,null,null,null,null,null,null,null,null,null,null,null,null,null,null,null,null,null,null,null,null,null,null,null,null,null,null,0,0,0]
[null,null,null,null,null,null,null,null,null,null,null,null,null,null,null,null,null,null,null,null,null,null,null,null,null,null,null,null,0,0,{"$f":"IF(Z325=0,0,_xlfn.DAYS(Z325,TODAY()))","v":0}]
[null,null,null,null,null,null,null,null,null,null,null,null,null,null,null,null,null,null,null,null,null,null,null,null,null,null,null,null,0,0,0]
[null,null,null,null,null,null,null,null,null,null,null,null,null,null,null,null,null,null,null,null,null,null,null,null,null,null,null,null,0,0,0]
[null,null,null,null,null,null,null,null,null,null,null,null,null,null,null,null,null,null,null,null,null,null,null,null,null,null,null,null,0,0,0]
[null,null,null,null,null,null,null,null,null,null,null,null,null,null,null,null,null,null,null,null,null,null,null,null,null,null,null,null,0,0,0]
[null,null,null,null,null,null,null,null,null,null,null,null,null,null,null,null,null,null,null,null,null,null,null,null,null,null,null,null,0,0,0]
[null,null,null,null,null,null,null,null,null,null,null,null,null,null,null,null,null,null,null,null,null,null,null,null,null,null,null,null,0,0,0]
[null,null,null,null,null,null,null,null,null,null,null,null,null,null,null,null,null,null,null,null,null,null,null,null,null,null,null,null,0,0,0]
[null,null,null,null,null,null,null,null,null,null,null,null,null,null,null,null,null,null,null,null,null,null,null,null,null,null,null,null,0,0,0]
[null,null,null,null,null,null,null,null,null,null,null,null,null,null,null,null,null,null,null,null,null,null,null,null,null,null,null,null,0,0,0]
[null,null,null,null,null,null,null,null,null,null,null,null,null,null,null,null,null,null,null,null,null,null,null,null,null,null,null,null,0,0,0]
[null,null,null,null,null,null,null,null,null,null,null,null,null,null,null,null,null,null,null,null,null,null,null,null,null,null,null,null,0,0,0]
[null,null,null,null,null,null,null,null,null,null,null,null,null,null,null,null,null,null,null,null,null,null,null,null,null,null,null,null,0,0,0]
[null,null,null,null,null,null,null,null,null,null,null,null,null,null,null,null,null,null,null,null,null,null,null,null,null,null,null,null,0,0,0]
[null,null,null,null,null,null,null,null,null,null,null,null,null,null,null,null,null,null,null,null,null,null,null,null,null,null,null,null,0,0,0]
[null,null,null,null,null,null,null,null,null,null,null,null,null,null,null,null,null,null,null,null,null,null,null,null,null,null,null,null,0,0,0]
[null,null,null,null,null,null,null,null,null,null,null,null,null,null,null,null,null,null,null,null,null,null,null,null,null,null,null,null,0,0,0]
[null,null,null,null,null,null,null,null,null,null,null,null,null,null,null,null,null,null,null,null,null,null,null,null,null,null,null,null,0,0,0]
[null,null,null,null,null,null,null,null,null,null,null,null,null,null,null,null,null,null,null,null,null,null,null,null,null,null,null,null,0,0,0]
[null,null,null,null,null,null,null,null,null,null,null,null,null,null,null,null,null,null,null,null,null,null,null,null,null,null,null,null,0,0,0]
[null,null,null,null,null,null,null,null,null,null,null,null,null,null,null,null,null,null,null,null,null,null,null,null,null,null,null,null,0,0,0]
[null,null,null,null,null,null,null,null,null,null,null,null,null,null,null,null,null,null,null,null,null,null,null,null,null,null,null,null,0,0,0]
[null,null,null,null,null,null,null,null,null,null,null,null,null,null,null,null,null,null,null,null,null,null,null,null,null,null,null,null,0,0,0]
[null,null,null,null,null,null,null,null,null,null,null,null,null,null,null,null,null,null,null,null,null,null,null,null,null,null,null,null,0,0,0]
[null,null,null,null,null,null,null,null,null,null,null,null,null,null,null,null,null,null,null,null,null,null,null,null,null,null,null,null,0,0,0]
[null,null,null,null,null,null,null,null,null,null,null,null,null,null,null,null,null,null,null,null,null,null,null,null,null,null,null,null,0,0,0]
[null,null,null,null,null,null,null,null,null,null,null,null,null,null,null,null,null,null,null,null,null,null,null,null,null,null,null,null,0,0,0]
[null,null,null,null,null,null,null,null,null,null,null,null,null,null,null,null,null,null,null,null,null,null,null,null,null,null,null,null,0,0,0]
[null,null,null,null,null,null,null,null,null,null,null,null,null,null,null,null,null,null,null,null,null,null,null,null,null,null,null,null,0,0,0]
[null,null,null,null,null,null,null,null,null,null,null,null,null,null,null,null,null,null,null,null,null,null,null,null,null,null,null,null,0,0,0]
[null,null,null,null,null,null,null,null,null,null,null,null,null,null,null,null,null,null,null,null,null,null,null,null,null,null,null,null,0,0,0]
[null,null,null,null,null,null,null,null,null,null,null,null,null,null,null,null,null,null,null,null,null,null,null,null,null,null,null,null,0,0,0]
[null,null,null,null,null,null,null,null,null,null,null,null,null,null,null,null,null,null,null,null,null,null,null,null,null,null,null,null,0,0,0]
[null,null,null,null,null,null,null,null,null,null,null,null,null,null,null,null,null,null,null,null,null,null,null,null,null,null,null,null,0,0,0]
[null,null,null,null,null,null,null,null,null,null,null,null,null,null,null,null,null,null,null,null,null,null,null,null,null,null,null,null,0,0,0]
[null,null,null,null,null,null,null,null,null,null,null,null,null,null,null,null,null,null,null,null,null,null,null,null,null,null,null,null,0,0,0]
[null,null,null,null,null,null,null,null,null,null,null,null,null,null,null,null,null,null,null,null,null,null,null,null,null,null,null,null,0,0,0]
[null,null,null,null,null,null,null,null,null,null,null,null,null,null,null,null,null,null,null,null,null,null,null,null,null,null,null,null,0,0,0]
[null,null,null,null,null,null,null,null,null,null,null,null,null,null,null,null,null,null,null,null,null,null,null,null,null,null,null,null,0,0,0]
[null,null,null,null,null,null,null,null,null,null,null,null,null,null,null,null,null,null,null,null,null,null,null,null,null,null,null,null,0,0,0]
[null,null,null,null,null,null,null,null,null,null,null,null,null,null,null,null,null,null,null,null,null,null,null,null,null,null,null,null,0,0,0]
[null,null,null,null,null,null,null,null,null,null,null,null,null,null,null,null,null,null,null,null,null,null,null,null,null,null,null,null,0,0,0]
[null,null,null,null,null,null,null,null,null,null,null,null,null,null,null,null,null,null,null,null,null,null,null,null,null,null,null,null,0,0,0]
[null,null,null,null,null,null,null,null,null,null,null,null,null,null,null,null,null,null,null,null,null,null,null,null,null,null,null,null,0,0,0]
[null,null,null,null,null,null,null,null,null,null,null,null,null,null,null,null,null,null,null,null,null,null,null,null,null,null,null,null,0,0,0]
[null,null,null,null,null,null,null,null,null,null,null,null,null,null,null,null,null,null,null,null,null,null,null,null,null,null,null,null,0,0,0]
[null,null,null,null,null,null,null,null,null,null,null,null,null,null,null,null,null,null,null,null,null,null,null,null,null,null,null,null,0,0,0]
[null,null,null,null,null,null,null,null,null,null,null,null,null,null,null,null,null,null,null,null,null,null,null,null,null,null,null,null,0,0,0]
[null,null,null,null,null,null,null,null,null,null,null,null,null,null,null,null,null,null,null,null,null,null,null,null,null,null,null,null,0,0,0]
[null,null,null,null,null,null,null,null,null,null,null,null,null,null,null,null,null,null,null,null,null,null,null,null,null,null,null,null,0,0,0]
[null,null,null,null,null,null,null,null,null,null,null,null,null,null,null,null,null,null,null,null,null,null,null,null,null,null,null,null,0,0,0]
[null,null,null,null,null,null,null,null,null,null,null,null,null,null,null,null,null,null,null,null,null,null,null,null,null,null,null,null,0,0,0]
[null,null,null,null,null,null,null,null,null,null,null,null,null,null,null,null,null,null,null,null,null,null,null,null,null,null,null,null,0,0,0]
[null,null,null,null,null,null,null,null,null,null,null,null,null,null,null,null,null,null,null,null,null,null,null,null,null,null,null,null,0,0,0]
[null,null,null,null,null,null,null,null,null,null,null,null,null,null,null,null,null,null,null,null,null,null,null,null,null,null,null,null,0,0,0]
[null,null,null,null,null,null,null,null,null,null,null,null,null,null,null,null,null,null,null,null,null,null,null,null,null,null,null,null,0,0,0]
[null,null,null,null,null,null,null,null,null,null,null,null,null,null,null,null,null,null,null,null,null,null,null,null,null,null,null,null,0,0,0]
[null,null,null,null,null,null,null,null,null,null,null,null,null,null,null,null,null,null,null,null,null,null,null,null,null,null,null,null,{"$f":"IF(AA382=0,0,_xlfn.DAYS(AA382,TODAY()))","v":0},0,{"$f":"IF(Z382=0,0,_xlfn.DAYS(Z382,TODAY()))","v":0}]
[null,null,null,null,null,null,null,null,null,null,null,null,null,null,null,null,null,null,null,null,null,null,null,null,null,null,null,null,0,0,{"$f":"IF(Z383=0,0,_xlfn.DAYS(Z383,TODAY()))","v":0}]
[null,null,null,null,null,null,null,null,null,null,null,null,null,null,null,null,null,null,null,null,null,null,null,null,null,null,null,null,0,0,{"$f":"IF(Z384=0,0,_xlfn.DAYS(Z384,TODAY()))","v":0}]
[null,null,null,null,null,null,null,null,null,null,null,null,null,null,null,null,null,null,null,null,null,null,null,null,null,null,null,null,0,0,{"$f":"IF(Z385=0,0,_xlfn.DAYS(Z385,TODAY()))","v":0}]
[null,null,null,null,null,null,null,null,null,null,null,null,null,null,null,null,null,null,null,null,null,null,null,null,null,null,null,null,{"$f":"IF(AA386=0,0,_xlfn.DAYS(AA386,TODAY()))","v":0},0,{"$f":"IF(Z386=0,0,_xlfn.DAYS(Z386,TODAY()))","v":0}]
[null,null,null,null,null,null,null,null,null,null,null,null,null,null,null,null,null,null,null,null,null,null,null,null,null,null,null,null,0,0,{"$f":"IF(Z387=0,0,_xlfn.DAYS(Z387,TODAY()))","v":0}]
[null,null,null,null,null,null,null,null,null,null,null,null,null,null,null,null,null,null,null,null,null,null,null,null,null,null,null,null,0,0,0]
[null,null,null,null,null,null,null,null,null,null,null,null,null,null,null,null,null,null,null,null,null,null,null,null,null,null,null,null,0,0,0]
[null,null,null,null,null,null,null,null,null,null,null,null,null,null,null,null,null,null,null,null,null,null,null,null,null,null,null,null,0,0,0]
[null,null,null,null,null,null,null,null,null,null,null,null,null,null,null,null,null,null,null,null,null,null,null,null,null,null,null,null,0,0,0]
[null,null,null,null,null,null,null,null,null,null,null,null,null,null,null,null,null,null,null,null,null,null,null,null,null,null,null,null,0,0,0]
[null,null,null,null,null,null,null,null,null,null,null,null,null,null,null,null,null,null,null,null,null,null,null,null,null,null,null,null,0,0,0]
[null,null,null,null,null,null,null,null,null,null,null,null,null,null,null,null,null,null,null,null,null,null,null,null,null,null,null,null,0,0,0]
[null,null,null,null,null,null,null,null,null,null,null,null,null,null,null,null,null,null,null,null,null,null,null,null,null,null,null,null,0,0,0]
[null,null,null,null,null,null,null,null,null,null,null,null,null,null,null,null,null,null,null,null,null,null,null,null,null,null,null,null,0,0,0]
[null,null,null,null,null,null,null,null,null,null,null,null,null,null,null,null,null,null,null,null,null,null,null,null,null,null,null,null,0,0,0]
[null,null,null,null,null,null,null,null,null,null,null,null,null,null,null,null,null,null,null,null,null,null,null,null,null,null,null,null,0,0,0]
[null,null,null,null,null,null,null,null,null,null,null,null,null,null,null,null,null,null,null,null,null,null,null,null,null,null,null,null,0,0,0]
[null,null,null,null,null,null,null,null,null,null,null,null,null,null,null,null,null,null,null,null,null,null,null,null,null,null,null,null,0,0,0]
[null,null,null,null,null,null,null,null,null,null,null,null,null,null,null,null,null,null,null,null,null,null,null,null,null,null,null,null,0,0,0]
[null,null,null,null,null,null,null,null,null,null,null,null,null,null,null,null,null,null,null,null,null,null,null,null,null,null,null,null,0,0,0]
[null,null,null,null,null,null,null,null,null,null,null,null,null,null,null,null,null,null,null,null,null,null,null,null,null,null,null,null,0,0,0]
[null,null,null,null,null,null,null,null,null,null,null,null,null,null,null,null,null,null,null,null,null,null,null,null,null,null,null,null,0,0,0]
[null,null,null,null,null,null,null,null,null,null,null,null,null,null,null,null,null,null,null,null,null,null,null,null,null,null,null,null,0,0,0]
[null,null,null,null,null,null,null,null,null,null,null,null,null,null,null,null,null,null,null,null,null,null,null,null,null,null,null,null,0,0,0]
[null,null,null,null,null,null,null,null,null,null,null,null,null,null,null,null,null,null,null,null,null,null,null,null,null,null,null,null,0,0,0]
[null,null,null,null,null,null,null,null,null,null,null,null,null,null,null,null,null,null,null,null,null,null,null,null,null,null,null,null,0,0,0]
[null,null,null,null,null,null,null,null,null,null,null,null,null,null,null,null,null,null,null,null,null,null,null,null,null,null,null,null,0,0,0]
[null,null,null,null,null,null,null,null,null,null,null,null,null,null,null,null,null,null,null,null,null,null,null,null,null,null,null,null,0,0,0]
[null,null,null,null,null,null,null,null,null,null,null,null,null,null,null,null,null,null,null,null,null,null,null,null,null,null,null,null,0,0,0]
[null,null,null,null,null,null,null,null,null,null,null,null,null,null,null,null,null,null,null,null,null,null,null,null,null,null,null,null,0,0,0]
[null,null,null,null,null,null,null,null,null,null,null,null,null,null,null,null,null,null,null,null,null,null,null,null,null,null,null,null,0,0,0]
[null,null,null,null,null,null,null,null,null,null,null,null,null,null,null,null,null,null,null,null,null,null,null,null,null,null,null,null,0,0,0]
[null,null,null,null,null,null,null,null,null,null,null,null,null,null,null,null,null,null,null,null,null,null,null,null,null,null,null,null,0,0,0]
[null,null,null,null,null,null,null,null,null,null,null,null,null,null,null,null,null,null,null,null,null,null,null,null,null,null,null,null,0,0,0]
[null,null,null,null,null,null,null,null,null,null,null,null,null,null,null,null,null,null,null,null,null,null,null,null,null,null,null,null,0,0,0]
[null,null,null,null,null,null,null,null,null,null,null,null,null,null,null,null,null,null,null,null,null,null,null,null,null,null,null,null,0,0,0]
[null,null,null,null,null,null,null,null,null,null,null,null,null,null,null,null,null,null,null,null,null,null,null,null,null,null,null,null,0,0,0]
[null,null,null,null,null,null,null,null,null,null,null,null,null,null,null,null,null,null,null,null,null,null,null,null,null,null,null,null,0,0,0]
[null,null,null,null,null,null,null,null,null,null,null,null,null,null,null,null,null,null,null,null,null,null,null,null,null,null,null,null,0,0,0]
[null,null,null,null,null,null,null,null,null,null,null,null,null,null,null,null,null,null,null,null,null,null,null,null,null,null,null,null,0,0,0]
[null,null,null,null,null,null,null,null,null,null,null,null,null,null,null,null,null,null,null,null,null,null,null,null,null,null,null,null,0,0,0]
[null,null,null,null,null,null,null,null,null,null,null,null,null,null,null,null,null,null,null,null,null,null,null,null,null,null,null,null,0,0,0]
[null,null,null,null,null,null,null,null,null,null,null,null,null,null,null,null,null,null,null,null,null,null,null,null,null,null,null,null,0,0,0]
[null,null,null,null,null,null,null,null,null,null,null,null,null,null,null,null,null,null,null,null,null,null,null,null,null,null,null,null,0,0,0]
[null,null,null,null,null,null,null,null,null,null,null,null,null,null,null,null,null,null,null,null,null,null,null,null,null,null,null,null,0,0,0]
[null,null,null,null,null,null,null,null,null,null,null,null,null,null,null,null,null,null,null,null,null,null,null,null,null,null,null,null,0,0,0]
[null,null,null,null,null,null,null,null,null,null,null,null,null,null,null,null,null,null,null,null,null,null,null,null,null,null,null,null,0,0,0]
[null,null,null,null,null,null,null,null,null,null,null,null,null,null,null,null,null,null,null,null,null,null,null,null,null,null,null,null,0,0,0]
[null,null,null,null,null,null,null,null,null,null,null,null,null,null,null,null,null,null,null,null,null,null,null,null,null,null,null,null,0,0,0]
[null,null,null,null,null,null,null,null,null,null,null,null,null,null,null,null,null,null,null,null,null,null,null,null,null,null,null,null,0,0,0]
[null,null,null,null,null,null,null,null,null,null,null,null,null,null,null,null,null,null,null,null,null,null,null,null,null,null,null,null,0,0,0]
[null,null,null,null,null,null,null,null,null,null,null,null,null,null,null,null,null,null,null,null,null,null,null,null,null,null,null,null,0,0,0]
[null,null,null,null,null,null,null,null,null,null,null,null,null,null,null,null,null,null,null,null,null,null,null,null,null,null,null,null,0,0,0]
[null,null,null,null,null,null,null,null,null,null,null,null,null,null,null,null,null,null,null,null,null,null,null,null,null,null,null,null,0,0,0]
[null,null,null,null,null,null,null,null,null,null,null,null,null,null,null,null,null,null,null,null,null,null,null,null,null,null,null,null,0,0,0]
[null,null,null,null,null,null,null,null,null,null,null,null,null,null,null,null,null,null,null,null,null,null,null,null,null,null,null,null,0,0,0]
[null,null,null,null,null,null,null,null,null,null,null,null,null,null,null,null,null,null,null,null,null,null,null,null,null,null,null,null,0,0,0]
[null,null,null,null,null,null,null,null,null,null,null,null,null,null,null,null,null,null,null,null,null,null,null,null,null,null,null,null,0,0,0]
[null,null,null,null,null,null,null,null,null,null,null,null,null,null,null,null,null,null,null,null,null,null,null,null,null,null,null,null,0,0,0]
[null,null,null,null,null,null,null,null,null,null,null,null,null,null,null,null,null,null,null,null,null,null,null,null,null,null,null,null,0,0,0]
[null,null,null,null,null,null,null,null,null,null,null,null,null,null,null,null,null,null,null,null,null,null,null,null,null,null,null,null,0,0,0]
[null,null,null,null,null,null,null,null,null,null,null,null,null,null,null,null,null,null,null,null,null,null,null,null,null,null,null,null,0,0,0]
[null,null,null,null,null,null,null,null,null,null,null,null,null,null,null,null,null,null,null,null,null,null,null,null,null,null,null,null,0,0,0]
[null,null,null,null,null,null,null,null,null,null,null,null,null,null,null,null,null,null,null,null,null,null,null,null,null,null,null,null,0,0,0]
[null,null,null,null,null,null,null,null,null,null,null,null,null,null,null,null,null,null,null,null,null,null,null,null,null,null,null,null,0,0,0]
[null,null,null,null,null,null,null,null,null,null,null,null,null,null,null,null,null,null,null,null,null,null,null,null,null,null,null,null,0,0,0]
[null,null,null,null,null,null,null,null,null,null,null,null,null,null,null,null,null,null,null,null,null,null,null,null,null,null,null,null,0,0,0]
[null,null,null,null,null,null,null,null,null,null,null,null,null,null,null,null,null,null,null,null,null,null,null,null,null,null,null,null,{"$f":"IF(AA450=0,0,_xlfn.DAYS(AA450,TODAY()))","v":0},0,0]
[null,null,null,null,null,null,null,null,null,null,null,null,null,null,null,null,null,null,null,null,null,null,null,null,null,null,null,null,0,0,{"$f":"IF(Z451=0,0,_xlfn.DAYS(Z451,TODAY()))","v":0}]
[null,null,null,null,null,null,null,null,null,null,null,null,null,null,null,null,null,null,null,null,null,null,null,null,null,null,null,null,0,0,0]
[null,null,null,null,null,null,null,null,null,null,null,null,null,null,null,null,null,null,null,null,null,null,null,null,null,null,null,null,0,0,0]
[null,null,null,null,null,null,null,null,null,null,null,null,null,null,null,null,null,null,null,null,null,null,null,null,null,null,null,null,0,0,0]
[null,null,null,null,null,null,null,null,null,null,null,null,null,null,null,null,null,null,null,null,null,null,null,null,null,null,null,null,0,0,0]
[null,null,null,null,null,null,null,null,null,null,null,null,null,null,null,null,null,null,null,null,null,null,null,null,null,null,null,null,0,0,0]
[null,null,null,null,null,null,null,null,null,null,null,null,null,null,null,null,null,null,null,null,null,null,null,null,null,null,null,null,0,0,0]
[null,null,null,null,null,null,null,null,null,null,null,null,null,null,null,null,null,null,null,null,null,null,null,null,null,null,null,null,0,0,0]
[null,null,null,null,null,null,null,null,null,null,null,null,null,null,null,null,null,null,null,null,null,null,null,null,null,null,null,null,0,0,0]
[null,null,null,null,null,null,null,null,null,null,null,null,null,null,null,null,null,null,null,null,null,null,null,null,null,null,null,null,0,0,0]
[null,null,null,null,null,null,null,null,null,null,null,null,null,null,null,null,null,null,null,null,null,null,null,null,null,null,null,null,0,0,0]
[null,null,null,null,null,null,null,null,null,null,null,null,null,null,null,null,null,null,null,null,null,null,null,null,null,null,null,null,0,0,0]
[null,null,null,null,null,null,null,null,null,null,null,null,null,null,null,null,null,null,null,null,null,null,null,null,null,null,null,null,0,0,0]
[null,null,null,null,null,null,null,null,null,null,null,null,null,null,null,null,null,null,null,null,null,null,null,null,null,null,null,null,0,0,0]
[null,null,null,null,null,null,null,null,null,null,null,null,null,null,null,null,null,null,null,null,null,null,null,null,null,null,null,null,0,0,0]
[null,null,null,null,null,null,null,null,null,null,null,null,null,null,null,null,null,null,null,null,null,null,null,null,null,null,null,null,0,0,0]
[null,null,null,null,null,null,null,null,null,null,null,null,null,null,null,null,null,null,null,null,null,null,null,null,null,null,null,null,0,0,0]
[null,null,null,null,null,null,null,null,null,null,null,null,null,null,null,null,null,null,null,null,null,null,null,null,null,null,null,null,0,0,0]
[null,null,null,null,null,null,null,null,null,null,null,null,null,null,null,null,null,null,null,null,null,null,null,null,null,null,null,null,0,0,0]
[null,null,null,null,null,null,null,null,null,null,null,null,null,null,null,null,null,null,null,null,null,null,null,null,null,null,null,null,0,0,0]
[null,null,null,null,null,null,null,null,null,null,null,null,null,null,null,null,null,null,null,null,null,null,null,null,null,null,null,null,0,0,0]
[null,null,null,null,null,null,null,null,null,null,null,null,null,null,null,null,null,null,null,null,null,null,null,null,null,null,null,null,0,0,0]
[null,null,null,null,null,null,null,null,null,null,null,null,null,null,null,null,null,null,null,null,null,null,null,null,null,null,null,null,0,0,0]
[null,null,null,null,null,null,null,null,null,null,null,null,null,null,null,null,null,null,null,null,null,null,null,null,null,null,null,null,0,0,0]
[null,null,null,null,null,null,null,null,null,null,null,null,null,null,null,null,null,null,null,null,null,null,null,null,null,null,null,null,0,0,0]
[null,null,null,null,null,null,null,null,null,null,null,null,null,null,null,null,null,null,null,null,null,null,null,null,null,null,null,null,0,0,0]
[null,null,null,null,null,null,null,null,null,null,null,null,null,null,null,null,null,null,null,null,null,null,null,null,null,null,null,null,0,0,0]
[null,null,null,null,null,null,null,null,null,null,null,null,null,null,null,null,null,null,null,null,null,null,null,null,null,null,null,null,0,0,0]
[null,null,null,null,null,null,null,null,null,null,null,null,null,null,null,null,null,null,null,null,null,null,null,null,null,null,null,null,0,0,0]
[null,null,null,null,null,null,null,null,null,null,null,null,null,null,null,null,null,null,null,null,null,null,null,null,null,null,null,null,0,0,0]
[null,null,null,null,null,null,null,null,null,null,null,null,null,null,null,null,null,null,null,null,null,null,null,null,null,null,null,null,0,0,0]
[null,null,null,null,null,null,null,null,null,null,null,null,null,null,null,null,null,null,null,null,null,null,null,null,null,null,null,null,0,0,0]
[null,null,null,null,null,null,null,null,null,null,null,null,null,null,null,null,null,null,null,null,null,null,null,null,null,null,null,null,0,0,0]
[null,null,null,null,null,null,null,null,null,null,null,null,null,null,null,null,null,null,null,null,null,null,null,null,null,null,null,null,0,0,0]
[null,null,null,null,null,null,null,null,null,null,null,null,null,null,null,null,null,null,null,null,null,null,null,null,null,null,null,null,0,0,0]
[null,null,null,null,null,null,null,null,null,null,null,null,null,null,null,null,null,null,null,null,null,null,null,null,null,null,null,null,0,0,0]
[null,null,null,null,null,null,null,null,null,null,null,null,null,null,null,null,null,null,null,null,null,null,null,null,null,null,null,null,0,0,0]
[null,null,null,null,null,null,null,null,null,null,null,null,null,null,null,null,null,null,null,null,null,null,null,null,null,null,null,null,0,0,0]
[null,null,null,null,null,null,null,null,null,null,null,null,null,null,null,null,null,null,null,null,null,null,null,null,null,null,null,null,0,0,0]
[null,null,null,null,null,null,null,null,null,null,null,null,null,null,null,null,null,null,null,null,null,null,null,null,null,null,null,null,0,0,0]
[null,null,null,null,null,null,null,null,null,null,null,null,null,null,null,null,null,null,null,null,null,null,null,null,null,null,null,null,0,0,0]
[null,null,null,null,null,null,null,null,null,null,null,null,null,null,null,null,null,null,null,null,null,null,null,null,null,null,null,null,0,0,0]
[null,null,null,null,null,null,null,null,null,null,null,null,null,null,null,null,null,null,null,null,null,null,null,null,null,null,null,null,0,0,0]
[null,null,null,null,null,null,null,null,null,null,null,null,null,null,null,null,null,null,null,null,null,null,null,null,null,null,null,null,0,0,0]
[null,null,null,null,null,null,null,null,null,null,null,null,null,null,null,null,null,null,null,null,null,null,null,null,null,null,null,null,0,0,0]
[null,null,null,null,null,null,null,null,null,null,null,null,null,null,null,null,null,null,null,null,null,null,null,null,null,null,null,null,0,0,0]
[null,null,null,null,null,null,null,null,null,null,null,null,null,null,null,null,null,null,null,null,null,null,null,null,null,null,null,null,0,0,0]
[null,null,null,null,null,null,null,null,null,null,null,null,null,null,null,null,null,null,null,null,null,null,null,null,null,null,null,null,0,0,0]
[null,null,null,null,null,null,null,null,null,null,null,null,null,null,null,null,null,null,null,null,null,null,null,null,null,null,null,null,0,0,0]
[null,null,null,null,null,null,null,null,null,null,null,null,null,null,null,null,null,null,null,null,null,null,null,null,null,null,null,null,0,0,0]
[null,null,null,null,null,null,null,null,null,null,null,null,null,null,null,null,null,null,null,null,null,null,null,null,null,null,null,null,0,0,0]
[null,null,null,null,null,null,null,null,null,null,null,null,null,null,null,null,null,null,null,null,null,null,null,null,null,null,null,null,0,0,0]
[null,null,null,null,null,null,null,null,null,null,null,null,null,null,null,null,null,null,null,null,null,null,null,null,null,null,null,null,0,0,0]
[null,null,null,null,null,null,null,null,null,null,null,null,null,null,null,null,null,null,null,null,null,null,null,null,null,null,null,null,0,0,0]
[null,null,null,null,null,null,null,null,null,null,null,null,null,null,null,null,null,null,null,null,null,null,null,null,null,null,null,null,0,0,0]
[null,null,null,null,null,null,null,null,null,null,null,null,null,null,null,null,null,null,null,null,null,null,null,null,null,null,null,null,0,0,0]
[null,null,null,null,null,null,null,null,null,null,null,null,null,null,null,null,null,null,null,null,null,null,null,null,null,null,null,null,0,0,0]
[null,null,null,null,null,null,null,null,null,null,null,null,null,null,null,null,null,null,null,null,null,null,null,null,null,null,null,null,0,0,0]
[null,null,null,null,null,null,null,null,null,null,null,null,null,null,null,null,null,null,null,null,null,null,null,null,null,null,null,null,0,0,0]
[null,null,null,null,null,null,null,null,null,null,null,null,null,null,null,null,null,null,null,null,null,null,null,null,null,null,null,null,0,0,0]
[null,null,null,null,null,null,null,null,null,null,null,null,null,null,null,null,null,null,null,null,null,null,null,null,null,null,null,null,0,0,0]
[null,null,null,null,null,null,null,null,null,null,null,null,null,null,null,null,null,null,null,null,null,null,null,null,null,null,null,null,0,0,0]
[null,null,null,null,null,null,null,null,null,null,null,null,null,null,null,null,null,null,null,null,null,null,null,null,null,null,null,null,0,0,0]
[null,null,null,null,null,null,null,null,null,null,null,null,null,null,null,null,null,null,null,null,null,null,null,null,null,null,null,null,{"$f":"IF(AA514=0,0,_xlfn.DAYS(AA514,TODAY()))","v":0},0,0]
[null,null,null,null,null,null,null,null,null,null,null,null,null,null,null,null,null,null,null,null,null,null,null,null,null,null,null,null,0,0,{"$f":"IF(Z515=0,0,_xlfn.DAYS(Z515,TODAY()))","v":0}]
[null,null,null,null,null,null,null,null,null,null,null,null,null,null,null,null,null,null,null,null,null,null,null,null,null,null,null,null,0,0,0]
[null,null,null,null,null,null,null,null,null,null,null,null,null,null,null,null,null,null,null,null,null,null,null,null,null,null,null,null,0,0,0]
[null,null,null,null,null,null,null,null,null,null,null,null,null,null,null,null,null,null,null,null,null,null,null,null,null,null,null,null,0,0,0]
[null,null,null,null,null,null,null,null,null,null,null,null,null,null,null,null,null,null,null,null,null,null,null,null,null,null,null,null,0,0,0]
[null,null,null,null,null,null,null,null,null,null,null,null,null,null,null,null,null,null,null,null,null,null,null,null,null,null,null,null,0,0,0]
[null,null,null,null,null,null,null,null,null,null,null,null,null,null,null,null,null,null,null,null,null,null,null,null,null,null,null,null,0,0,0]
[null,null,null,null,null,null,null,null,null,null,null,null,null,null,null,null,null,null,null,null,null,null,null,null,null,null,null,null,0,0,0]
[null,null,null,null,null,null,null,null,null,null,null,null,null,null,null,null,null,null,null,null,null,null,null,null,null,null,null,null,0,0,0]
[null,null,null,null,null,null,null,null,null,null,null,null,null,null,null,null,null,null,null,null,null,null,null,null,null,null,null,null,0,0,0]
[null,null,null,null,null,null,null,null,null,null,null,null,null,null,null,null,null,null,null,null,null,null,null,null,null,null,null,null,0,0,0]
[null,null,null,null,null,null,null,null,null,null,null,null,null,null,null,null,null,null,null,null,null,null,null,null,null,null,null,null,0,0,0]
[null,null,null,null,null,null,null,null,null,null,null,null,null,null,null,null,null,null,null,null,null,null,null,null,null,null,null,null,0,0,0]
[null,null,null,null,null,null,null,null,null,null,null,null,null,null,null,null,null,null,null,null,null,null,null,null,null,null,null,null,0,0,0]
[null,null,null,null,null,null,null,null,null,null,null,null,null,null,null,null,null,null,null,null,null,null,null,null,null,null,null,null,0,0,0]
[null,null,null,null,null,null,null,null,null,null,null,null,null,null,null,null,null,null,null,null,null,null,null,null,null,null,null,null,0,0,0]
[null,null,null,null,null,null,null,null,null,null,null,null,null,null,null,null,null,null,null,null,null,null,null,null,null,null,null,null,0,0,0]
[null,null,null,null,null,null,null,null,null,null,null,null,null,null,null,null,null,null,null,null,null,null,null,null,null,null,null,null,0,0,0]
[null,null,null,null,null,null,null,null,null,null,null,null,null,null,null,null,null,null,null,null,null,null,null,null,null,null,null,null,0,0,0]
[null,null,null,null,null,null,null,null,null,null,null,null,null,null,null,null,null,null,null,null,null,null,null,null,null,null,null,null,0,0]
[null,null,null,null,null,null,null,null,null,null,null,null,null,null,null,null,null,null,null,null,null,null,null,null,null,null,null,null,0,0]
[null,null,null,null,null,null,null,null,null,null,null,null,null,null,null,null,null,null,null,null,null,null,null,null,null,null,null,null,0,0]
[null,null,null,null,null,null,null,null,null,null,null,null,null,null,null,null,null,null,null,null,null,null,null,null,null,null,null,null,0,0]
[null,null,null,null,null,null,null,null,null,null,null,null,null,null,null,null,null,null,null,null,null,null,null,null,null,null,null,null,0,0]
[null,null,null,null,null,null,null,null,null,null,null,null,null,null,null,null,null,null,null,null,null,null,null,null,null,null,null,null,{"$f":"IF(AA539=0,0,_xlfn.DAYS(AA539,TODAY()))","v":0},0]
[null,null,null,null,null,null,null,null,null,null,null,null,null,null,null,null,null,null,null,null,null,null,null,null,null,null,null,null,0,0]
[null,null,null,null,null,null,null,null,null,null,null,null,null,null,null,null,null,null,null,null,null,null,null,null,null,null,null,null,0,0]
[null,null,null,null,null,null,null,null,null,null,null,null,null,null,null,null,null,null,null,null,null,null,null,null,null,null,null,null,0,0]
[null,null,null,null,null,null,null,null,null,null,null,null,null,null,null,null,null,null,null,null,null,null,null,null,null,null,null,null,0,{"$f":"IF(AB543=0,0,_xlfn.DAYS(AB543,TODAY()))","v":0}]
[null,null,null,null,null,null,null,null,null,null,null,null,null,null,null,null,null,null,null,null,null,null,null,null,null,null,null,null,0,0]
[null,null,null,null,null,null,null,null,null,null,null,null,null,null,null,null,null,null,null,null,null,null,null,null,null,null,null,null,0,0]
[null,null,null,null,null,null,null,null,null,null,null,null,null,null,null,null,null,null,null,null,null,null,null,null,null,null,null,null,0,0]
[null,null,null,null,null,null,null,null,null,null,null,null,null,null,null,null,null,null,null,null,null,null,null,null,null,null,null,null,0,0]
[null,null,null,null,null,null,null,null,null,null,null,null,null,null,null,null,null,null,null,null,null,null,null,null,null,null,null,null,0,0]
[null,null,null,null,null,null,null,null,null,null,null,null,null,null,null,null,null,null,null,null,null,null,null,null,null,null,null,null,0,0]
[null,null,null,null,null,null,null,null,null,null,null,null,null,null,null,null,null,null,null,null,null,null,null,null,null,null,null,null,0,0]
[null,null,null,null,null,null,null,null,null,null,null,null,null,null,null,null,null,null,null,null,null,null,null,null,null,null,null,null,0,0]
[null,null,null,null,null,null,null,null,null,null,null,null,null,null,null,null,null,null,null,null,null,null,null,null,null,null,null,null,0,0]
[null,null,null,null,null,null,null,null,null,null,null,null,null,null,null,null,null,null,null,null,null,null,null,null,null,null,null,null,0,0]
[null,null,null,null,null,null,null,null,null,null,null,null,null,null,null,null,null,null,null,null,null,null,null,null,null,null,null,null,0,0]
[null,null,null,null,null,null,null,null,null,null,null,null,null,null,null,null,null,null,null,null,null,null,null,null,null,null,null,null,0,0]
[null,null,null,null,null,null,null,null,null,null,null,null,null,null,null,null,null,null,null,null,null,null,null,null,null,null,null,null,0,0]
[null,null,null,null,null,null,null,null,null,null,null,null,null,null,null,null,null,null,null,null,null,null,null,null,null,null,null,null,0,0]
[null,null,null,null,null,null,null,null,null,null,null,null,null,null,null,null,null,null,null,null,null,null,null,null,null,null,null,null,0,0]
[null,null,null,null,null,null,null,null,null,null,null,null,null,null,null,null,null,null,null,null,null,null,null,null,null,null,null,null,0,0]
[null,null,null,null,null,null,null,null,null,null,null,null,null,null,null,null,null,null,null,null,null,null,null,null,null,null,null,null,0,0]
[null,null,null,null,null,null,null,null,null,null,null,null,null,null,null,null,null,null,null,null,null,null,null,null,null,null,null,null,0,0]
[null,null,null,null,null,null,null,null,null,null,null,null,null,null,null,null,null,null,null,null,null,null,null,null,null,null,null,null,0,0]
[null,null,null,null,null,null,null,null,null,null,null,null,null,null,null,null,null,null,null,null,null,null,null,null,null,null,null,null,0,0]
[null,null,null,null,null,null,null,null,null,null,null,null,null,null,null,null,null,null,null,null,null,null,null,null,null,null,null,null,0,0]
[null,null,null,null,null,null,null,null,null,null,null,null,null,null,null,null,null,null,null,null,null,null,null,null,null,null,null,null,0,0]
[null,null,null,null,null,null,null,null,null,null,null,null,null,null,null,null,null,null,null,null,null,null,null,null,null,null,null,null,0,0]
[null,null,null,null,null,null,null,null,null,null,null,null,null,null,null,null,null,null,null,null,null,null,null,null,null,null,null,null,0,0]
[null,null,null,null,null,null,null,null,null,null,null,null,null,null,null,null,null,null,null,null,null,null,null,null,null,null,null,null,0,0]
[null,null,null,null,null,null,null,null,null,null,null,null,null,null,null,null,null,null,null,null,null,null,null,null,null,null,null,null,0,0]
[null,null,null,null,null,null,null,null,null,null,null,null,null,null,null,null,null,null,null,null,null,null,null,null,null,null,null,null,0,0]
[null,null,null,null,null,null,null,null,null,null,null,null,null,null,null,null,null,null,null,null,null,null,null,null,null,null,null,null,0,0]
[null,null,null,null,null,null,null,null,null,null,null,null,null,null,null,null,null,null,null,null,null,null,null,null,null,null,null,null,0,0]
[null,null,null,null,null,null,null,null,null,null,null,null,null,null,null,null,null,null,null,null,null,null,null,null,null,null,null,null,0,0]
[null,null,null,null,null,null,null,null,null,null,null,null,null,null,null,null,null,null,null,null,null,null,null,null,null,null,null,null,0,0]
[null,null,null,null,null,null,null,null,null,null,null,null,null,null,null,null,null,null,null,null,null,null,null,null,null,null,null,null,0,0]
[null,null,null,null,null,null,null,null,null,null,null,null,null,null,null,null,null,null,null,null,null,null,null,null,null,null,null,null,0,0]
[null,null,null,null,null,null,null,null,null,null,null,null,null,null,null,null,null,null,null,null,null,null,null,null,null,null,null,null,0,0]
[null,null,null,null,null,null,null,null,null,null,null,null,null,null,null,null,null,null,null,null,null,null,null,null,null,null,null,null,{"$f":"IF(AA578=0,0,_xlfn.DAYS(AA578,TODAY()))","v":0},{"$f":"IF(AB578=0,0,_xlfn.DAYS(AB578,TODAY()))","v":0}]
[null,null,null,null,null,null,null,null,null,null,null,null,null,null,null,null,null,null,null,null,null,null,null,null,null,null,null,null,0,0]
[null,null,null,null,null,null,null,null,null,null,null,null,null,null,null,null,null,null,null,null,null,null,null,null,null,null,null,null,0,0]
[null,null,null,null,null,null,null,null,null,null,null,null,null,null,null,null,null,null,null,null,null,null,null,null,null,null,null,null,0,0]
[null,null,null,null,null,null,null,null,null,null,null,null,null,null,null,null,null,null,null,null,null,null,null,null,null,null,null,null,0,0]
[null,null,null,null,null,null,null,null,null,null,null,null,null,null,null,null,null,null,null,null,null,null,null,null,null,null,null,null,0,0]
[null,null,null,null,null,null,null,null,null,null,null,null,null,null,null,null,null,null,null,null,null,null,null,null,null,null,null,null,0,0]
[null,null,null,null,null,null,null,null,null,null,null,null,null,null,null,null,null,null,null,null,null,null,null,null,null,null,null,null,0,0]
[null,null,null,null,null,null,null,null,null,null,null,null,null,null,null,null,null,null,null,null,null,null,null,null,null,null,null,null,0,0]
[null,null,null,null,null,null,null,null,null,null,null,null,null,null,null,null,null,null,null,null,null,null,null,null,null,null,null,null,0,0]
[null,null,null,null,null,null,null,null,null,null,null,null,null,null,null,null,null,null,null,null,null,null,null,null,null,null,null,null,0,0]
[null,null,null,null,null,null,null,null,null,null,null,null,null,null,null,null,null,null,null,null,null,null,null,null,null,null,null,null,0,0]
[null,null,null,null,null,null,null,null,null,null,null,null,null,null,null,null,null,null,null,null,null,null,null,null,null,null,null,null,0,0]
[null,null,null,null,null,null,null,null,null,null,null,null,null,null,null,null,null,null,null,null,null,null,null,null,null,null,null,null,0,0]
[null,null,null,null,null,null,null,null,null,null,null,null,null,null,null,null,null,null,null,null,null,null,null,null,null,null,null,null,0,0]
[null,null,null,null,null,null,null,null,null,null,null,null,null,null,null,null,null,null,null,null,null,null,null,null,null,null,null,null,0,0]
[null,null,null,null,null,null,null,null,null,null,null,null,null,null,null,null,null,null,null,null,null,null,null,null,null,null,null,null,0,0]
[null,null,null,null,null,null,null,null,null,null,null,null,null,null,null,null,null,null,null,null,null,null,null,null,null,null,null,null,0,0]
[null,null,null,null,null,null,null,null,null,null,null,null,null,null,null,null,null,null,null,null,null,null,null,null,null,null,null,null,0,0]
[null,null,null,null,null,null,null,null,null,null,null,null,null,null,null,null,null,null,null,null,null,null,null,null,null,null,null,null,0,0]
[null,null,null,null,null,null,null,null,null,null,null,null,null,null,null,null,null,null,null,null,null,null,null,null,null,null,null,null,0,0]
[null,null,null,null,null,null,null,null,null,null,null,null,null,null,null,null,null,null,null,null,null,null,null,null,null,null,null,null,0,0]
[null,null,null,null,null,null,null,null,null,null,null,null,null,null,null,null,null,null,null,null,null,null,null,null,null,null,null,null,0,0]
[null,null,null,null,null,null,null,null,null,null,null,null,null,null,null,null,null,null,null,null,null,null,null,null,null,null,null,null,0,0]
[null,null,null,null,null,null,null,null,null,null,null,null,null,null,null,null,null,null,null,null,null,null,null,null,null,null,null,null,0,0]
[null,null,null,null,null,null,null,null,null,null,null,null,null,null,null,null,null,null,null,null,null,null,null,null,null,null,null,null,0,0]
[null,null,null,null,null,null,null,null,null,null,null,null,null,null,null,null,null,null,null,null,null,null,null,null,null,null,null,null,0,0]
[null,null,null,null,null,null,null,null,null,null,null,null,null,null,null,null,null,null,null,null,null,null,null,null,null,null,null,null,0,0]
[null,null,null,null,null,null,null,null,null,null,null,null,null,null,null,null,null,null,null,null,null,null,null,null,null,null,null,null,0,0]
[null,null,null,null,null,null,null,null,null,null,null,null,null,null,null,null,null,null,null,null,null,null,null,null,null,null,null,null,0,0]
[null,null,null,null,null,null,null,null,null,null,null,null,null,null,null,null,null,null,null,null,null,null,null,null,null,null,null,null,0,0]
[null,null,null,null,null,null,null,null,null,null,null,null,null,null,null,null,null,null,null,null,null,null,null,null,null,null,null,null,0,0]
[null,null,null,null,null,null,null,null,null,null,null,null,null,null,null,null,null,null,null,null,null,null,null,null,null,null,null,null,0,0]
[null,null,null,null,null,null,null,null,null,null,null,null,null,null,null,null,null,null,null,null,null,null,null,null,null,null,null,null,0,0]
[null,null,null,null,null,null,null,null,null,null,null,null,null,null,null,null,null,null,null,null,null,null,null,null,null,null,null,null,0,0]
[null,null,null,null,null,null,null,null,null,null,null,null,null,null,null,null,null,null,null,null,null,null,null,null,null,null,null,null,0,0]
[null,null,null,null,null,null,null,null,null,null,null,null,null,null,null,null,null,null,null,null,null,null,null,null,null,null,null,null,0,0]
[null,null,null,null,null,null,null,null,null,null,null,null,null,null,null,null,null,null,null,null,null,null,null,null,null,null,null,null,0,0]
[null,null,null,null,null,null,null,null,null,null,null,null,null,null,null,null,null,null,null,null,null,null,null,null,null,null,null,null,0,0]
[null,null,null,null,null,null,null,null,null,null,null,null,null,null,null,null,null,null,null,null,null,null,null,null,null,null,null,null,0,0]
[null,null,null,null,null,null,null,null,null,null,null,null,null,null,null,null,null,null,null,null,null,null,null,null,null,null,null,null,0,0]
[null,null,null,null,null,null,null,null,null,null,null,null,null,null,null,null,null,null,null,null,null,null,null,null,null,null,null,null,0,0]
[null,null,null,null,null,null,null,null,null,null,null,null,null,null,null,null,null,null,null,null,null,null,null,null,null,null,null,null,0,0]
[null,null,null,null,null,null,null,null,null,null,null,null,null,null,null,null,null,null,null,null,null,null,null,null,null,null,null,null,0,0]
[null,null,null,null,null,null,null,null,null,null,null,null,null,null,null,null,null,null,null,null,null,null,null,null,null,null,null,null,0,0]
[null,null,null,null,null,null,null,null,null,null,null,null,null,null,null,null,null,null,null,null,null,null,null,null,null,null,null,null,0,0]
[null,null,null,null,null,null,null,null,null,null,null,null,null,null,null,null,null,null,null,null,null,null,null,null,null,null,null,null,0,0]
[null,null,null,null,null,null,null,null,null,null,null,null,null,null,null,null,null,null,null,null,null,null,null,null,null,null,null,null,0,0]
[null,null,null,null,null,null,null,null,null,null,null,null,null,null,null,null,null,null,null,null,null,null,null,null,null,null,null,null,0,0]
[null,null,null,null,null,null,null,null,null,null,null,null,null,null,null,null,null,null,null,null,null,null,null,null,null,null,null,null,0,0]
[null,null,null,null,null,null,null,null,null,null,null,null,null,null,null,null,null,null,null,null,null,null,null,null,null,null,null,null,0,0]
[null,null,null,null,null,null,null,null,null,null,null,null,null,null,null,null,null,null,null,null,null,null,null,null,null,null,null,null,0,0]
[null,null,null,null,null,null,null,null,null,null,null,null,null,null,null,null,null,null,null,null,null,null,null,null,null,null,null,null,0,0]
[null,null,null,null,null,null,null,null,null,null,null,null,null,null,null,null,null,null,null,null,null,null,null,null,null,null,null,null,0,0]
[null,null,null,null,null,null,null,null,null,null,null,null,null,null,null,null,null,null,null,null,null,null,null,null,null,null,null,null,0,0]
[null,null,null,null,null,null,null,null,null,null,null,null,null,null,null,null,null,null,null,null,null,null,null,null,null,null,null,null,0,0]
[null,null,null,null,null,null,null,null,null,null,null,null,null,null,null,null,null,null,null,null,null,null,null,null,null,null,null,null,0,0]
[null,null,null,null,null,null,null,null,null,null,null,null,null,null,null,null,null,null,null,null,null,null,null,null,null,null,null,null,0,0]
[null,null,null,null,null,null,null,null,null,null,null,null,null,null,null,null,null,null,null,null,null,null,null,null,null,null,null,null,0,0]
[null,null,null,null,null,null,null,null,null,null,null,null,null,null,null,null,null,null,null,null,null,null,null,null,null,null,null,null,0,0]
[null,null,null,null,null,null,null,null,null,null,null,null,null,null,null,null,null,null,null,null,null,null,null,null,null,null,null,null,0,0]
[null,null,null,null,null,null,null,null,null,null,null,null,null,null,null,null,null,null,null,null,null,null,null,null,null,null,null,null,0,0]
[null,null,null,null,null,null,null,null,null,null,null,null,null,null,null,null,null,null,null,null,null,null,null,null,null,null,null,null,0,0]
[null,null,null,null,null,null,null,null,null,null,null,null,null,null,null,null,null,null,null,null,null,null,null,null,null,null,null,null,0,0]
[null,null,null,null,null,null,null,null,null,null,null,null,null,null,null,null,null,null,null,null,null,null,null,null,null,null,null,null,{"$f":"IF(AA642=0,0,_xlfn.DAYS(AA642,TODAY()))","v":0},{"$f":"IF(AB642=0,0,_xlfn.DAYS(AB642,TODAY()))","v":0}]
[null,null,null,null,null,null,null,null,null,null,null,null,null,null,null,null,null,null,null,null,null,null,null,null,null,null,null,null,0,0]
[null,null,null,null,null,null,null,null,null,null,null,null,null,null,null,null,null,null,null,null,null,null,null,null,null,null,null,null,0,0]
[null,null,null,null,null,null,null,null,null,null,null,null,null,null,null,null,null,null,null,null,null,null,null,null,null,null,null,null,0,0]
[null,null,null,null,null,null,null,null,null,null,null,null,null,null,null,null,null,null,null,null,null,null,null,null,null,null,null,null,0,0]
[null,null,null,null,null,null,null,null,null,null,null,null,null,null,null,null,null,null,null,null,null,null,null,null,null,null,null,null,0,0]
[null,null,null,null,null,null,null,null,null,null,null,null,null,null,null,null,null,null,null,null,null,null,null,null,null,null,null,null,0,0]
[null,null,null,null,null,null,null,null,null,null,null,null,null,null,null,null,null,null,null,null,null,null,null,null,null,null,null,null,0,0]
[null,null,null,null,null,null,null,null,null,null,null,null,null,null,null,null,null,null,null,null,null,null,null,null,null,null,null,null,0,0]
[null,null,null,null,null,null,null,null,null,null,null,null,null,null,null,null,null,null,null,null,null,null,null,null,null,null,null,null,0,0]
[null,null,null,null,null,null,null,null,null,null,null,null,null,null,null,null,null,null,null,null,null,null,null,null,null,null,null,null,0,0]
[null,null,null,null,null,null,null,null,null,null,null,null,null,null,null,null,null,null,null,null,null,null,null,null,null,null,null,null,0,0]
[null,null,null,null,null,null,null,null,null,null,null,null,null,null,null,null,null,null,null,null,null,null,null,null,null,null,null,null,0,0]
[null,null,null,null,null,null,null,null,null,null,null,null,null,null,null,null,null,null,null,null,null,null,null,null,null,null,null,null,0,0]
[null,null,null,null,null,null,null,null,null,null,null,null,null,null,null,null,null,null,null,null,null,null,null,null,null,null,null,null,0,0]
[null,null,null,null,null,null,null,null,null,null,null,null,null,null,null,null,null,null,null,null,null,null,null,null,null,null,null,null,0,0]
[null,null,null,null,null,null,null,null,null,null,null,null,null,null,null,null,null,null,null,null,null,null,null,null,null,null,null,null,0,0]
[null,null,null,null,null,null,null,null,null,null,null,null,null,null,null,null,null,null,null,null,null,null,null,null,null,null,null,null,0,0]
[null,null,null,null,null,null,null,null,null,null,null,null,null,null,null,null,null,null,null,null,null,null,null,null,null,null,null,null,0,0]
[null,null,null,null,null,null,null,null,null,null,null,null,null,null,null,null,null,null,null,null,null,null,null,null,null,null,null,null,0,0]
[null,null,null,null,null,null,null,null,null,null,null,null,null,null,null,null,null,null,null,null,null,null,null,null,null,null,null,null,0,0]
[null,null,null,null,null,null,null,null,null,null,null,null,null,null,null,null,null,null,null,null,null,null,null,null,null,null,null,null,0,0]
[null,null,null,null,null,null,null,null,null,null,null,null,null,null,null,null,null,null,null,null,null,null,null,null,null,null,null,null,0,0]
[null,null,null,null,null,null,null,null,null,null,null,null,null,null,null,null,null,null,null,null,null,null,null,null,null,null,null,null,0,0]
[null,null,null,null,null,null,null,null,null,null,null,null,null,null,null,null,null,null,null,null,null,null,null,null,null,null,null,null,0,0]
[null,null,null,null,null,null,null,null,null,null,null,null,null,null,null,null,null,null,null,null,null,null,null,null,null,null,null,null,0,0]
[null,null,null,null,null,null,null,null,null,null,null,null,null,null,null,null,null,null,null,null,null,null,null,null,null,null,null,null,0,0]
[null,null,null,null,null,null,null,null,null,null,null,null,null,null,null,null,null,null,null,null,null,null,null,null,null,null,null,null,0,0]
[null,null,null,null,null,null,null,null,null,null,null,null,null,null,null,null,null,null,null,null,null,null,null,null,null,null,null,null,0,0]
[null,null,null,null,null,null,null,null,null,null,null,null,null,null,null,null,null,null,null,null,null,null,null,null,null,null,null,null,0,0]
[null,null,null,null,null,null,null,null,null,null,null,null,null,null,null,null,null,null,null,null,null,null,null,null,null,null,null,null,0,0]
[null,null,null,null,null,null,null,null,null,null,null,null,null,null,null,null,null,null,null,null,null,null,null,null,null,null,null,null,0,0]
[null,null,null,null,null,null,null,null,null,null,null,null,null,null,null,null,null,null,null,null,null,null,null,null,null,null,null,null,0,0]
[null,null,null,null,null,null,null,null,null,null,null,null,null,null,null,null,null,null,null,null,null,null,null,null,null,null,null,null,0,0]
[null,null,null,null,null,null,null,null,null,null,null,null,null,null,null,null,null,null,null,null,null,null,null,null,null,null,null,null,0,0]
[null,null,null,null,null,null,null,null,null,null,null,null,null,null,null,null,null,null,null,null,null,null,null,null,null,null,null,null,0,0]
[null,null,null,null,null,null,null,null,null,null,null,null,null,null,null,null,null,null,null,null,null,null,null,null,null,null,null,null,0,0]
[null,null,null,null,null,null,null,null,null,null,null,null,null,null,null,null,null,null,null,null,null,null,null,null,null,null,null,null,0,0]
[null,null,null,null,null,null,null,null,null,null,null,null,null,null,null,null,null,null,null,null,null,null,null,null,null,null,null,null,0,0]
[null,null,null,null,null,null,null,null,null,null,null,null,null,null,null,null,null,null,null,null,null,null,null,null,null,null,null,null,0,0]
[null,null,null,null,null,null,null,null,null,null,null,null,null,null,null,null,null,null,null,null,null,null,null,null,null,null,null,null,0,0]
[null,null,null,null,null,null,null,null,null,null,null,null,null,null,null,null,null,null,null,null,null,null,null,null,null,null,null,null,0,0]
[null,null,null,null,null,null,null,null,null,null,null,null,null,null,null,null,null,null,null,null,null,null,null,null,null,null,null,null,0,0]
[null,null,null,null,null,null,null,null,null,null,null,null,null,null,null,null,null,null,null,null,null,null,null,null,null,null,null,null,0,0]
[null,null,null,null,null,null,null,null,null,null,null,null,null,null,null,null,null,null,null,null,null,null,null,null,null,null,null,null,0,0]
[null,null,null,null,null,null,null,null,null,null,null,null,null,null,null,null,null,null,null,null,null,null,null,null,null,null,null,null,0,0]
[null,null,null,null,null,null,null,null,null,null,null,null,null,null,null,null,null,null,null,null,null,null,null,null,null,null,null,null,0,0]
[null,null,null,null,null,null,null,null,null,null,null,null,null,null,null,null,null,null,null,null,null,null,null,null,null,null,null,null,0,0]
[null,null,null,null,null,null,null,null,null,null,null,null,null,null,null,null,null,null,null,null,null,null,null,null,null,null,null,null,0,0]
[null,null,null,null,null,null,null,null,null,null,null,null,null,null,null,null,null,null,null,null,null,null,null,null,null,null,null,null,0,0]
[null,null,null,null,null,null,null,null,null,null,null,null,null,null,null,null,null,null,null,null,null,null,null,null,null,null,null,null,0,0]
[null,null,null,null,null,null,null,null,null,null,null,null,null,null,null,null,null,null,null,null,null,null,null,null,null,null,null,null,0,0]
[null,null,null,null,null,null,null,null,null,null,null,null,null,null,null,null,null,null,null,null,null,null,null,null,null,null,null,null,0,0]
[null,null,null,null,null,null,null,null,null,null,null,null,null,null,null,null,null,null,null,null,null,null,null,null,null,null,null,null,0,0]
[null,null,null,null,null,null,null,null,null,null,null,null,null,null,null,null,null,null,null,null,null,null,null,null,null,null,null,null,0,0]
[null,null,null,null,null,null,null,null,null,null,null,null,null,null,null,null,null,null,null,null,null,null,null,null,null,null,null,null,0,0]
[null,null,null,null,null,null,null,null,null,null,null,null,null,null,null,null,null,null,null,null,null,null,null,null,null,null,null,null,0,0]
[null,null,null,null,null,null,null,null,null,null,null,null,null,null,null,null,null,null,null,null,null,null,null,null,null,null,null,null,0,0]
[null,null,null,null,null,null,null,null,null,null,null,null,null,null,null,null,null,null,null,null,null,null,null,null,null,null,null,null,0,0]
[null,null,null,null,null,null,null,null,null,null,null,null,null,null,null,null,null,null,null,null,null,null,null,null,null,null,null,null,0,0]
[null,null,null,null,null,null,null,null,null,null,null,null,null,null,null,null,null,null,null,null,null,null,null,null,null,null,null,null,0,0]
[null,null,null,null,null,null,null,null,null,null,null,null,null,null,null,null,null,null,null,null,null,null,null,null,null,null,null,null,0,0]
[null,null,null,null,null,null,null,null,null,null,null,null,null,null,null,null,null,null,null,null,null,null,null,null,null,null,null,null,0,0]
[null,null,null,null,null,null,null,null,null,null,null,null,null,null,null,null,null,null,null,null,null,null,null,null,null,null,null,null,0,0]
[null,null,null,null,null,null,null,null,null,null,null,null,null,null,null,null,null,null,null,null,null,null,null,null,null,null,null,null,{"$f":"IF(AA706=0,0,_xlfn.DAYS(AA706,TODAY()))","v":0},{"$f":"IF(AB706=0,0,_xlfn.DAYS(AB706,TODAY()))","v":0}]
[null,null,null,null,null,null,null,null,null,null,null,null,null,null,null,null,null,null,null,null,null,null,null,null,null,null,null,null,0,0]
[null,null,null,null,null,null,null,null,null,null,null,null,null,null,null,null,null,null,null,null,null,null,null,null,null,null,null,null,0,0]
[null,null,null,null,null,null,null,null,null,null,null,null,null,null,null,null,null,null,null,null,null,null,null,null,null,null,null,null,0,0]
[null,null,null,null,null,null,null,null,null,null,null,null,null,null,null,null,null,null,null,null,null,null,null,null,null,null,null,null,0,0]
[null,null,null,null,null,null,null,null,null,null,null,null,null,null,null,null,null,null,null,null,null,null,null,null,null,null,null,null,0,0]
[null,null,null,null,null,null,null,null,null,null,null,null,null,null,null,null,null,null,null,null,null,null,null,null,null,null,null,null,0,0]
[null,null,null,null,null,null,null,null,null,null,null,null,null,null,null,null,null,null,null,null,null,null,null,null,null,null,null,null,0,0]
[null,null,null,null,null,null,null,null,null,null,null,null,null,null,null,null,null,null,null,null,null,null,null,null,null,null,null,null,0,0]
[null,null,null,null,null,null,null,null,null,null,null,null,null,null,null,null,null,null,null,null,null,null,null,null,null,null,null,null,0,0]
[null,null,null,null,null,null,null,null,null,null,null,null,null,null,null,null,null,null,null,null,null,null,null,null,null,null,null,null,0,0]
[null,null,null,null,null,null,null,null,null,null,null,null,null,null,null,null,null,null,null,null,null,null,null,null,null,null,null,null,0,0]
[null,null,null,null,null,null,null,null,null,null,null,null,null,null,null,null,null,null,null,null,null,null,null,null,null,null,null,null,0,0]
[null,null,null,null,null,null,null,null,null,null,null,null,null,null,null,null,null,null,null,null,null,null,null,null,null,null,null,null,0,0]
[null,null,null,null,null,null,null,null,null,null,null,null,null,null,null,null,null,null,null,null,null,null,null,null,null,null,null,null,0,0]
[null,null,null,null,null,null,null,null,null,null,null,null,null,null,null,null,null,null,null,null,null,null,null,null,null,null,null,null,0,0]
[null,null,null,null,null,null,null,null,null,null,null,null,null,null,null,null,null,null,null,null,null,null,null,null,null,null,null,null,0,0]
[null,null,null,null,null,null,null,null,null,null,null,null,null,null,null,null,null,null,null,null,null,null,null,null,null,null,null,null,0,0]
[null,null,null,null,null,null,null,null,null,null,null,null,null,null,null,null,null,null,null,null,null,null,null,null,null,null,null,null,0,0]
[null,null,null,null,null,null,null,null,null,null,null,null,null,null,null,null,null,null,null,null,null,null,null,null,null,null,null,null,0,0]
[null,null,null,null,null,null,null,null,null,null,null,null,null,null,null,null,null,null,null,null,null,null,null,null,null,null,null,null,0,0]
[null,null,null,null,null,null,null,null,null,null,null,null,null,null,null,null,null,null,null,null,null,null,null,null,null,null,null,null,0,0]
[null,null,null,null,null,null,null,null,null,null,null,null,null,null,null,null,null,null,null,null,null,null,null,null,null,null,null,null,0,0]
[null,null,null,null,null,null,null,null,null,null,null,null,null,null,null,null,null,null,null,null,null,null,null,null,null,null,null,null,0,0]
[null,null,null,null,null,null,null,null,null,null,null,null,null,null,null,null,null,null,null,null,null,null,null,null,null,null,null,null,0,0]
[null,null,null,null,null,null,null,null,null,null,null,null,null,null,null,null,null,null,null,null,null,null,null,null,null,null,null,null,0,0]
[null,null,null,null,null,null,null,null,null,null,null,null,null,null,null,null,null,null,null,null,null,null,null,null,null,null,null,null,0,0]
[null,null,null,null,null,null,null,null,null,null,null,null,null,null,null,null,null,null,null,null,null,null,null,null,null,null,null,null,0,0]
[null,null,null,null,null,null,null,null,null,null,null,null,null,null,null,null,null,null,null,null,null,null,null,null,null,null,null,null,0,0]
[null,null,null,null,null,null,null,null,null,null,null,null,null,null,null,null,null,null,null,null,null,null,null,null,null,null,null,null,0,0]
[null,null,null,null,null,null,null,null,null,null,null,null,null,null,null,null,null,null,null,null,null,null,null,null,null,null,null,null,0,0]
[null,null,null,null,null,null,null,null,null,null,null,null,null,null,null,null,null,null,null,null,null,null,null,null,null,null,null,null,0,0]
[null,null,null,null,null,null,null,null,null,null,null,null,null,null,null,null,null,null,null,null,null,null,null,null,null,null,null,null,0,0]
[null,null,null,null,null,null,null,null,null,null,null,null,null,null,null,null,null,null,null,null,null,null,null,null,null,null,null,null,0,0]
[null,null,null,null,null,null,null,null,null,null,null,null,null,null,null,null,null,null,null,null,null,null,null,null,null,null,null,null,0,0]
[null,null,null,null,null,null,null,null,null,null,null,null,null,null,null,null,null,null,null,null,null,null,null,null,null,null,null,null,0,0]
[null,null,null,null,null,null,null,null,null,null,null,null,null,null,null,null,null,null,null,null,null,null,null,null,null,null,null,null,0,0]
[null,null,null,null,null,null,null,null,null,null,null,null,null,null,null,null,null,null,null,null,null,null,null,null,null,null,null,null,0,0]
[null,null,null,null,null,null,null,null,null,null,null,null,null,null,null,null,null,null,null,null,null,null,null,null,null,null,null,null,0,0]
[null,null,null,null,null,null,null,null,null,null,null,null,null,null,null,null,null,null,null,null,null,null,null,null,null,null,null,null,0,0]
[null,null,null,null,null,null,null,null,null,null,null,null,null,null,null,null,null,null,null,null,null,null,null,null,null,null,null,null,0,0]
[null,null,null,null,null,null,null,null,null,null,null,null,null,null,null,null,null,null,null,null,null,null,null,null,null,null,null,null,0,0]
[null,null,null,null,null,null,null,null,null,null,null,null,null,null,null,null,null,null,null,null,null,null,null,null,null,null,null,null,0,0]
[null,null,null,null,null,null,null,null,null,null,null,null,null,null,null,null,null,null,null,null,null,null,null,null,null,null,null,null,0,0]
[null,null,null,null,null,null,null,null,null,null,null,null,null,null,null,null,null,null,null,null,null,null,null,null,null,null,null,null,0,0]
[null,null,null,null,null,null,null,null,null,null,null,null,null,null,null,null,null,null,null,null,null,null,null,null,null,null,null,null,0,0]
[null,null,null,null,null,null,null,null,null,null,null,null,null,null,null,null,null,null,null,null,null,null,null,null,null,null,null,null,0,0]
[null,null,null,null,null,null,null,null,null,null,null,null,null,null,null,null,null,null,null,null,null,null,null,null,null,null,null,null,0,0]
[null,null,null,null,null,null,null,null,null,null,null,null,null,null,null,null,null,null,null,null,null,null,null,null,null,null,null,null,0,0]
[null,null,null,null,null,null,null,null,null,null,null,null,null,null,null,null,null,null,null,null,null,null,null,null,null,null,null,null,0,0]
[null,null,null,null,null,null,null,null,null,null,null,null,null,null,null,null,null,null,null,null,null,null,null,null,null,null,null,null,0,0]
[null,null,null,null,null,null,null,null,null,null,null,null,null,null,null,null,null,null,null,null,null,null,null,null,null,null,null,null,0,0]
[null,null,null,null,null,null,null,null,null,null,null,null,null,null,null,null,null,null,null,null,null,null,null,null,null,null,null,null,0,0]
[null,null,null,null,null,null,null,null,null,null,null,null,null,null,null,null,null,null,null,null,null,null,null,null,null,null,null,null,0,0]
[null,null,null,null,null,null,null,null,null,null,null,null,null,null,null,null,null,null,null,null,null,null,null,null,null,null,null,null,0,0]
[null,null,null,null,null,null,null,null,null,null,null,null,null,null,null,null,null,null,null,null,null,null,null,null,null,null,null,null,0,0]
[null,null,null,null,null,null,null,null,null,null,null,null,null,null,null,null,null,null,null,null,null,null,null,null,null,null,null,null,0,0]
[null,null,null,null,null,null,null,null,null,null,null,null,null,null,null,null,null,null,null,null,null,null,null,null,null,null,null,null,0,0]
[null,null,null,null,null,null,null,null,null,null,null,null,null,null,null,null,null,null,null,null,null,null,null,null,null,null,null,null,0,0]
[null,null,null,null,null,null,null,null,null,null,null,null,null,null,null,null,null,null,null,null,null,null,null,null,null,null,null,null,0,0]
[null,null,null,null,null,null,null,null,null,null,null,null,null,null,null,null,null,null,null,null,null,null,null,null,null,null,null,null,0,0]
[null,null,null,null,null,null,null,null,null,null,null,null,null,null,null,null,null,null,null,null,null,null,null,null,null,null,null,null,0,0]
[null,null,null,null,null,null,null,null,null,null,null,null,null,null,null,null,null,null,null,null,null,null,null,null,null,null,null,null,0,0]
[null,null,null,null,null,null,null,null,null,null,null,null,null,null,null,null,null,null,null,null,null,null,null,null,null,null,null,null,0,0]
[null,null,null,null,null,null,null,null,null,null,null,null,null,null,null,null,null,null,null,null,null,null,null,null,null,null,null,null,{"$f":"IF(AA770=0,0,_xlfn.DAYS(AA770,TODAY()))","v":0},{"$f":"IF(AB770=0,0,_xlfn.DAYS(AB770,TODAY()))","v":0}]
[null,null,null,null,null,null,null,null,null,null,null,null,null,null,null,null,null,null,null,null,null,null,null,null,null,null,null,null,0,0]
[null,null,null,null,null,null,null,null,null,null,null,null,null,null,null,null,null,null,null,null,null,null,null,null,null,null,null,null,0,0]
[null,null,null,null,null,null,null,null,null,null,null,null,null,null,null,null,null,null,null,null,null,null,null,null,null,null,null,null,0,0]
[null,null,null,null,null,null,null,null,null,null,null,null,null,null,null,null,null,null,null,null,null,null,null,null,null,null,null,null,0,0]
[null,null,null,null,null,null,null,null,null,null,null,null,null,null,null,null,null,null,null,null,null,null,null,null,null,null,null,null,0,0]
[null,null,null,null,null,null,null,null,null,null,null,null,null,null,null,null,null,null,null,null,null,null,null,null,null,null,null,null,0,0]
[null,null,null,null,null,null,null,null,null,null,null,null,null,null,null,null,null,null,null,null,null,null,null,null,null,null,null,null,0,0]
[null,null,null,null,null,null,null,null,null,null,null,null,null,null,null,null,null,null,null,null,null,null,null,null,null,null,null,null,0,0]
[null,null,null,null,null,null,null,null,null,null,null,null,null,null,null,null,null,null,null,null,null,null,null,null,null,null,null,null,0,0]
[null,null,null,null,null,null,null,null,null,null,null,null,null,null,null,null,null,null,null,null,null,null,null,null,null,null,null,null,0,0]
[null,null,null,null,null,null,null,null,null,null,null,null,null,null,null,null,null,null,null,null,null,null,null,null,null,null,null,null,0,0]
[null,null,null,null,null,null,null,null,null,null,null,null,null,null,null,null,null,null,null,null,null,null,null,null,null,null,null,null,0,0]
[null,null,null,null,null,null,null,null,null,null,null,null,null,null,null,null,null,null,null,null,null,null,null,null,null,null,null,null,0,0]
[null,null,null,null,null,null,null,null,null,null,null,null,null,null,null,null,null,null,null,null,null,null,null,null,null,null,null,null,0,0]
[null,null,null,null,null,null,null,null,null,null,null,null,null,null,null,null,null,null,null,null,null,null,null,null,null,null,null,null,0,0]
[null,null,null,null,null,null,null,null,null,null,null,null,null,null,null,null,null,null,null,null,null,null,null,null,null,null,null,null,0,0]
[null,null,null,null,null,null,null,null,null,null,null,null,null,null,null,null,null,null,null,null,null,null,null,null,null,null,null,null,0,0]
[null,null,null,null,null,null,null,null,null,null,null,null,null,null,null,null,null,null,null,null,null,null,null,null,null,null,null,null,0,0]
[null,null,null,null,null,null,null,null,null,null,null,null,null,null,null,null,null,null,null,null,null,null,null,null,null,null,null,null,0,0]
[null,null,null,null,null,null,null,null,null,null,null,null,null,null,null,null,null,null,null,null,null,null,null,null,null,null,null,null,0,0]
[null,null,null,null,null,null,null,null,null,null,null,null,null,null,null,null,null,null,null,null,null,null,null,null,null,null,null,null,0,0]
[null,null,null,null,null,null,null,null,null,null,null,null,null,null,null,null,null,null,null,null,null,null,null,null,null,null,null,null,0,0]
[null,null,null,null,null,null,null,null,null,null,null,null,null,null,null,null,null,null,null,null,null,null,null,null,null,null,null,null,0,0]
[null,null,null,null,null,null,null,null,null,null,null,null,null,null,null,null,null,null,null,null,null,null,null,null,null,null,null,null,0,0]
[null,null,null,null,null,null,null,null,null,null,null,null,null,null,null,null,null,null,null,null,null,null,null,null,null,null,null,null,0,0]
[null,null,null,null,null,null,null,null,null,null,null,null,null,null,null,null,null,null,null,null,null,null,null,null,null,null,null,null,0,0]
[null,null,null,null,null,null,null,null,null,null,null,null,null,null,null,null,null,null,null,null,null,null,null,null,null,null,null,null,0,0]
[null,null,null,null,null,null,null,null,null,null,null,null,null,null,null,null,null,null,null,null,null,null,null,null,null,null,null,null,0,0]
[null,null,null,null,null,null,null,null,null,null,null,null,null,null,null,null,null,null,null,null,null,null,null,null,null,null,null,null,0,0]
[null,null,null,null,null,null,null,null,null,null,null,null,null,null,null,null,null,null,null,null,null,null,null,null,null,null,null,null,0,0]
[null,null,null,null,null,null,null,null,null,null,null,null,null,null,null,null,null,null,null,null,null,null,null,null,null,null,null,null,0,0]
[null,null,null,null,null,null,null,null,null,null,null,null,null,null,null,null,null,null,null,null,null,null,null,null,null,null,null,null,0,0]
[null,null,null,null,null,null,null,null,null,null,null,null,null,null,null,null,null,null,null,null,null,null,null,null,null,null,null,null,0,0]
[null,null,null,null,null,null,null,null,null,null,null,null,null,null,null,null,null,null,null,null,null,null,null,null,null,null,null,null,0,0]
[null,null,null,null,null,null,null,null,null,null,null,null,null,null,null,null,null,null,null,null,null,null,null,null,null,null,null,null,0,0]
[null,null,null,null,null,null,null,null,null,null,null,null,null,null,null,null,null,null,null,null,null,null,null,null,null,null,null,null,0,0]
[null,null,null,null,null,null,null,null,null,null,null,null,null,null,null,null,null,null,null,null,null,null,null,null,null,null,null,null,0,0]
[null,null,null,null,null,null,null,null,null,null,null,null,null,null,null,null,null,null,null,null,null,null,null,null,null,null,null,null,0,0]
[null,null,null,null,null,null,null,null,null,null,null,null,null,null,null,null,null,null,null,null,null,null,null,null,null,null,null,null,0,0]
[null,null,null,null,null,null,null,null,null,null,null,null,null,null,null,null,null,null,null,null,null,null,null,null,null,null,null,null,0,0]
[null,null,null,null,null,null,null,null,null,null,null,null,null,null,null,null,null,null,null,null,null,null,null,null,null,null,null,null,0,0]
[null,null,null,null,null,null,null,null,null,null,null,null,null,null,null,null,null,null,null,null,null,null,null,null,null,null,null,null,0,0]
[null,null,null,null,null,null,null,null,null,null,null,null,null,null,null,null,null,null,null,null,null,null,null,null,null,null,null,null,0,0]
[null,null,null,null,null,null,null,null,null,null,null,null,null,null,null,null,null,null,null,null,null,null,null,null,null,null,null,null,0,0]
[null,null,null,null,null,null,null,null,null,null,null,null,null,null,null,null,null,null,null,null,null,null,null,null,null,null,null,null,0,0]
[null,null,null,null,null,null,null,null,null,null,null,null,null,null,null,null,null,null,null,null,null,null,null,null,null,null,null,null,0,0]
[null,null,null,null,null,null,null,null,null,null,null,null,null,null,null,null,null,null,null,null,null,null,null,null,null,null,null,null,0,0]
[null,null,null,null,null,null,null,null,null,null,null,null,null,null,null,null,null,null,null,null,null,null,null,null,null,null,null,null,0,0]
[null,null,null,null,null,null,null,null,null,null,null,null,null,null,null,null,null,null,null,null,null,null,null,null,null,null,null,null,0,0]
[null,null,null,null,null,null,null,null,null,null,null,null,null,null,null,null,null,null,null,null,null,null,null,null,null,null,null,null,0,0]
[null,null,null,null,null,null,null,null,null,null,null,null,null,null,null,null,null,null,null,null,null,null,null,null,null,null,null,null,0,0]
[null,null,null,null,null,null,null,null,null,null,null,null,null,null,null,null,null,null,null,null,null,null,null,null,null,null,null,null,0,0]
[null,null,null,null,null,null,null,null,null,null,null,null,null,null,null,null,null,null,null,null,null,null,null,null,null,null,null,null,0,0]
[null,null,null,null,null,null,null,null,null,null,null,null,null,null,null,null,null,null,null,null,null,null,null,null,null,null,null,null,0,0]
[null,null,null,null,null,null,null,null,null,null,null,null,null,null,null,null,null,null,null,null,null,null,null,null,null,null,null,null,0,0]
[null,null,null,null,null,null,null,null,null,null,null,null,null,null,null,null,null,null,null,null,null,null,null,null,null,null,null,null,0,0]
[null,null,null,null,null,null,null,null,null,null,null,null,null,null,null,null,null,null,null,null,null,null,null,null,null,null,null,null,0,0]
[null,null,null,null,null,null,null,null,null,null,null,null,null,null,null,null,null,null,null,null,null,null,null,null,null,null,null,null,0,0]
[null,null,null,null,null,null,null,null,null,null,null,null,null,null,null,null,null,null,null,null,null,null,null,null,null,null,null,null,0,0]
[null,null,null,null,null,null,null,null,null,null,null,null,null,null,null,null,null,null,null,null,null,null,null,null,null,null,null,null,0,0]
[null,null,null,null,null,null,null,null,null,null,null,null,null,null,null,null,null,null,null,null,null,null,null,null,null,null,null,null,0,0]
[null,null,null,null,null,null,null,null,null,null,null,null,null,null,null,null,null,null,null,null,null,null,null,null,null,null,null,null,0,0]
[null,null,null,null,null,null,null,null,null,null,null,null,null,null,null,null,null,null,null,null,null,null,null,null,null,null,null,null,0,0]
[null,null,null,null,null,null,null,null,null,null,null,null,null,null,null,null,null,null,null,null,null,null,null,null,null,null,null,null,{"$f":"IF(AA834=0,0,_xlfn.DAYS(AA834,TODAY()))","v":0},{"$f":"IF(AB834=0,0,_xlfn.DAYS(AB834,TODAY()))","v":0}]
[null,null,null,null,null,null,null,null,null,null,null,null,null,null,null,null,null,null,null,null,null,null,null,null,null,null,null,null,0,0]
[null,null,null,null,null,null,null,null,null,null,null,null,null,null,null,null,null,null,null,null,null,null,null,null,null,null,null,null,0,0]
[null,null,null,null,null,null,null,null,null,null,null,null,null,null,null,null,null,null,null,null,null,null,null,null,null,null,null,null,0,0]
[null,null,null,null,null,null,null,null,null,null,null,null,null,null,null,null,null,null,null,null,null,null,null,null,null,null,null,null,0,0]
[null,null,null,null,null,null,null,null,null,null,null,null,null,null,null,null,null,null,null,null,null,null,null,null,null,null,null,null,0,0]
[null,null,null,null,null,null,null,null,null,null,null,null,null,null,null,null,null,null,null,null,null,null,null,null,null,null,null,null,0,0]
[null,null,null,null,null,null,null,null,null,null,null,null,null,null,null,null,null,null,null,null,null,null,null,null,null,null,null,null,0,0]
[null,null,null,null,null,null,null,null,null,null,null,null,null,null,null,null,null,null,null,null,null,null,null,null,null,null,null,null,0,0]
[null,null,null,null,null,null,null,null,null,null,null,null,null,null,null,null,null,null,null,null,null,null,null,null,null,null,null,null,0,0]
[null,null,null,null,null,null,null,null,null,null,null,null,null,null,null,null,null,null,null,null,null,null,null,null,null,null,null,null,0,0]
[null,null,null,null,null,null,null,null,null,null,null,null,null,null,null,null,null,null,null,null,null,null,null,null,null,null,null,null,0,0]
[null,null,null,null,null,null,null,null,null,null,null,null,null,null,null,null,null,null,null,null,null,null,null,null,null,null,null,null,0,0]
[null,null,null,null,null,null,null,null,null,null,null,null,null,null,null,null,null,null,null,null,null,null,null,null,null,null,null,null,0,0]
[null,null,null,null,null,null,null,null,null,null,null,null,null,null,null,null,null,null,null,null,null,null,null,null,null,null,null,null,0,0]
[null,null,null,null,null,null,null,null,null,null,null,null,null,null,null,null,null,null,null,null,null,null,null,null,null,null,null,null,0,0]
[null,null,null,null,null,null,null,null,null,null,null,null,null,null,null,null,null,null,null,null,null,null,null,null,null,null,null,null,0,0]
[null,null,null,null,null,null,null,null,null,null,null,null,null,null,null,null,null,null,null,null,null,null,null,null,null,null,null,null,0,0]
[null,null,null,null,null,null,null,null,null,null,null,null,null,null,null,null,null,null,null,null,null,null,null,null,null,null,null,null,0,0]
[null,null,null,null,null,null,null,null,null,null,null,null,null,null,null,null,null,null,null,null,null,null,null,null,null,null,null,null,0,0]
[null,null,null,null,null,null,null,null,null,null,null,null,null,null,null,null,null,null,null,null,null,null,null,null,null,null,null,null,0,0]
[null,null,null,null,null,null,null,null,null,null,null,null,null,null,null,null,null,null,null,null,null,null,null,null,null,null,null,null,0,0]
[null,null,null,null,null,null,null,null,null,null,null,null,null,null,null,null,null,null,null,null,null,null,null,null,null,null,null,null,0,0]
[null,null,null,null,null,null,null,null,null,null,null,null,null,null,null,null,null,null,null,null,null,null,null,null,null,null,null,null,0,0]
[null,null,null,null,null,null,null,null,null,null,null,null,null,null,null,null,null,null,null,null,null,null,null,null,null,null,null,null,0,0]
[null,null,null,null,null,null,null,null,null,null,null,null,null,null,null,null,null,null,null,null,null,null,null,null,null,null,null,null,0,0]
[null,null,null,null,null,null,null,null,null,null,null,null,null,null,null,null,null,null,null,null,null,null,null,null,null,null,null,null,0,0]
[null,null,null,null,null,null,null,null,null,null,null,null,null,null,null,null,null,null,null,null,null,null,null,null,null,null,null,null,0,0]
[null,null,null,null,null,null,null,null,null,null,null,null,null,null,null,null,null,null,null,null,null,null,null,null,null,null,null,null,0,0]
[null,null,null,null,null,null,null,null,null,null,null,null,null,null,null,null,null,null,null,null,null,null,null,null,null,null,null,null,0,0]
[null,null,null,null,null,null,null,null,null,null,null,null,null,null,null,null,null,null,null,null,null,null,null,null,null,null,null,null,0,0]
[null,null,null,null,null,null,null,null,null,null,null,null,null,null,null,null,null,null,null,null,null,null,null,null,null,null,null,null,0,0]
[null,null,null,null,null,null,null,null,null,null,null,null,null,null,null,null,null,null,null,null,null,null,null,null,null,null,null,null,0,0]
[null,null,null,null,null,null,null,null,null,null,null,null,null,null,null,null,null,null,null,null,null,null,null,null,null,null,null,null,0,0]
[null,null,null,null,null,null,null,null,null,null,null,null,null,null,null,null,null,null,null,null,null,null,null,null,null,null,null,null,0,0]
[null,null,null,null,null,null,null,null,null,null,null,null,null,null,null,null,null,null,null,null,null,null,null,null,null,null,null,null,0,0]
[null,null,null,null,null,null,null,null,null,null,null,null,null,null,null,null,null,null,null,null,null,null,null,null,null,null,null,null,0,0]
[null,null,null,null,null,null,null,null,null,null,null,null,null,null,null,null,null,null,null,null,null,null,null,null,null,null,null,null,0,0]
[null,null,null,null,null,null,null,null,null,null,null,null,null,null,null,null,null,null,null,null,null,null,null,null,null,null,null,null,0,0]
[null,null,null,null,null,null,null,null,null,null,null,null,null,null,null,null,null,null,null,null,null,null,null,null,null,null,null,null,0,0]
[null,null,null,null,null,null,null,null,null,null,null,null,null,null,null,null,null,null,null,null,null,null,null,null,null,null,null,null,0,0]
[null,null,null,null,null,null,null,null,null,null,null,null,null,null,null,null,null,null,null,null,null,null,null,null,null,null,null,null,0,0]
[null,null,null,null,null,null,null,null,null,null,null,null,null,null,null,null,null,null,null,null,null,null,null,null,null,null,null,null,0,0]
[null,null,null,null,null,null,null,null,null,null,null,null,null,null,null,null,null,null,null,null,null,null,null,null,null,null,null,null,0,0]
[null,null,null,null,null,null,null,null,null,null,null,null,null,null,null,null,null,null,null,null,null,null,null,null,null,null,null,null,0,0]
[null,null,null,null,null,null,null,null,null,null,null,null,null,null,null,null,null,null,null,null,null,null,null,null,null,null,null,null,0,0]
[null,null,null,null,null,null,null,null,null,null,null,null,null,null,null,null,null,null,null,null,null,null,null,null,null,null,null,null,0,0]
[null,null,null,null,null,null,null,null,null,null,null,null,null,null,null,null,null,null,null,null,null,null,null,null,null,null,null,null,0,0]
[null,null,null,null,null,null,null,null,null,null,null,null,null,null,null,null,null,null,null,null,null,null,null,null,null,null,null,null,0,0]
[null,null,null,null,null,null,null,null,null,null,null,null,null,null,null,null,null,null,null,null,null,null,null,null,null,null,null,null,0,0]
[null,null,null,null,null,null,null,null,null,null,null,null,null,null,null,null,null,null,null,null,null,null,null,null,null,null,null,null,0,0]
[null,null,null,null,null,null,null,null,null,null,null,null,null,null,null,null,null,null,null,null,null,null,null,null,null,null,null,null,0,0]
[null,null,null,null,null,null,null,null,null,null,null,null,null,null,null,null,null,null,null,null,null,null,null,null,null,null,null,null,0,0]
[null,null,null,null,null,null,null,null,null,null,null,null,null,null,null,null,null,null,null,null,null,null,null,null,null,null,null,null,0,0]
[null,null,null,null,null,null,null,null,null,null,null,null,null,null,null,null,null,null,null,null,null,null,null,null,null,null,null,null,0,0]
[null,null,null,null,null,null,null,null,null,null,null,null,null,null,null,null,null,null,null,null,null,null,null,null,null,null,null,null,0,0]
[null,null,null,null,null,null,null,null,null,null,null,null,null,null,null,null,null,null,null,null,null,null,null,null,null,null,null,null,0,0]
[null,null,null,null,null,null,null,null,null,null,null,null,null,null,null,null,null,null,null,null,null,null,null,null,null,null,null,null,0,0]
[null,null,null,null,null,null,null,null,null,null,null,null,null,null,null,null,null,null,null,null,null,null,null,null,null,null,null,null,0,0]
[null,null,null,null,null,null,null,null,null,null,null,null,null,null,null,null,null,null,null,null,null,null,null,null,null,null,null,null,0,0]
[null,null,null,null,null,null,null,null,null,null,null,null,null,null,null,null,null,null,null,null,null,null,null,null,null,null,null,null,0,0]
[null,null,null,null,null,null,null,null,null,null,null,null,null,null,null,null,null,null,null,null,null,null,null,null,null,null,null,null,0,0]
[null,null,null,null,null,null,null,null,null,null,null,null,null,null,null,null,null,null,null,null,null,null,null,null,null,null,null,null,0,0]
[null,null,null,null,null,null,null,null,null,null,null,null,null,null,null,null,null,null,null,null,null,null,null,null,null,null,null,null,0,0]
[null,null,null,null,null,null,null,null,null,null,null,null,null,null,null,null,null,null,null,null,null,null,null,null,null,null,null,null,{"$f":"IF(AA898=0,0,_xlfn.DAYS(AA898,TODAY()))","v":0},{"$f":"IF(AB898=0,0,_xlfn.DAYS(AB898,TODAY()))","v":0}]
[null,null,null,null,null,null,null,null,null,null,null,null,null,null,null,null,null,null,null,null,null,null,null,null,null,null,null,null,0,0]
[null,null,null,null,null,null,null,null,null,null,null,null,null,null,null,null,null,null,null,null,null,null,null,null,null,null,null,null,0,0]
[null,null,null,null,null,null,null,null,null,null,null,null,null,null,null,null,null,null,null,null,null,null,null,null,null,null,null,null,0,0]
[null,null,null,null,null,null,null,null,null,null,null,null,null,null,null,null,null,null,null,null,null,null,null,null,null,null,null,null,0,0]
[null,null,null,null,null,null,null,null,null,null,null,null,null,null,null,null,null,null,null,null,null,null,null,null,null,null,null,null,0,0]
[null,null,null,null,null,null,null,null,null,null,null,null,null,null,null,null,null,null,null,null,null,null,null,null,null,null,null,null,0,0]
[null,null,null,null,null,null,null,null,null,null,null,null,null,null,null,null,null,null,null,null,null,null,null,null,null,null,null,null,0,0]
[null,null,null,null,null,null,null,null,null,null,null,null,null,null,null,null,null,null,null,null,null,null,null,null,null,null,null,null,0,0]
[null,null,null,null,null,null,null,null,null,null,null,null,null,null,null,null,null,null,null,null,null,null,null,null,null,null,null,null,0,0]
[null,null,null,null,null,null,null,null,null,null,null,null,null,null,null,null,null,null,null,null,null,null,null,null,null,null,null,null,0,0]
[null,null,null,null,null,null,null,null,null,null,null,null,null,null,null,null,null,null,null,null,null,null,null,null,null,null,null,null,0,0]
[null,null,null,null,null,null,null,null,null,null,null,null,null,null,null,null,null,null,null,null,null,null,null,null,null,null,null,null,0,0]
[null,null,null,null,null,null,null,null,null,null,null,null,null,null,null,null,null,null,null,null,null,null,null,null,null,null,null,null,0,0]
[null,null,null,null,null,null,null,null,null,null,null,null,null,null,null,null,null,null,null,null,null,null,null,null,null,null,null,null,0,0]
[null,null,null,null,null,null,null,null,null,null,null,null,null,null,null,null,null,null,null,null,null,null,null,null,null,null,null,null,0,0]
[null,null,null,null,null,null,null,null,null,null,null,null,null,null,null,null,null,null,null,null,null,null,null,null,null,null,null,null,0,0]
[null,null,null,null,null,null,null,null,null,null,null,null,null,null,null,null,null,null,null,null,null,null,null,null,null,null,null,null,0,0]
[null,null,null,null,null,null,null,null,null,null,null,null,null,null,null,null,null,null,null,null,null,null,null,null,null,null,null,null,0,0]
[null,null,null,null,null,null,null,null,null,null,null,null,null,null,null,null,null,null,null,null,null,null,null,null,null,null,null,null,0,0]
[null,null,null,null,null,null,null,null,null,null,null,null,null,null,null,null,null,null,null,null,null,null,null,null,null,null,null,null,0,0]
[null,null,null,null,null,null,null,null,null,null,null,null,null,null,null,null,null,null,null,null,null,null,null,null,null,null,null,null,0,0]
[null,null,null,null,null,null,null,null,null,null,null,null,null,null,null,null,null,null,null,null,null,null,null,null,null,null,null,null,0,0]
[null,null,null,null,null,null,null,null,null,null,null,null,null,null,null,null,null,null,null,null,null,null,null,null,null,null,null,null,0,0]
[null,null,null,null,null,null,null,null,null,null,null,null,null,null,null,null,null,null,null,null,null,null,null,null,null,null,null,null,0,0]
[null,null,null,null,null,null,null,null,null,null,null,null,null,null,null,null,null,null,null,null,null,null,null,null,null,null,null,null,0,0]
[null,null,null,null,null,null,null,null,null,null,null,null,null,null,null,null,null,null,null,null,null,null,null,null,null,null,null,null,0,0]
[null,null,null,null,null,null,null,null,null,null,null,null,null,null,null,null,null,null,null,null,null,null,null,null,null,null,null,null,0,0]
[null,null,null,null,null,null,null,null,null,null,null,null,null,null,null,null,null,null,null,null,null,null,null,null,null,null,null,null,0,0]
[null,null,null,null,null,null,null,null,null,null,null,null,null,null,null,null,null,null,null,null,null,null,null,null,null,null,null,null,0,0]
[null,null,null,null,null,null,null,null,null,null,null,null,null,null,null,null,null,null,null,null,null,null,null,null,null,null,null,null,0,0]
[null,null,null,null,null,null,null,null,null,null,null,null,null,null,null,null,null,null,null,null,null,null,null,null,null,null,null,null,0,0]
[null,null,null,null,null,null,null,null,null,null,null,null,null,null,null,null,null,null,null,null,null,null,null,null,null,null,null,null,0,0]
[null,null,null,null,null,null,null,null,null,null,null,null,null,null,null,null,null,null,null,null,null,null,null,null,null,null,null,null,0,0]
[null,null,null,null,null,null,null,null,null,null,null,null,null,null,null,null,null,null,null,null,null,null,null,null,null,null,null,null,0,0]
[null,null,null,null,null,null,null,null,null,null,null,null,null,null,null,null,null,null,null,null,null,null,null,null,null,null,null,null,0,0]
[null,null,null,null,null,null,null,null,null,null,null,null,null,null,null,null,null,null,null,null,null,null,null,null,null,null,null,null,0,0]
[null,null,null,null,null,null,null,null,null,null,null,null,null,null,null,null,null,null,null,null,null,null,null,null,null,null,null,null,0,0]
[null,null,null,null,null,null,null,null,null,null,null,null,null,null,null,null,null,null,null,null,null,null,null,null,null,null,null,null,0,0]
[null,null,null,null,null,null,null,null,null,null,null,null,null,null,null,null,null,null,null,null,null,null,null,null,null,null,null,null,0,0]
[null,null,null,null,null,null,null,null,null,null,null,null,null,null,null,null,null,null,null,null,null,null,null,null,null,null,null,null,0,0]
[null,null,null,null,null,null,null,null,null,null,null,null,null,null,null,null,null,null,null,null,null,null,null,null,null,null,null,null,0,0]
[null,null,null,null,null,null,null,null,null,null,null,null,null,null,null,null,null,null,null,null,null,null,null,null,null,null,null,null,0,0]
[null,null,null,null,null,null,null,null,null,null,null,null,null,null,null,null,null,null,null,null,null,null,null,null,null,null,null,null,0,0]
[null,null,null,null,null,null,null,null,null,null,null,null,null,null,null,null,null,null,null,null,null,null,null,null,null,null,null,null,0,0]
[null,null,null,null,null,null,null,null,null,null,null,null,null,null,null,null,null,null,null,null,null,null,null,null,null,null,null,null,0,0]
[null,null,null,null,null,null,null,null,null,null,null,null,null,null,null,null,null,null,null,null,null,null,null,null,null,null,null,null,0,0]
[null,null,null,null,null,null,null,null,null,null,null,null,null,null,null,null,null,null,null,null,null,null,null,null,null,null,null,null,0,0]
[null,null,null,null,null,null,null,null,null,null,null,null,null,null,null,null,null,null,null,null,null,null,null,null,null,null,null,null,0,0]
[null,null,null,null,null,null,null,null,null,null,null,null,null,null,null,null,null,null,null,null,null,null,null,null,null,null,null,null,0,0]
[null,null,null,null,null,null,null,null,null,null,null,null,null,null,null,null,null,null,null,null,null,null,null,null,null,null,null,null,0,0]
[null,null,null,null,null,null,null,null,null,null,null,null,null,null,null,null,null,null,null,null,null,null,null,null,null,null,null,null,0,0]
[null,null,null,null,null,null,null,null,null,null,null,null,null,null,null,null,null,null,null,null,null,null,null,null,null,null,null,null,0,0]
[null,null,null,null,null,null,null,null,null,null,null,null,null,null,null,null,null,null,null,null,null,null,null,null,null,null,null,null,0,0]
[null,null,null,null,null,null,null,null,null,null,null,null,null,null,null,null,null,null,null,null,null,null,null,null,null,null,null,null,0,0]
[null,null,null,null,null,null,null,null,null,null,null,null,null,null,null,null,null,null,null,null,null,null,null,null,null,null,null,null,0,0]
[null,null,null,null,null,null,null,null,null,null,null,null,null,null,null,null,null,null,null,null,null,null,null,null,null,null,null,null,0,0]
[null,null,null,null,null,null,null,null,null,null,null,null,null,null,null,null,null,null,null,null,null,null,null,null,null,null,null,null,0,0]
[null,null,null,null,null,null,null,null,null,null,null,null,null,null,null,null,null,null,null,null,null,null,null,null,null,null,null,null,0,0]
[null,null,null,null,null,null,null,null,null,null,null,null,null,null,null,null,null,null,null,null,null,null,null,null,null,null,null,null,0,0]
[null,null,null,null,null,null,null,null,null,null,null,null,null,null,null,null,null,null,null,null,null,null,null,null,null,null,null,null,0,0]
[null,null,null,null,null,null,null,null,null,null,null,null,null,null,null,null,null,null,null,null,null,null,null,null,null,null,null,null,0,0]
[null,null,null,null,null,null,null,null,null,null,null,null,null,null,null,null,null,null,null,null,null,null,null,null,null,null,null,null,0,0]
[null,null,null,null,null,null,null,null,null,null,null,null,null,null,null,null,null,null,null,null,null,null,null,null,null,null,null,null,0,0]
[null,null,null,null,null,null,null,null,null,null,null,null,null,null,null,null,null,null,null,null,null,null,null,null,null,null,null,null,{"$f":"IF(AA962=0,0,_xlfn.DAYS(AA962,TODAY()))","v":0},{"$f":"IF(AB962=0,0,_xlfn.DAYS(AB962,TODAY()))","v":0}]
[null,null,null,null,null,null,null,null,null,null,null,null,null,null,null,null,null,null,null,null,null,null,null,null,null,null,null,null,0,0]
[null,null,null,null,null,null,null,null,null,null,null,null,null,null,null,null,null,null,null,null,null,null,null,null,null,null,null,null,0,0]
[null,null,null,null,null,null,null,null,null,null,null,null,null,null,null,null,null,null,null,null,null,null,null,null,null,null,null,null,0,0]
[null,null,null,null,null,null,null,null,null,null,null,null,null,null,null,null,null,null,null,null,null,null,null,null,null,null,null,null,0,0]
[null,null,null,null,null,null,null,null,null,null,null,null,null,null,null,null,null,null,null,null,null,null,null,null,null,null,null,null,0,0]
[null,null,null,null,null,null,null,null,null,null,null,null,null,null,null,null,null,null,null,null,null,null,null,null,null,null,null,null,0,0]
[null,null,null,null,null,null,null,null,null,null,null,null,null,null,null,null,null,null,null,null,null,null,null,null,null,null,null,null,0,0]
[null,null,null,null,null,null,null,null,null,null,null,null,null,null,null,null,null,null,null,null,null,null,null,null,null,null,null,null,0,0]
[null,null,null,null,null,null,null,null,null,null,null,null,null,null,null,null,null,null,null,null,null,null,null,null,null,null,null,null,0,0]
[null,null,null,null,null,null,null,null,null,null,null,null,null,null,null,null,null,null,null,null,null,null,null,null,null,null,null,null,0,0]
[null,null,null,null,null,null,null,null,null,null,null,null,null,null,null,null,null,null,null,null,null,null,null,null,null,null,null,null,0,0]
[null,null,null,null,null,null,null,null,null,null,null,null,null,null,null,null,null,null,null,null,null,null,null,null,null,null,null,null,0,0]
[null,null,null,null,null,null,null,null,null,null,null,null,null,null,null,null,null,null,null,null,null,null,null,null,null,null,null,null,0,0]
[null,null,null,null,null,null,null,null,null,null,null,null,null,null,null,null,null,null,null,null,null,null,null,null,null,null,null,null,0,0]
[null,null,null,null,null,null,null,null,null,null,null,null,null,null,null,null,null,null,null,null,null,null,null,null,null,null,null,null,0,0]
[null,null,null,null,null,null,null,null,null,null,null,null,null,null,null,null,null,null,null,null,null,null,null,null,null,null,null,null,0,0]
[null,null,null,null,null,null,null,null,null,null,null,null,null,null,null,null,null,null,null,null,null,null,null,null,null,null,null,null,0,0]
[null,null,null,null,null,null,null,null,null,null,null,null,null,null,null,null,null,null,null,null,null,null,null,null,null,null,null,null,0,0]
[null,null,null,null,null,null,null,null,null,null,null,null,null,null,null,null,null,null,null,null,null,null,null,null,null,null,null,null,0,0]
[null,null,null,null,null,null,null,null,null,null,null,null,null,null,null,null,null,null,null,null,null,null,null,null,null,null,null,null,0,0]
[null,null,null,null,null,null,null,null,null,null,null,null,null,null,null,null,null,null,null,null,null,null,null,null,null,null,null,null,0,0]
[null,null,null,null,null,null,null,null,null,null,null,null,null,null,null,null,null,null,null,null,null,null,null,null,null,null,null,null,0,0]
[null,null,null,null,null,null,null,null,null,null,null,null,null,null,null,null,null,null,null,null,null,null,null,null,null,null,null,null,0,0]
[null,null,null,null,null,null,null,null,null,null,null,null,null,null,null,null,null,null,null,null,null,null,null,null,null,null,null,null,0,0]
[null,null,null,null,null,null,null,null,null,null,null,null,null,null,null,null,null,null,null,null,null,null,null,null,null,null,null,null,0,0]
[null,null,null,null,null,null,null,null,null,null,null,null,null,null,null,null,null,null,null,null,null,null,null,null,null,null,null,null,0,0]
[null,null,null,null,null,null,null,null,null,null,null,null,null,null,null,null,null,null,null,null,null,null,null,null,null,null,null,null,0,0]
[null,null,null,null,null,null,null,null,null,null,null,null,null,null,null,null,null,null,null,null,null,null,null,null,null,null,null,null,0,0]
[null,null,null,null,null,null,null,null,null,null,null,null,null,null,null,null,null,null,null,null,null,null,null,null,null,null,null,null,0,0]
[null,null,null,null,null,null,null,null,null,null,null,null,null,null,null,null,null,null,null,null,null,null,null,null,null,null,null,null,0,0]
[null,null,null,null,null,null,null,null,null,null,null,null,null,null,null,null,null,null,null,null,null,null,null,null,null,null,null,null,0,0]
[null,null,null,null,null,null,null,null,null,null,null,null,null,null,null,null,null,null,null,null,null,null,null,null,null,null,null,null,0,0]
[null,null,null,null,null,null,null,null,null,null,null,null,null,null,null,null,null,null,null,null,null,null,null,null,null,null,null,null,0,0]
[null,null,null,null,null,null,null,null,null,null,null,null,null,null,null,null,null,null,null,null,null,null,null,null,null,null,null,null,0,0]
[null,null,null,null,null,null,null,null,null,null,null,null,null,null,null,null,null,null,null,null,null,null,null,null,null,null,null,null,0,0]
[null,null,null,null,null,null,null,null,null,null,null,null,null,null,null,null,null,null,null,null,null,null,null,null,null,null,null,null,0,0]
[null,null,null,null,null,null,null,null,null,null,null,null,null,null,null,null,null,null,null,null,null,null,null,null,null,null,null,null,0,0]
[null,null,null,null,null,null,null,null,null,null,null,null,null,null,null,null,null,null,null,null,null,null,null,null,null,null,null,null,0,0]
[null,null,null,null,null,null,null,null,null,null,null,null,null,null,null,null,null,null,null,null,null,null,null,null,null,null,null,null,0,0]
[null,null,null,null,null,null,null,null,null,null,null,null,null,null,null,null,null,null,null,null,null,null,null,null,null,null,null,null,0,0]
[null,null,null,null,null,null,null,null,null,null,null,null,null,null,null,null,null,null,null,null,null,null,null,null,null,null,null,null,0,0]
[null,null,null,null,null,null,null,null,null,null,null,null,null,null,null,null,null,null,null,null,null,null,null,null,null,null,null,null,0,0]
[null,null,null,null,null,null,null,null,null,null,null,null,null,null,null,null,null,null,null,null,null,null,null,null,null,null,null,null,0,0]
[null,null,null,null,null,null,null,null,null,null,null,null,null,null,null,null,null,null,null,null,null,null,null,null,null,null,null,null,0,0]
[null,null,null,null,null,null,null,null,null,null,null,null,null,null,null,null,null,null,null,null,null,null,null,null,null,null,null,null,0,0]
[null,null,null,null,null,null,null,null,null,null,null,null,null,null,null,null,null,null,null,null,null,null,null,null,null,null,null,null,0,0]
[null,null,null,null,null,null,null,null,null,null,null,null,null,null,null,null,null,null,null,null,null,null,null,null,null,null,null,null,0,0]
[null,null,null,null,null,null,null,null,null,null,null,null,null,null,null,null,null,null,null,null,null,null,null,null,null,null,null,null,0,0]
[null,null,null,null,null,null,null,null,null,null,null,null,null,null,null,null,null,null,null,null,null,null,null,null,null,null,null,null,0,0]
[null,null,null,null,null,null,null,null,null,null,null,null,null,null,null,null,null,null,null,null,null,null,null,null,null,null,null,null,0,0]
[null,null,null,null,null,null,null,null,null,null,null,null,null,null,null,null,null,null,null,null,null,null,null,null,null,null,null,null,0,0]
[null,null,null,null,null,null,null,null,null,null,null,null,null,null,null,null,null,null,null,null,null,null,null,null,null,null,null,null,0,0]
[null,null,null,null,null,null,null,null,null,null,null,null,null,null,null,null,null,null,null,null,null,null,null,null,null,null,null,null,0,0]
[null,null,null,null,null,null,null,null,null,null,null,null,null,null,null,null,null,null,null,null,null,null,null,null,null,null,null,null,0,0]
[null,null,null,null,null,null,null,null,null,null,null,null,null,null,null,null,null,null,null,null,null,null,null,null,null,null,null,null,0,0]
[null,null,null,null,null,null,null,null,null,null,null,null,null,null,null,null,null,null,null,null,null,null,null,null,null,null,null,null,0,0]
[null,null,null,null,null,null,null,null,null,null,null,null,null,null,null,null,null,null,null,null,null,null,null,null,null,null,null,null,0,0]
[null,null,null,null,null,null,null,null,null,null,null,null,null,null,null,null,null,null,null,null,null,null,null,null,null,null,null,null,0,0]
[null,null,null,null,null,null,null,null,null,null,null,null,null,null,null,null,null,null,null,null,null,null,null,null,null,null,null,null,0,0]
[null,null,null,null,null,null,null,null,null,null,null,null,null,null,null,null,null,null,null,null,null,null,null,null,null,null,null,null,0,0]
[null,null,null,null,null,null,null,null,null,null,null,null,null,null,null,null,null,null,null,null,null,null,null,null,null,null,null,null,0,0]
[null,null,null,null,null,null,null,null,null,null,null,null,null,null,null,null,null,null,null,null,null,null,null,null,null,null,null,null,0,0]
[null,null,null,null,null,null,null,null,null,null,null,null,null,null,null,null,null,null,null,null,null,null,null,null,null,null,null,null,0,0]
[null,null,null,null,null,null,null,null,null,null,null,null,null,null,null,null,null,null,null,null,null,null,null,null,null,null,null,null,{"$f":"IF(AA1026=0,0,_xlfn.DAYS(AA1026,TODAY()))","v":0},{"$f":"IF(AB1026=0,0,_xlfn.DAYS(AB1026,TODAY()))","v":0}]
[null,null,null,null,null,null,null,null,null,null,null,null,null,null,null,null,null,null,null,null,null,null,null,null,null,null,null,null,0,0]
[null,null,null,null,null,null,null,null,null,null,null,null,null,null,null,null,null,null,null,null,null,null,null,null,null,null,null,null,0,0]
[null,null,null,null,null,null,null,null,null,null,null,null,null,null,null,null,null,null,null,null,null,null,null,null,null,null,null,null,0,0]
[null,null,null,null,null,null,null,null,null,null,null,null,null,null,null,null,null,null,null,null,null,null,null,null,null,null,null,null,0,0]
[null,null,null,null,null,null,null,null,null,null,null,null,null,null,null,null,null,null,null,null,null,null,null,null,null,null,null,null,0,0]
[null,null,null,null,null,null,null,null,null,null,null,null,null,null,null,null,null,null,null,null,null,null,null,null,null,null,null,null,0,0]
[null,null,null,null,null,null,null,null,null,null,null,null,null,null,null,null,null,null,null,null,null,null,null,null,null,null,null,null,0,0]
[null,null,null,null,null,null,null,null,null,null,null,null,null,null,null,null,null,null,null,null,null,null,null,null,null,null,null,null,0,0]
[null,null,null,null,null,null,null,null,null,null,null,null,null,null,null,null,null,null,null,null,null,null,null,null,null,null,null,null,0,0]
[null,null,null,null,null,null,null,null,null,null,null,null,null,null,null,null,null,null,null,null,null,null,null,null,null,null,null,null,0,0]
[null,null,null,null,null,null,null,null,null,null,null,null,null,null,null,null,null,null,null,null,null,null,null,null,null,null,null,null,0,0]
[null,null,null,null,null,null,null,null,null,null,null,null,null,null,null,null,null,null,null,null,null,null,null,null,null,null,null,null,0,0]
[null,null,null,null,null,null,null,null,null,null,null,null,null,null,null,null,null,null,null,null,null,null,null,null,null,null,null,null,0,0]
[null,null,null,null,null,null,null,null,null,null,null,null,null,null,null,null,null,null,null,null,null,null,null,null,null,null,null,null,0,0]
[null,null,null,null,null,null,null,null,null,null,null,null,null,null,null,null,null,null,null,null,null,null,null,null,null,null,null,null,0,0]
[null,null,null,null,null,null,null,null,null,null,null,null,null,null,null,null,null,null,null,null,null,null,null,null,null,null,null,null,0,0]
[null,null,null,null,null,null,null,null,null,null,null,null,null,null,null,null,null,null,null,null,null,null,null,null,null,null,null,null,0,0]
[null,null,null,null,null,null,null,null,null,null,null,null,null,null,null,null,null,null,null,null,null,null,null,null,null,null,null,null,0,0]
[null,null,null,null,null,null,null,null,null,null,null,null,null,null,null,null,null,null,null,null,null,null,null,null,null,null,null,null,0,0]
[null,null,null,null,null,null,null,null,null,null,null,null,null,null,null,null,null,null,null,null,null,null,null,null,null,null,null,null,0,0]
[null,null,null,null,null,null,null,null,null,null,null,null,null,null,null,null,null,null,null,null,null,null,null,null,null,null,null,null,0,0]
[null,null,null,null,null,null,null,null,null,null,null,null,null,null,null,null,null,null,null,null,null,null,null,null,null,null,null,null,0,0]
[null,null,null,null,null,null,null,null,null,null,null,null,null,null,null,null,null,null,null,null,null,null,null,null,null,null,null,null,0,0]
[null,null,null,null,null,null,null,null,null,null,null,null,null,null,null,null,null,null,null,null,null,null,null,null,null,null,null,null,0,0]
[null,null,null,null,null,null,null,null,null,null,null,null,null,null,null,null,null,null,null,null,null,null,null,null,null,null,null,null,0,0]
[null,null,null,null,null,null,null,null,null,null,null,null,null,null,null,null,null,null,null,null,null,null,null,null,null,null,null,null,0,0]
[null,null,null,null,null,null,null,null,null,null,null,null,null,null,null,null,null,null,null,null,null,null,null,null,null,null,null,null,0,0]
[null,null,null,null,null,null,null,null,null,null,null,null,null,null,null,null,null,null,null,null,null,null,null,null,null,null,null,null,0,0]
[null,null,null,null,null,null,null,null,null,null,null,null,null,null,null,null,null,null,null,null,null,null,null,null,null,null,null,null,0,0]
[null,null,null,null,null,null,null,null,null,null,null,null,null,null,null,null,null,null,null,null,null,null,null,null,null,null,null,null,0,0]
[null,null,null,null,null,null,null,null,null,null,null,null,null,null,null,null,null,null,null,null,null,null,null,null,null,null,null,null,0,0]
[null,null,null,null,null,null,null,null,null,null,null,null,null,null,null,null,null,null,null,null,null,null,null,null,null,null,null,null,0,0]
[null,null,null,null,null,null,null,null,null,null,null,null,null,null,null,null,null,null,null,null,null,null,null,null,null,null,null,null,0,0]
[null,null,null,null,null,null,null,null,null,null,null,null,null,null,null,null,null,null,null,null,null,null,null,null,null,null,null,null,0,0]
[null,null,null,null,null,null,null,null,null,null,null,null,null,null,null,null,null,null,null,null,null,null,null,null,null,null,null,null,0,0]
[null,null,null,null,null,null,null,null,null,null,null,null,null,null,null,null,null,null,null,null,null,null,null,null,null,null,null,null,0,0]
[null,null,null,null,null,null,null,null,null,null,null,null,null,null,null,null,null,null,null,null,null,null,null,null,null,null,null,null,0,0]
[null,null,null,null,null,null,null,null,null,null,null,null,null,null,null,null,null,null,null,null,null,null,null,null,null,null,null,null,0,0]
[null,null,null,null,null,null,null,null,null,null,null,null,null,null,null,null,null,null,null,null,null,null,null,null,null,null,null,null,0,0]
[null,null,null,null,null,null,null,null,null,null,null,null,null,null,null,null,null,null,null,null,null,null,null,null,null,null,null,null,0,0]
[null,null,null,null,null,null,null,null,null,null,null,null,null,null,null,null,null,null,null,null,null,null,null,null,null,null,null,null,0,0]
[null,null,null,null,null,null,null,null,null,null,null,null,null,null,null,null,null,null,null,null,null,null,null,null,null,null,null,null,0,0]
[null,null,null,null,null,null,null,null,null,null,null,null,null,null,null,null,null,null,null,null,null,null,null,null,null,null,null,null,0,0]
[null,null,null,null,null,null,null,null,null,null,null,null,null,null,null,null,null,null,null,null,null,null,null,null,null,null,null,null,0,0]
[null,null,null,null,null,null,null,null,null,null,null,null,null,null,null,null,null,null,null,null,null,null,null,null,null,null,null,null,0,0]
[null,null,null,null,null,null,null,null,null,null,null,null,null,null,null,null,null,null,null,null,null,null,null,null,null,null,null,null,0,0]
[null,null,null,null,null,null,null,null,null,null,null,null,null,null,null,null,null,null,null,null,null,null,null,null,null,null,null,null,0,0]
[null,null,null,null,null,null,null,null,null,null,null,null,null,null,null,null,null,null,null,null,null,null,null,null,null,null,null,null,0,0]
[null,null,null,null,null,null,null,null,null,null,null,null,null,null,null,null,null,null,null,null,null,null,null,null,null,null,null,null,0,0]
[null,null,null,null,null,null,null,null,null,null,null,null,null,null,null,null,null,null,null,null,null,null,null,null,null,null,null,null,0,0]
[null,null,null,null,null,null,null,null,null,null,null,null,null,null,null,null,null,null,null,null,null,null,null,null,null,null,null,null,0,0]
[null,null,null,null,null,null,null,null,null,null,null,null,null,null,null,null,null,null,null,null,null,null,null,null,null,null,null,null,0,0]
[null,null,null,null,null,null,null,null,null,null,null,null,null,null,null,null,null,null,null,null,null,null,null,null,null,null,null,null,0,0]
[null,null,null,null,null,null,null,null,null,null,null,null,null,null,null,null,null,null,null,null,null,null,null,null,null,null,null,null,0,0]
[null,null,null,null,null,null,null,null,null,null,null,null,null,null,null,null,null,null,null,null,null,null,null,null,null,null,null,null,0,0]
[null,null,null,null,null,null,null,null,null,null,null,null,null,null,null,null,null,null,null,null,null,null,null,null,null,null,null,null,0,0]
[null,null,null,null,null,null,null,null,null,null,null,null,null,null,null,null,null,null,null,null,null,null,null,null,null,null,null,null,0,0]
[null,null,null,null,null,null,null,null,null,null,null,null,null,null,null,null,null,null,null,null,null,null,null,null,null,null,null,null,0,0]
[null,null,null,null,null,null,null,null,null,null,null,null,null,null,null,null,null,null,null,null,null,null,null,null,null,null,null,null,0,0]
[null,null,null,null,null,null,null,null,null,null,null,null,null,null,null,null,null,null,null,null,null,null,null,null,null,null,null,null,0,0]
[null,null,null,null,null,null,null,null,null,null,null,null,null,null,null,null,null,null,null,null,null,null,null,null,null,null,null,null,0,0]
[null,null,null,null,null,null,null,null,null,null,null,null,null,null,null,null,null,null,null,null,null,null,null,null,null,null,null,null,0,0]
[null,null,null,null,null,null,null,null,null,null,null,null,null,null,null,null,null,null,null,null,null,null,null,null,null,null,null,null,0,0]
[null,null,null,null,null,null,null,null,null,null,null,null,null,null,null,null,null,null,null,null,null,null,null,null,null,null,null,null,{"$f":"IF(AA1090=0,0,_xlfn.DAYS(AA1090,TODAY()))","v":0},{"$f":"IF(AB1090=0,0,_xlfn.DAYS(AB1090,TODAY()))","v":0}]
[null,null,null,null,null,null,null,null,null,null,null,null,null,null,null,null,null,null,null,null,null,null,null,null,null,null,null,null,0,0]
[null,null,null,null,null,null,null,null,null,null,null,null,null,null,null,null,null,null,null,null,null,null,null,null,null,null,null,null,0,0]
[null,null,null,null,null,null,null,null,null,null,null,null,null,null,null,null,null,null,null,null,null,null,null,null,null,null,null,null,0,0]
[null,null,null,null,null,null,null,null,null,null,null,null,null,null,null,null,null,null,null,null,null,null,null,null,null,null,null,null,0,0]
[null,null,null,null,null,null,null,null,null,null,null,null,null,null,null,null,null,null,null,null,null,null,null,null,null,null,null,null,0,0]
[null,null,null,null,null,null,null,null,null,null,null,null,null,null,null,null,null,null,null,null,null,null,null,null,null,null,null,null,0,0]
[null,null,null,null,null,null,null,null,null,null,null,null,null,null,null,null,null,null,null,null,null,null,null,null,null,null,null,null,0,0]
[null,null,null,null,null,null,null,null,null,null,null,null,null,null,null,null,null,null,null,null,null,null,null,null,null,null,null,null,0,0]
[null,null,null,null,null,null,null,null,null,null,null,null,null,null,null,null,null,null,null,null,null,null,null,null,null,null,null,null,0,0]
[null,null,null,null,null,null,null,null,null,null,null,null,null,null,null,null,null,null,null,null,null,null,null,null,null,null,null,null,0,0]
[null,null,null,null,null,null,null,null,null,null,null,null,null,null,null,null,null,null,null,null,null,null,null,null,null,null,null,null,0,0]
[null,null,null,null,null,null,null,null,null,null,null,null,null,null,null,null,null,null,null,null,null,null,null,null,null,null,null,null,0,0]
[null,null,null,null,null,null,null,null,null,null,null,null,null,null,null,null,null,null,null,null,null,null,null,null,null,null,null,null,0,0]
[null,null,null,null,null,null,null,null,null,null,null,null,null,null,null,null,null,null,null,null,null,null,null,null,null,null,null,null,0,0]
[null,null,null,null,null,null,null,null,null,null,null,null,null,null,null,null,null,null,null,null,null,null,null,null,null,null,null,null,0,0]
[null,null,null,null,null,null,null,null,null,null,null,null,null,null,null,null,null,null,null,null,null,null,null,null,null,null,null,null,0,0]
[null,null,null,null,null,null,null,null,null,null,null,null,null,null,null,null,null,null,null,null,null,null,null,null,null,null,null,null,0,0]
[null,null,null,null,null,null,null,null,null,null,null,null,null,null,null,null,null,null,null,null,null,null,null,null,null,null,null,null,0,0]
[null,null,null,null,null,null,null,null,null,null,null,null,null,null,null,null,null,null,null,null,null,null,null,null,null,null,null,null,0,0]
[null,null,null,null,null,null,null,null,null,null,null,null,null,null,null,null,null,null,null,null,null,null,null,null,null,null,null,null,0,0]
[null,null,null,null,null,null,null,null,null,null,null,null,null,null,null,null,null,null,null,null,null,null,null,null,null,null,null,null,0,0]
[null,null,null,null,null,null,null,null,null,null,null,null,null,null,null,null,null,null,null,null,null,null,null,null,null,null,null,null,0,0]
[null,null,null,null,null,null,null,null,null,null,null,null,null,null,null,null,null,null,null,null,null,null,null,null,null,null,null,null,0,0]
[null,null,null,null,null,null,null,null,null,null,null,null,null,null,null,null,null,null,null,null,null,null,null,null,null,null,null,null,0,0]
[null,null,null,null,null,null,null,null,null,null,null,null,null,null,null,null,null,null,null,null,null,null,null,null,null,null,null,null,0,0]
[null,null,null,null,null,null,null,null,null,null,null,null,null,null,null,null,null,null,null,null,null,null,null,null,null,null,null,null,0,0]
[null,null,null,null,null,null,null,null,null,null,null,null,null,null,null,null,null,null,null,null,null,null,null,null,null,null,null,null,0,0]
[null,null,null,null,null,null,null,null,null,null,null,null,null,null,null,null,null,null,null,null,null,null,null,null,null,null,null,null,0,0]
[null,null,null,null,null,null,null,null,null,null,null,null,null,null,null,null,null,null,null,null,null,null,null,null,null,null,null,null,0,0]
[null,null,null,null,null,null,null,null,null,null,null,null,null,null,null,null,null,null,null,null,null,null,null,null,null,null,null,null,0,0]
[null,null,null,null,null,null,null,null,null,null,null,null,null,null,null,null,null,null,null,null,null,null,null,null,null,null,null,null,0,0]
[null,null,null,null,null,null,null,null,null,null,null,null,null,null,null,null,null,null,null,null,null,null,null,null,null,null,null,null,0,0]
[null,null,null,null,null,null,null,null,null,null,null,null,null,null,null,null,null,null,null,null,null,null,null,null,null,null,null,null,0,0]
[null,null,null,null,null,null,null,null,null,null,null,null,null,null,null,null,null,null,null,null,null,null,null,null,null,null,null,null,0,0]
[null,null,null,null,null,null,null,null,null,null,null,null,null,null,null,null,null,null,null,null,null,null,null,null,null,null,null,null,0,0]
[null,null,null,null,null,null,null,null,null,null,null,null,null,null,null,null,null,null,null,null,null,null,null,null,null,null,null,null,0,0]
[null,null,null,null,null,null,null,null,null,null,null,null,null,null,null,null,null,null,null,null,null,null,null,null,null,null,null,null,0,0]
[null,null,null,null,null,null,null,null,null,null,null,null,null,null,null,null,null,null,null,null,null,null,null,null,null,null,null,null,0,0]
[null,null,null,null,null,null,null,null,null,null,null,null,null,null,null,null,null,null,null,null,null,null,null,null,null,null,null,null,0,0]
[null,null,null,null,null,null,null,null,null,null,null,null,null,null,null,null,null,null,null,null,null,null,null,null,null,null,null,null,0,0]
[null,null,null,null,null,null,null,null,null,null,null,null,null,null,null,null,null,null,null,null,null,null,null,null,null,null,null,null,0,0]
[null,null,null,null,null,null,null,null,null,null,null,null,null,null,null,null,null,null,null,null,null,null,null,null,null,null,null,null,0,0]
[null,null,null,null,null,null,null,null,null,null,null,null,null,null,null,null,null,null,null,null,null,null,null,null,null,null,null,null,0,0]
[null,null,null,null,null,null,null,null,null,null,null,null,null,null,null,null,null,null,null,null,null,null,null,null,null,null,null,null,0,0]
[null,null,null,null,null,null,null,null,null,null,null,null,null,null,null,null,null,null,null,null,null,null,null,null,null,null,null,null,0,0]
[null,null,null,null,null,null,null,null,null,null,null,null,null,null,null,null,null,null,null,null,null,null,null,null,null,null,null,null,0,0]
[null,null,null,null,null,null,null,null,null,null,null,null,null,null,null,null,null,null,null,null,null,null,null,null,null,null,null,null,0,0]
[null,null,null,null,null,null,null,null,null,null,null,null,null,null,null,null,null,null,null,null,null,null,null,null,null,null,null,null,0,0]
[null,null,null,null,null,null,null,null,null,null,null,null,null,null,null,null,null,null,null,null,null,null,null,null,null,null,null,null,0,0]
[null,null,null,null,null,null,null,null,null,null,null,null,null,null,null,null,null,null,null,null,null,null,null,null,null,null,null,null,0,0]
[null,null,null,null,null,null,null,null,null,null,null,null,null,null,null,null,null,null,null,null,null,null,null,null,null,null,null,null,0,0]
[null,null,null,null,null,null,null,null,null,null,null,null,null,null,null,null,null,null,null,null,null,null,null,null,null,null,null,null,0,0]
[null,null,null,null,null,null,null,null,null,null,null,null,null,null,null,null,null,null,null,null,null,null,null,null,null,null,null,null,0,0]
[null,null,null,null,null,null,null,null,null,null,null,null,null,null,null,null,null,null,null,null,null,null,null,null,null,null,null,null,0,0]
[null,null,null,null,null,null,null,null,null,null,null,null,null,null,null,null,null,null,null,null,null,null,null,null,null,null,null,null,0,0]
[null,null,null,null,null,null,null,null,null,null,null,null,null,null,null,null,null,null,null,null,null,null,null,null,null,null,null,null,0,0]
[null,null,null,null,null,null,null,null,null,null,null,null,null,null,null,null,null,null,null,null,null,null,null,null,null,null,null,null,0,0]
[null,null,null,null,null,null,null,null,null,null,null,null,null,null,null,null,null,null,null,null,null,null,null,null,null,null,null,null,0,0]
[null,null,null,null,null,null,null,null,null,null,null,null,null,null,null,null,null,null,null,null,null,null,null,null,null,null,null,null,0,0]
[null,null,null,null,null,null,null,null,null,null,null,null,null,null,null,null,null,null,null,null,null,null,null,null,null,null,null,null,0,0]
[null,null,null,null,null,null,null,null,null,null,null,null,null,null,null,null,null,null,null,null,null,null,null,null,null,null,null,null,0,0]
[null,null,null,null,null,null,null,null,null,null,null,null,null,null,null,null,null,null,null,null,null,null,null,null,null,null,null,null,0,0]
[null,null,null,null,null,null,null,null,null,null,null,null,null,null,null,null,null,null,null,null,null,null,null,null,null,null,null,null,0,0]
[null,null,null,null,null,null,null,null,null,null,null,null,null,null,null,null,null,null,null,null,null,null,null,null,null,null,null,null,{"$f":"IF(AA1154=0,0,_xlfn.DAYS(AA1154,TODAY()))","v":0},{"$f":"IF(AB1154=0,0,_xlfn.DAYS(AB1154,TODAY()))","v":0}]
[null,null,null,null,null,null,null,null,null,null,null,null,null,null,null,null,null,null,null,null,null,null,null,null,null,null,null,null,0,0]
[null,null,null,null,null,null,null,null,null,null,null,null,null,null,null,null,null,null,null,null,null,null,null,null,null,null,null,null,0,0]
[null,null,null,null,null,null,null,null,null,null,null,null,null,null,null,null,null,null,null,null,null,null,null,null,null,null,null,null,0,0]
[null,null,null,null,null,null,null,null,null,null,null,null,null,null,null,null,null,null,null,null,null,null,null,null,null,null,null,null,0,0]
[null,null,null,null,null,null,null,null,null,null,null,null,null,null,null,null,null,null,null,null,null,null,null,null,null,null,null,null,0,0]
[null,null,null,null,null,null,null,null,null,null,null,null,null,null,null,null,null,null,null,null,null,null,null,null,null,null,null,null,0,0]
[null,null,null,null,null,null,null,null,null,null,null,null,null,null,null,null,null,null,null,null,null,null,null,null,null,null,null,null,0,0]
[null,null,null,null,null,null,null,null,null,null,null,null,null,null,null,null,null,null,null,null,null,null,null,null,null,null,null,null,0,0]
[null,null,null,null,null,null,null,null,null,null,null,null,null,null,null,null,null,null,null,null,null,null,null,null,null,null,null,null,0,0]
[null,null,null,null,null,null,null,null,null,null,null,null,null,null,null,null,null,null,null,null,null,null,null,null,null,null,null,null,0,0]
[null,null,null,null,null,null,null,null,null,null,null,null,null,null,null,null,null,null,null,null,null,null,null,null,null,null,null,null,0,0]
[null,null,null,null,null,null,null,null,null,null,null,null,null,null,null,null,null,null,null,null,null,null,null,null,null,null,null,null,0,0]
[null,null,null,null,null,null,null,null,null,null,null,null,null,null,null,null,null,null,null,null,null,null,null,null,null,null,null,null,0,0]
[null,null,null,null,null,null,null,null,null,null,null,null,null,null,null,null,null,null,null,null,null,null,null,null,null,null,null,null,0,0]
[null,null,null,null,null,null,null,null,null,null,null,null,null,null,null,null,null,null,null,null,null,null,null,null,null,null,null,null,0,0]
[null,null,null,null,null,null,null,null,null,null,null,null,null,null,null,null,null,null,null,null,null,null,null,null,null,null,null,null,0,0]
[null,null,null,null,null,null,null,null,null,null,null,null,null,null,null,null,null,null,null,null,null,null,null,null,null,null,null,null,0,0]
[null,null,null,null,null,null,null,null,null,null,null,null,null,null,null,null,null,null,null,null,null,null,null,null,null,null,null,null,0,0]
[null,null,null,null,null,null,null,null,null,null,null,null,null,null,null,null,null,null,null,null,null,null,null,null,null,null,null,null,0,0]
[null,null,null,null,null,null,null,null,null,null,null,null,null,null,null,null,null,null,null,null,null,null,null,null,null,null,null,null,0,0]
[null,null,null,null,null,null,null,null,null,null,null,null,null,null,null,null,null,null,null,null,null,null,null,null,null,null,null,null,0,0]
[null,null,null,null,null,null,null,null,null,null,null,null,null,null,null,null,null,null,null,null,null,null,null,null,null,null,null,null,0,0]
[null,null,null,null,null,null,null,null,null,null,null,null,null,null,null,null,null,null,null,null,null,null,null,null,null,null,null,null,0,0]
[null,null,null,null,null,null,null,null,null,null,null,null,null,null,null,null,null,null,null,null,null,null,null,null,null,null,null,null,0,0]
[null,null,null,null,null,null,null,null,null,null,null,null,null,null,null,null,null,null,null,null,null,null,null,null,null,null,null,null,0,0]
[null,null,null,null,null,null,null,null,null,null,null,null,null,null,null,null,null,null,null,null,null,null,null,null,null,null,null,null,0,0]
[null,null,null,null,null,null,null,null,null,null,null,null,null,null,null,null,null,null,null,null,null,null,null,null,null,null,null,null,0,0]
[null,null,null,null,null,null,null,null,null,null,null,null,null,null,null,null,null,null,null,null,null,null,null,null,null,null,null,null,0,0]
[null,null,null,null,null,null,null,null,null,null,null,null,null,null,null,null,null,null,null,null,null,null,null,null,null,null,null,null,0,0]
[null,null,null,null,null,null,null,null,null,null,null,null,null,null,null,null,null,null,null,null,null,null,null,null,null,null,null,null,0,0]
[null,null,null,null,null,null,null,null,null,null,null,null,null,null,null,null,null,null,null,null,null,null,null,null,null,null,null,null,0,0]
[null,null,null,null,null,null,null,null,null,null,null,null,null,null,null,null,null,null,null,null,null,null,null,null,null,null,null,null,0,0]
[null,null,null,null,null,null,null,null,null,null,null,null,null,null,null,null,null,null,null,null,null,null,null,null,null,null,null,null,0,0]
[null,null,null,null,null,null,null,null,null,null,null,null,null,null,null,null,null,null,null,null,null,null,null,null,null,null,null,null,0,0]
[null,null,null,null,null,null,null,null,null,null,null,null,null,null,null,null,null,null,null,null,null,null,null,null,null,null,null,null,0,0]
[null,null,null,null,null,null,null,null,null,null,null,null,null,null,null,null,null,null,null,null,null,null,null,null,null,null,null,null,0,0]
[null,null,null,null,null,null,null,null,null,null,null,null,null,null,null,null,null,null,null,null,null,null,null,null,null,null,null,null,0,0]
[null,null,null,null,null,null,null,null,null,null,null,null,null,null,null,null,null,null,null,null,null,null,null,null,null,null,null,null,0,0]
[null,null,null,null,null,null,null,null,null,null,null,null,null,null,null,null,null,null,null,null,null,null,null,null,null,null,null,null,0,0]
[null,null,null,null,null,null,null,null,null,null,null,null,null,null,null,null,null,null,null,null,null,null,null,null,null,null,null,null,0,0]
[null,null,null,null,null,null,null,null,null,null,null,null,null,null,null,null,null,null,null,null,null,null,null,null,null,null,null,null,0,0]
[null,null,null,null,null,null,null,null,null,null,null,null,null,null,null,null,null,null,null,null,null,null,null,null,null,null,null,null,0,0]
[null,null,null,null,null,null,null,null,null,null,null,null,null,null,null,null,null,null,null,null,null,null,null,null,null,null,null,null,0,0]
[null,null,null,null,null,null,null,null,null,null,null,null,null,null,null,null,null,null,null,null,null,null,null,null,null,null,null,null,0,0]
[null,null,null,null,null,null,null,null,null,null,null,null,null,null,null,null,null,null,null,null,null,null,null,null,null,null,null,null,0,0]
[null,null,null,null,null,null,null,null,null,null,null,null,null,null,null,null,null,null,null,null,null,null,null,null,null,null,null,null,0,0]
[null,null,null,null,null,null,null,null,null,null,null,null,null,null,null,null,null,null,null,null,null,null,null,null,null,null,null,null,0,0]
[null,null,null,null,null,null,null,null,null,null,null,null,null,null,null,null,null,null,null,null,null,null,null,null,null,null,null,null,0,0]
[null,null,null,null,null,null,null,null,null,null,null,null,null,null,null,null,null,null,null,null,null,null,null,null,null,null,null,null,0,0]
[null,null,null,null,null,null,null,null,null,null,null,null,null,null,null,null,null,null,null,null,null,null,null,null,null,null,null,null,0,0]
[null,null,null,null,null,null,null,null,null,null,null,null,null,null,null,null,null,null,null,null,null,null,null,null,null,null,null,null,0,0]
[null,null,null,null,null,null,null,null,null,null,null,null,null,null,null,null,null,null,null,null,null,null,null,null,null,null,null,null,0,0]
[null,null,null,null,null,null,null,null,null,null,null,null,null,null,null,null,null,null,null,null,null,null,null,null,null,null,null,null,0,0]
[null,null,null,null,null,null,null,null,null,null,null,null,null,null,null,null,null,null,null,null,null,null,null,null,null,null,null,null,0,0]
[null,null,null,null,null,null,null,null,null,null,null,null,null,null,null,null,null,null,null,null,null,null,null,null,null,null,null,null,0,0]
[null,null,null,null,null,null,null,null,null,null,null,null,null,null,null,null,null,null,null,null,null,null,null,null,null,null,null,null,0,0]
[null,null,null,null,null,null,null,null,null,null,null,null,null,null,null,null,null,null,null,null,null,null,null,null,null,null,null,null,0,0]
[null,null,null,null,null,null,null,null,null,null,null,null,null,null,null,null,null,null,null,null,null,null,null,null,null,null,null,null,0,0]
[null,null,null,null,null,null,null,null,null,null,null,null,null,null,null,null,null,null,null,null,null,null,null,null,null,null,null,null,0,0]
[null,null,null,null,null,null,null,null,null,null,null,null,null,null,null,null,null,null,null,null,null,null,null,null,null,null,null,null,0,0]
[null,null,null,null,null,null,null,null,null,null,null,null,null,null,null,null,null,null,null,null,null,null,null,null,null,null,null,null,0,0]
[null,null,null,null,null,null,null,null,null,null,null,null,null,null,null,null,null,null,null,null,null,null,null,null,null,null,null,null,0,0]
[null,null,null,null,null,null,null,null,null,null,null,null,null,null,null,null,null,null,null,null,null,null,null,null,null,null,null,null,0,0]
[null,null,null,null,null,null,null,null,null,null,null,null,null,null,null,null,null,null,null,null,null,null,null,null,null,null,null,null,{"$f":"IF(AA1218=0,0,_xlfn.DAYS(AA1218,TODAY()))","v":0},{"$f":"IF(AB1218=0,0,_xlfn.DAYS(AB1218,TODAY()))","v":0}]
[null,null,null,null,null,null,null,null,null,null,null,null,null,null,null,null,null,null,null,null,null,null,null,null,null,null,null,null,0,0]
[null,null,null,null,null,null,null,null,null,null,null,null,null,null,null,null,null,null,null,null,null,null,null,null,null,null,null,null,0,0]
[null,null,null,null,null,null,null,null,null,null,null,null,null,null,null,null,null,null,null,null,null,null,null,null,null,null,null,null,0,0]
[null,null,null,null,null,null,null,null,null,null,null,null,null,null,null,null,null,null,null,null,null,null,null,null,null,null,null,null,0,0]
[null,null,null,null,null,null,null,null,null,null,null,null,null,null,null,null,null,null,null,null,null,null,null,null,null,null,null,null,0,0]
[null,null,null,null,null,null,null,null,null,null,null,null,null,null,null,null,null,null,null,null,null,null,null,null,null,null,null,null,0,0]
[null,null,null,null,null,null,null,null,null,null,null,null,null,null,null,null,null,null,null,null,null,null,null,null,null,null,null,null,0,0]
[null,null,null,null,null,null,null,null,null,null,null,null,null,null,null,null,null,null,null,null,null,null,null,null,null,null,null,null,0,0]
[null,null,null,null,null,null,null,null,null,null,null,null,null,null,null,null,null,null,null,null,null,null,null,null,null,null,null,null,0,0]
[null,null,null,null,null,null,null,null,null,null,null,null,null,null,null,null,null,null,null,null,null,null,null,null,null,null,null,null,0,0]
[null,null,null,null,null,null,null,null,null,null,null,null,null,null,null,null,null,null,null,null,null,null,null,null,null,null,null,null,0,0]
[null,null,null,null,null,null,null,null,null,null,null,null,null,null,null,null,null,null,null,null,null,null,null,null,null,null,null,null,0,0]
[null,null,null,null,null,null,null,null,null,null,null,null,null,null,null,null,null,null,null,null,null,null,null,null,null,null,null,null,0,0]
[null,null,null,null,null,null,null,null,null,null,null,null,null,null,null,null,null,null,null,null,null,null,null,null,null,null,null,null,0,0]
[null,null,null,null,null,null,null,null,null,null,null,null,null,null,null,null,null,null,null,null,null,null,null,null,null,null,null,null,0,0]
[null,null,null,null,null,null,null,null,null,null,null,null,null,null,null,null,null,null,null,null,null,null,null,null,null,null,null,null,0,0]
[null,null,null,null,null,null,null,null,null,null,null,null,null,null,null,null,null,null,null,null,null,null,null,null,null,null,null,null,0,0]
[null,null,null,null,null,null,null,null,null,null,null,null,null,null,null,null,null,null,null,null,null,null,null,null,null,null,null,null,0,0]
[null,null,null,null,null,null,null,null,null,null,null,null,null,null,null,null,null,null,null,null,null,null,null,null,null,null,null,null,0,0]
[null,null,null,null,null,null,null,null,null,null,null,null,null,null,null,null,null,null,null,null,null,null,null,null,null,null,null,null,0,0]
[null,null,null,null,null,null,null,null,null,null,null,null,null,null,null,null,null,null,null,null,null,null,null,null,null,null,null,null,0,0]
[null,null,null,null,null,null,null,null,null,null,null,null,null,null,null,null,null,null,null,null,null,null,null,null,null,null,null,null,0,0]
[null,null,null,null,null,null,null,null,null,null,null,null,null,null,null,null,null,null,null,null,null,null,null,null,null,null,null,null,0,0]
[null,null,null,null,null,null,null,null,null,null,null,null,null,null,null,null,null,null,null,null,null,null,null,null,null,null,null,null,0,0]
[null,null,null,null,null,null,null,null,null,null,null,null,null,null,null,null,null,null,null,null,null,null,null,null,null,null,null,null,0,0]
[null,null,null,null,null,null,null,null,null,null,null,null,null,null,null,null,null,null,null,null,null,null,null,null,null,null,null,null,0,0]
[null,null,null,null,null,null,null,null,null,null,null,null,null,null,null,null,null,null,null,null,null,null,null,null,null,null,null,null,0,0]
[null,null,null,null,null,null,null,null,null,null,null,null,null,null,null,null,null,null,null,null,null,null,null,null,null,null,null,null,0,0]
[null,null,null,null,null,null,null,null,null,null,null,null,null,null,null,null,null,null,null,null,null,null,null,null,null,null,null,null,0,0]
[null,null,null,null,null,null,null,null,null,null,null,null,null,null,null,null,null,null,null,null,null,null,null,null,null,null,null,null,0,0]
[null,null,null,null,null,null,null,null,null,null,null,null,null,null,null,null,null,null,null,null,null,null,null,null,null,null,null,null,0,0]
[null,null,null,null,null,null,null,null,null,null,null,null,null,null,null,null,null,null,null,null,null,null,null,null,null,null,null,null,0,0]
[null,null,null,null,null,null,null,null,null,null,null,null,null,null,null,null,null,null,null,null,null,null,null,null,null,null,null,null,0,0]
[null,null,null,null,null,null,null,null,null,null,null,null,null,null,null,null,null,null,null,null,null,null,null,null,null,null,null,null,0,0]
[null,null,null,null,null,null,null,null,null,null,null,null,null,null,null,null,null,null,null,null,null,null,null,null,null,null,null,null,0,0]
[null,null,null,null,null,null,null,null,null,null,null,null,null,null,null,null,null,null,null,null,null,null,null,null,null,null,null,null,0,0]
[null,null,null,null,null,null,null,null,null,null,null,null,null,null,null,null,null,null,null,null,null,null,null,null,null,null,null,null,0,0]
[null,null,null,null,null,null,null,null,null,null,null,null,null,null,null,null,null,null,null,null,null,null,null,null,null,null,null,null,0,0]
[null,null,null,null,null,null,null,null,null,null,null,null,null,null,null,null,null,null,null,null,null,null,null,null,null,null,null,null,0,0]
[null,null,null,null,null,null,null,null,null,null,null,null,null,null,null,null,null,null,null,null,null,null,null,null,null,null,null,null,0,0]
[null,null,null,null,null,null,null,null,null,null,null,null,null,null,null,null,null,null,null,null,null,null,null,null,null,null,null,null,0,0]
[null,null,null,null,null,null,null,null,null,null,null,null,null,null,null,null,null,null,null,null,null,null,null,null,null,null,null,null,0,0]
[null,null,null,null,null,null,null,null,null,null,null,null,null,null,null,null,null,null,null,null,null,null,null,null,null,null,null,null,0,0]
[null,null,null,null,null,null,null,null,null,null,null,null,null,null,null,null,null,null,null,null,null,null,null,null,null,null,null,null,0,0]
[null,null,null,null,null,null,null,null,null,null,null,null,null,null,null,null,null,null,null,null,null,null,null,null,null,null,null,null,0,0]
[null,null,null,null,null,null,null,null,null,null,null,null,null,null,null,null,null,null,null,null,null,null,null,null,null,null,null,null,0,0]
[null,null,null,null,null,null,null,null,null,null,null,null,null,null,null,null,null,null,null,null,null,null,null,null,null,null,null,null,0,0]
[null,null,null,null,null,null,null,null,null,null,null,null,null,null,null,null,null,null,null,null,null,null,null,null,null,null,null,null,0,0]
[null,null,null,null,null,null,null,null,null,null,null,null,null,null,null,null,null,null,null,null,null,null,null,null,null,null,null,null,0,0]
[null,null,null,null,null,null,null,null,null,null,null,null,null,null,null,null,null,null,null,null,null,null,null,null,null,null,null,null,0,0]
[null,null,null,null,null,null,null,null,null,null,null,null,null,null,null,null,null,null,null,null,null,null,null,null,null,null,null,null,0,0]
[null,null,null,null,null,null,null,null,null,null,null,null,null,null,null,null,null,null,null,null,null,null,null,null,null,null,null,null,0,0]
[null,null,null,null,null,null,null,null,null,null,null,null,null,null,null,null,null,null,null,null,null,null,null,null,null,null,null,null,0,0]
[null,null,null,null,null,null,null,null,null,null,null,null,null,null,null,null,null,null,null,null,null,null,null,null,null,null,null,null,0,0]
[null,null,null,null,null,null,null,null,null,null,null,null,null,null,null,null,null,null,null,null,null,null,null,null,null,null,null,null,0,0]
[null,null,null,null,null,null,null,null,null,null,null,null,null,null,null,null,null,null,null,null,null,null,null,null,null,null,null,null,0,0]
[null,null,null,null,null,null,null,null,null,null,null,null,null,null,null,null,null,null,null,null,null,null,null,null,null,null,null,null,0,0]
[null,null,null,null,null,null,null,null,null,null,null,null,null,null,null,null,null,null,null,null,null,null,null,null,null,null,null,null,0,0]
[null,null,null,null,null,null,null,null,null,null,null,null,null,null,null,null,null,null,null,null,null,null,null,null,null,null,null,null,0,0]
[null,null,null,null,null,null,null,null,null,null,null,null,null,null,null,null,null,null,null,null,null,null,null,null,null,null,null,null,0,0]
[null,null,null,null,null,null,null,null,null,null,null,null,null,null,null,null,null,null,null,null,null,null,null,null,null,null,null,null,0,0]
[null,null,null,null,null,null,null,null,null,null,null,null,null,null,null,null,null,null,null,null,null,null,null,null,null,null,null,null,0,0]
[null,null,null,null,null,null,null,null,null,null,null,null,null,null,null,null,null,null,null,null,null,null,null,null,null,null,null,null,0,0]
[null,null,null,null,null,null,null,null,null,null,null,null,null,null,null,null,null,null,null,null,null,null,null,null,null,null,null,null,{"$f":"IF(AA1282=0,0,_xlfn.DAYS(AA1282,TODAY()))","v":0},{"$f":"IF(AB1282=0,0,_xlfn.DAYS(AB1282,TODAY()))","v":0}]
[null,null,null,null,null,null,null,null,null,null,null,null,null,null,null,null,null,null,null,null,null,null,null,null,null,null,null,null,0,0]
[null,null,null,null,null,null,null,null,null,null,null,null,null,null,null,null,null,null,null,null,null,null,null,null,null,null,null,null,0,0]
[null,null,null,null,null,null,null,null,null,null,null,null,null,null,null,null,null,null,null,null,null,null,null,null,null,null,null,null,0,0]
[null,null,null,null,null,null,null,null,null,null,null,null,null,null,null,null,null,null,null,null,null,null,null,null,null,null,null,null,0,0]
[null,null,null,null,null,null,null,null,null,null,null,null,null,null,null,null,null,null,null,null,null,null,null,null,null,null,null,null,0,0]
[null,null,null,null,null,null,null,null,null,null,null,null,null,null,null,null,null,null,null,null,null,null,null,null,null,null,null,null,0,0]
[null,null,null,null,null,null,null,null,null,null,null,null,null,null,null,null,null,null,null,null,null,null,null,null,null,null,null,null,0,0]
[null,null,null,null,null,null,null,null,null,null,null,null,null,null,null,null,null,null,null,null,null,null,null,null,null,null,null,null,0,0]
[null,null,null,null,null,null,null,null,null,null,null,null,null,null,null,null,null,null,null,null,null,null,null,null,null,null,null,null,0,0]
[null,null,null,null,null,null,null,null,null,null,null,null,null,null,null,null,null,null,null,null,null,null,null,null,null,null,null,null,0,0]
[null,null,null,null,null,null,null,null,null,null,null,null,null,null,null,null,null,null,null,null,null,null,null,null,null,null,null,null,0,0]
[null,null,null,null,null,null,null,null,null,null,null,null,null,null,null,null,null,null,null,null,null,null,null,null,null,null,null,null,0,0]
[null,null,null,null,null,null,null,null,null,null,null,null,null,null,null,null,null,null,null,null,null,null,null,null,null,null,null,null,0,0]
[null,null,null,null,null,null,null,null,null,null,null,null,null,null,null,null,null,null,null,null,null,null,null,null,null,null,null,null,0,0]
[null,null,null,null,null,null,null,null,null,null,null,null,null,null,null,null,null,null,null,null,null,null,null,null,null,null,null,null,0,0]
[null,null,null,null,null,null,null,null,null,null,null,null,null,null,null,null,null,null,null,null,null,null,null,null,null,null,null,null,0,0]
[null,null,null,null,null,null,null,null,null,null,null,null,null,null,null,null,null,null,null,null,null,null,null,null,null,null,null,null,0,0]
[null,null,null,null,null,null,null,null,null,null,null,null,null,null,null,null,null,null,null,null,null,null,null,null,null,null,null,null,0,0]
[null,null,null,null,null,null,null,null,null,null,null,null,null,null,null,null,null,null,null,null,null,null,null,null,null,null,null,null,0,0]
[null,null,null,null,null,null,null,null,null,null,null,null,null,null,null,null,null,null,null,null,null,null,null,null,null,null,null,null,0,0]
[null,null,null,null,null,null,null,null,null,null,null,null,null,null,null,null,null,null,null,null,null,null,null,null,null,null,null,null,0,0]
[null,null,null,null,null,null,null,null,null,null,null,null,null,null,null,null,null,null,null,null,null,null,null,null,null,null,null,null,0,0]
[null,null,null,null,null,null,null,null,null,null,null,null,null,null,null,null,null,null,null,null,null,null,null,null,null,null,null,null,0,0]
[null,null,null,null,null,null,null,null,null,null,null,null,null,null,null,null,null,null,null,null,null,null,null,null,null,null,null,null,0,0]
[null,null,null,null,null,null,null,null,null,null,null,null,null,null,null,null,null,null,null,null,null,null,null,null,null,null,null,null,0,0]
[null,null,null,null,null,null,null,null,null,null,null,null,null,null,null,null,null,null,null,null,null,null,null,null,null,null,null,null,0,0]
[null,null,null,null,null,null,null,null,null,null,null,null,null,null,null,null,null,null,null,null,null,null,null,null,null,null,null,null,0,0]
[null,null,null,null,null,null,null,null,null,null,null,null,null,null,null,null,null,null,null,null,null,null,null,null,null,null,null,null,0,0]
[null,null,null,null,null,null,null,null,null,null,null,null,null,null,null,null,null,null,null,null,null,null,null,null,null,null,null,null,0,0]
[null,null,null,null,null,null,null,null,null,null,null,null,null,null,null,null,null,null,null,null,null,null,null,null,null,null,null,null,0,0]
[null,null,null,null,null,null,null,null,null,null,null,null,null,null,null,null,null,null,null,null,null,null,null,null,null,null,null,null,0,0]
[null,null,null,null,null,null,null,null,null,null,null,null,null,null,null,null,null,null,null,null,null,null,null,null,null,null,null,null,0,0]
[null,null,null,null,null,null,null,null,null,null,null,null,null,null,null,null,null,null,null,null,null,null,null,null,null,null,null,null,0,0]
[null,null,null,null,null,null,null,null,null,null,null,null,null,null,null,null,null,null,null,null,null,null,null,null,null,null,null,null,0,0]
[null,null,null,null,null,null,null,null,null,null,null,null,null,null,null,null,null,null,null,null,null,null,null,null,null,null,null,null,0,0]
[null,null,null,null,null,null,null,null,null,null,null,null,null,null,null,null,null,null,null,null,null,null,null,null,null,null,null,null,0,0]
[null,null,null,null,null,null,null,null,null,null,null,null,null,null,null,null,null,null,null,null,null,null,null,null,null,null,null,null,0,0]
[null,null,null,null,null,null,null,null,null,null,null,null,null,null,null,null,null,null,null,null,null,null,null,null,null,null,null,null,0,0]
[null,null,null,null,null,null,null,null,null,null,null,null,null,null,null,null,null,null,null,null,null,null,null,null,null,null,null,null,0,0]
[null,null,null,null,null,null,null,null,null,null,null,null,null,null,null,null,null,null,null,null,null,null,null,null,null,null,null,null,0,0]
[null,null,null,null,null,null,null,null,null,null,null,null,null,null,null,null,null,null,null,null,null,null,null,null,null,null,null,null,0,0]
[null,null,null,null,null,null,null,null,null,null,null,null,null,null,null,null,null,null,null,null,null,null,null,null,null,null,null,null,0,0]
[null,null,null,null,null,null,null,null,null,null,null,null,null,null,null,null,null,null,null,null,null,null,null,null,null,null,null,null,0,0]
[null,null,null,null,null,null,null,null,null,null,null,null,null,null,null,null,null,null,null,null,null,null,null,null,null,null,null,null,0,0]
[null,null,null,null,null,null,null,null,null,null,null,null,null,null,null,null,null,null,null,null,null,null,null,null,null,null,null,null,0,0]
[null,null,null,null,null,null,null,null,null,null,null,null,null,null,null,null,null,null,null,null,null,null,null,null,null,null,null,null,0,0]
[null,null,null,null,null,null,null,null,null,null,null,null,null,null,null,null,null,null,null,null,null,null,null,null,null,null,null,null,0,0]
[null,null,null,null,null,null,null,null,null,null,null,null,null,null,null,null,null,null,null,null,null,null,null,null,null,null,null,null,0,0]
[null,null,null,null,null,null,null,null,null,null,null,null,null,null,null,null,null,null,null,null,null,null,null,null,null,null,null,null,0,0]
[null,null,null,null,null,null,null,null,null,null,null,null,null,null,null,null,null,null,null,null,null,null,null,null,null,null,null,null,0,0]
[null,null,null,null,null,null,null,null,null,null,null,null,null,null,null,null,null,null,null,null,null,null,null,null,null,null,null,null,0,0]
[null,null,null,null,null,null,null,null,null,null,null,null,null,null,null,null,null,null,null,null,null,null,null,null,null,null,null,null,0,0]
[null,null,null,null,null,null,null,null,null,null,null,null,null,null,null,null,null,null,null,null,null,null,null,null,null,null,null,null,0,0]
[null,null,null,null,null,null,null,null,null,null,null,null,null,null,null,null,null,null,null,null,null,null,null,null,null,null,null,null,0,0]
[null,null,null,null,null,null,null,null,null,null,null,null,null,null,null,null,null,null,null,null,null,null,null,null,null,null,null,null,0,0]
[null,null,null,null,null,null,null,null,null,null,null,null,null,null,null,null,null,null,null,null,null,null,null,null,null,null,null,null,0,0]
[null,null,null,null,null,null,null,null,null,null,null,null,null,null,null,null,null,null,null,null,null,null,null,null,null,null,null,null,0,0]
[null,null,null,null,null,null,null,null,null,null,null,null,null,null,null,null,null,null,null,null,null,null,null,null,null,null,null,null,0,0]
[null,null,null,null,null,null,null,null,null,null,null,null,null,null,null,null,null,null,null,null,null,null,null,null,null,null,null,null,0,0]
[null,null,null,null,null,null,null,null,null,null,null,null,null,null,null,null,null,null,null,null,null,null,null,null,null,null,null,null,0,0]
[null,null,null,null,null,null,null,null,null,null,null,null,null,null,null,null,null,null,null,null,null,null,null,null,null,null,null,null,0,0]
[null,null,null,null,null,null,null,null,null,null,null,null,null,null,null,null,null,null,null,null,null,null,null,null,null,null,null,null,0,0]
[null,null,null,null,null,null,null,null,null,null,null,null,null,null,null,null,null,null,null,null,null,null,null,null,null,null,null,null,0,0]
[null,null,null,null,null,null,null,null,null,null,null,null,null,null,null,null,null,null,null,null,null,null,null,null,null,null,null,null,{"$f":"IF(AA1346=0,0,_xlfn.DAYS(AA1346,TODAY()))","v":0},{"$f":"IF(AB1346=0,0,_xlfn.DAYS(AB1346,TODAY()))","v":0}]
[null,null,null,null,null,null,null,null,null,null,null,null,null,null,null,null,null,null,null,null,null,null,null,null,null,null,null,null,0,0]
[null,null,null,null,null,null,null,null,null,null,null,null,null,null,null,null,null,null,null,null,null,null,null,null,null,null,null,null,0,0]
[null,null,null,null,null,null,null,null,null,null,null,null,null,null,null,null,null,null,null,null,null,null,null,null,null,null,null,null,0,0]
[null,null,null,null,null,null,null,null,null,null,null,null,null,null,null,null,null,null,null,null,null,null,null,null,null,null,null,null,0,0]
[null,null,null,null,null,null,null,null,null,null,null,null,null,null,null,null,null,null,null,null,null,null,null,null,null,null,null,null,0,0]
[null,null,null,null,null,null,null,null,null,null,null,null,null,null,null,null,null,null,null,null,null,null,null,null,null,null,null,null,0,0]
[null,null,null,null,null,null,null,null,null,null,null,null,null,null,null,null,null,null,null,null,null,null,null,null,null,null,null,null,0,0]
[null,null,null,null,null,null,null,null,null,null,null,null,null,null,null,null,null,null,null,null,null,null,null,null,null,null,null,null,0,0]
[null,null,null,null,null,null,null,null,null,null,null,null,null,null,null,null,null,null,null,null,null,null,null,null,null,null,null,null,0,0]
[null,null,null,null,null,null,null,null,null,null,null,null,null,null,null,null,null,null,null,null,null,null,null,null,null,null,null,null,0,0]
[null,null,null,null,null,null,null,null,null,null,null,null,null,null,null,null,null,null,null,null,null,null,null,null,null,null,null,null,0,0]
[null,null,null,null,null,null,null,null,null,null,null,null,null,null,null,null,null,null,null,null,null,null,null,null,null,null,null,null,0,0]
[null,null,null,null,null,null,null,null,null,null,null,null,null,null,null,null,null,null,null,null,null,null,null,null,null,null,null,null,0,0]
[null,null,null,null,null,null,null,null,null,null,null,null,null,null,null,null,null,null,null,null,null,null,null,null,null,null,null,null,0,0]
[null,null,null,null,null,null,null,null,null,null,null,null,null,null,null,null,null,null,null,null,null,null,null,null,null,null,null,null,0,0]
[null,null,null,null,null,null,null,null,null,null,null,null,null,null,null,null,null,null,null,null,null,null,null,null,null,null,null,null,0,0]
[null,null,null,null,null,null,null,null,null,null,null,null,null,null,null,null,null,null,null,null,null,null,null,null,null,null,null,null,0,0]
[null,null,null,null,null,null,null,null,null,null,null,null,null,null,null,null,null,null,null,null,null,null,null,null,null,null,null,null,0,0]
[null,null,null,null,null,null,null,null,null,null,null,null,null,null,null,null,null,null,null,null,null,null,null,null,null,null,null,null,0,0]
[null,null,null,null,null,null,null,null,null,null,null,null,null,null,null,null,null,null,null,null,null,null,null,null,null,null,null,null,0,0]
[null,null,null,null,null,null,null,null,null,null,null,null,null,null,null,null,null,null,null,null,null,null,null,null,null,null,null,null,0,0]
[null,null,null,null,null,null,null,null,null,null,null,null,null,null,null,null,null,null,null,null,null,null,null,null,null,null,null,null,0,0]
[null,null,null,null,null,null,null,null,null,null,null,null,null,null,null,null,null,null,null,null,null,null,null,null,null,null,null,null,0,0]
[null,null,null,null,null,null,null,null,null,null,null,null,null,null,null,null,null,null,null,null,null,null,null,null,null,null,null,null,0,0]
[null,null,null,null,null,null,null,null,null,null,null,null,null,null,null,null,null,null,null,null,null,null,null,null,null,null,null,null,0,0]
[null,null,null,null,null,null,null,null,null,null,null,null,null,null,null,null,null,null,null,null,null,null,null,null,null,null,null,null,0,0]
[null,null,null,null,null,null,null,null,null,null,null,null,null,null,null,null,null,null,null,null,null,null,null,null,null,null,null,null,0,0]
[null,null,null,null,null,null,null,null,null,null,null,null,null,null,null,null,null,null,null,null,null,null,null,null,null,null,null,null,0,0]
[null,null,null,null,null,null,null,null,null,null,null,null,null,null,null,null,null,null,null,null,null,null,null,null,null,null,null,null,0,0]
[null,null,null,null,null,null,null,null,null,null,null,null,null,null,null,null,null,null,null,null,null,null,null,null,null,null,null,null,0,0]
[null,null,null,null,null,null,null,null,null,null,null,null,null,null,null,null,null,null,null,null,null,null,null,null,null,null,null,null,0,0]
[null,null,null,null,null,null,null,null,null,null,null,null,null,null,null,null,null,null,null,null,null,null,null,null,null,null,null,null,0,0]
[null,null,null,null,null,null,null,null,null,null,null,null,null,null,null,null,null,null,null,null,null,null,null,null,null,null,null,null,0,0]
[null,null,null,null,null,null,null,null,null,null,null,null,null,null,null,null,null,null,null,null,null,null,null,null,null,null,null,null,0,0]
[null,null,null,null,null,null,null,null,null,null,null,null,null,null,null,null,null,null,null,null,null,null,null,null,null,null,null,null,0,0]
[null,null,null,null,null,null,null,null,null,null,null,null,null,null,null,null,null,null,null,null,null,null,null,null,null,null,null,null,0,0]
[null,null,null,null,null,null,null,null,null,null,null,null,null,null,null,null,null,null,null,null,null,null,null,null,null,null,null,null,0,0]
[null,null,null,null,null,null,null,null,null,null,null,null,null,null,null,null,null,null,null,null,null,null,null,null,null,null,null,null,0,0]
[null,null,null,null,null,null,null,null,null,null,null,null,null,null,null,null,null,null,null,null,null,null,null,null,null,null,null,null,0,0]
[null,null,null,null,null,null,null,null,null,null,null,null,null,null,null,null,null,null,null,null,null,null,null,null,null,null,null,null,0,0]
[null,null,null,null,null,null,null,null,null,null,null,null,null,null,null,null,null,null,null,null,null,null,null,null,null,null,null,null,0,0]
[null,null,null,null,null,null,null,null,null,null,null,null,null,null,null,null,null,null,null,null,null,null,null,null,null,null,null,null,0,0]
[null,null,null,null,null,null,null,null,null,null,null,null,null,null,null,null,null,null,null,null,null,null,null,null,null,null,null,null,0,0]
[null,null,null,null,null,null,null,null,null,null,null,null,null,null,null,null,null,null,null,null,null,null,null,null,null,null,null,null,0,0]
[null,null,null,null,null,null,null,null,null,null,null,null,null,null,null,null,null,null,null,null,null,null,null,null,null,null,null,null,0,0]
[null,null,null,null,null,null,null,null,null,null,null,null,null,null,null,null,null,null,null,null,null,null,null,null,null,null,null,null,0,0]
[null,null,null,null,null,null,null,null,null,null,null,null,null,null,null,null,null,null,null,null,null,null,null,null,null,null,null,null,0,0]
[null,null,null,null,null,null,null,null,null,null,null,null,null,null,null,null,null,null,null,null,null,null,null,null,null,null,null,null,0,0]
[null,null,null,null,null,null,null,null,null,null,null,null,null,null,null,null,null,null,null,null,null,null,null,null,null,null,null,null,0,0]
[null,null,null,null,null,null,null,null,null,null,null,null,null,null,null,null,null,null,null,null,null,null,null,null,null,null,null,null,0,0]
[null,null,null,null,null,null,null,null,null,null,null,null,null,null,null,null,null,null,null,null,null,null,null,null,null,null,null,null,0,0]
[null,null,null,null,null,null,null,null,null,null,null,null,null,null,null,null,null,null,null,null,null,null,null,null,null,null,null,null,0,0]
[null,null,null,null,null,null,null,null,null,null,null,null,null,null,null,null,null,null,null,null,null,null,null,null,null,null,null,null,0,0]
[null,null,null,null,null,null,null,null,null,null,null,null,null,null,null,null,null,null,null,null,null,null,null,null,null,null,null,null,0,0]
[null,null,null,null,null,null,null,null,null,null,null,null,null,null,null,null,null,null,null,null,null,null,null,null,null,null,null,null,0,0]
[null,null,null,null,null,null,null,null,null,null,null,null,null,null,null,null,null,null,null,null,null,null,null,null,null,null,null,null,0,0]
[null,null,null,null,null,null,null,null,null,null,null,null,null,null,null,null,null,null,null,null,null,null,null,null,null,null,null,null,0,0]
[null,null,null,null,null,null,null,null,null,null,null,null,null,null,null,null,null,null,null,null,null,null,null,null,null,null,null,null,0,0]
[null,null,null,null,null,null,null,null,null,null,null,null,null,null,null,null,null,null,null,null,null,null,null,null,null,null,null,null,0,0]
[null,null,null,null,null,null,null,null,null,null,null,null,null,null,null,null,null,null,null,null,null,null,null,null,null,null,null,null,0,0]
[null,null,null,null,null,null,null,null,null,null,null,null,null,null,null,null,null,null,null,null,null,null,null,null,null,null,null,null,0,0]
[null,null,null,null,null,null,null,null,null,null,null,null,null,null,null,null,null,null,null,null,null,null,null,null,null,null,null,null,0,0]
[null,null,null,null,null,null,null,null,null,null,null,null,null,null,null,null,null,null,null,null,null,null,null,null,null,null,null,null,0,0]
[null,null,null,null,null,null,null,null,null,null,null,null,null,null,null,null,null,null,null,null,null,null,null,null,null,null,null,null,{"$f":"IF(AA1410=0,0,_xlfn.DAYS(AA1410,TODAY()))","v":0},{"$f":"IF(AB1410=0,0,_xlfn.DAYS(AB1410,TODAY()))","v":0}]
[null,null,null,null,null,null,null,null,null,null,null,null,null,null,null,null,null,null,null,null,null,null,null,null,null,null,null,null,0,0]
[null,null,null,null,null,null,null,null,null,null,null,null,null,null,null,null,null,null,null,null,null,null,null,null,null,null,null,null,0,0]
[null,null,null,null,null,null,null,null,null,null,null,null,null,null,null,null,null,null,null,null,null,null,null,null,null,null,null,null,0,0]
[null,null,null,null,null,null,null,null,null,null,null,null,null,null,null,null,null,null,null,null,null,null,null,null,null,null,null,null,0,0]
[null,null,null,null,null,null,null,null,null,null,null,null,null,null,null,null,null,null,null,null,null,null,null,null,null,null,null,null,0,0]
[null,null,null,null,null,null,null,null,null,null,null,null,null,null,null,null,null,null,null,null,null,null,null,null,null,null,null,null,0,0]
[null,null,null,null,null,null,null,null,null,null,null,null,null,null,null,null,null,null,null,null,null,null,null,null,null,null,null,null,0,0]
[null,null,null,null,null,null,null,null,null,null,null,null,null,null,null,null,null,null,null,null,null,null,null,null,null,null,null,null,0,0]
[null,null,null,null,null,null,null,null,null,null,null,null,null,null,null,null,null,null,null,null,null,null,null,null,null,null,null,null,0,0]
[null,null,null,null,null,null,null,null,null,null,null,null,null,null,null,null,null,null,null,null,null,null,null,null,null,null,null,null,0,0]
[null,null,null,null,null,null,null,null,null,null,null,null,null,null,null,null,null,null,null,null,null,null,null,null,null,null,null,null,0,0]
[null,null,null,null,null,null,null,null,null,null,null,null,null,null,null,null,null,null,null,null,null,null,null,null,null,null,null,null,0,0]
[null,null,null,null,null,null,null,null,null,null,null,null,null,null,null,null,null,null,null,null,null,null,null,null,null,null,null,null,0,0]
[null,null,null,null,null,null,null,null,null,null,null,null,null,null,null,null,null,null,null,null,null,null,null,null,null,null,null,null,0,0]
[null,null,null,null,null,null,null,null,null,null,null,null,null,null,null,null,null,null,null,null,null,null,null,null,null,null,null,null,0,0]
[null,null,null,null,null,null,null,null,null,null,null,null,null,null,null,null,null,null,null,null,null,null,null,null,null,null,null,null,0,0]
[null,null,null,null,null,null,null,null,null,null,null,null,null,null,null,null,null,null,null,null,null,null,null,null,null,null,null,null,0,0]
[null,null,null,null,null,null,null,null,null,null,null,null,null,null,null,null,null,null,null,null,null,null,null,null,null,null,null,null,0,0]
[null,null,null,null,null,null,null,null,null,null,null,null,null,null,null,null,null,null,null,null,null,null,null,null,null,null,null,null,0,0]
[null,null,null,null,null,null,null,null,null,null,null,null,null,null,null,null,null,null,null,null,null,null,null,null,null,null,null,null,0,0]
[null,null,null,null,null,null,null,null,null,null,null,null,null,null,null,null,null,null,null,null,null,null,null,null,null,null,null,null,0,0]
[null,null,null,null,null,null,null,null,null,null,null,null,null,null,null,null,null,null,null,null,null,null,null,null,null,null,null,null,0,0]
[null,null,null,null,null,null,null,null,null,null,null,null,null,null,null,null,null,null,null,null,null,null,null,null,null,null,null,null,0,0]
[null,null,null,null,null,null,null,null,null,null,null,null,null,null,null,null,null,null,null,null,null,null,null,null,null,null,null,null,0,0]
[null,null,null,null,null,null,null,null,null,null,null,null,null,null,null,null,null,null,null,null,null,null,null,null,null,null,null,null,0,0]
[null,null,null,null,null,null,null,null,null,null,null,null,null,null,null,null,null,null,null,null,null,null,null,null,null,null,null,null,0,0]
[null,null,null,null,null,null,null,null,null,null,null,null,null,null,null,null,null,null,null,null,null,null,null,null,null,null,null,null,0,0]
[null,null,null,null,null,null,null,null,null,null,null,null,null,null,null,null,null,null,null,null,null,null,null,null,null,null,null,null,0,0]
[null,null,null,null,null,null,null,null,null,null,null,null,null,null,null,null,null,null,null,null,null,null,null,null,null,null,null,null,0,0]
[null,null,null,null,null,null,null,null,null,null,null,null,null,null,null,null,null,null,null,null,null,null,null,null,null,null,null,null,0,0]
[null,null,null,null,null,null,null,null,null,null,null,null,null,null,null,null,null,null,null,null,null,null,null,null,null,null,null,null,0,0]
[null,null,null,null,null,null,null,null,null,null,null,null,null,null,null,null,null,null,null,null,null,null,null,null,null,null,null,null,0,0]
[null,null,null,null,null,null,null,null,null,null,null,null,null,null,null,null,null,null,null,null,null,null,null,null,null,null,null,null,0,0]
[null,null,null,null,null,null,null,null,null,null,null,null,null,null,null,null,null,null,null,null,null,null,null,null,null,null,null,null,0,0]
[null,null,null,null,null,null,null,null,null,null,null,null,null,null,null,null,null,null,null,null,null,null,null,null,null,null,null,null,0,0]
[null,null,null,null,null,null,null,null,null,null,null,null,null,null,null,null,null,null,null,null,null,null,null,null,null,null,null,null,0,0]
[null,null,null,null,null,null,null,null,null,null,null,null,null,null,null,null,null,null,null,null,null,null,null,null,null,null,null,null,0,0]
[null,null,null,null,null,null,null,null,null,null,null,null,null,null,null,null,null,null,null,null,null,null,null,null,null,null,null,null,0,0]
[null,null,null,null,null,null,null,null,null,null,null,null,null,null,null,null,null,null,null,null,null,null,null,null,null,null,null,null,0,0]
[null,null,null,null,null,null,null,null,null,null,null,null,null,null,null,null,null,null,null,null,null,null,null,null,null,null,null,null,0,0]
[null,null,null,null,null,null,null,null,null,null,null,null,null,null,null,null,null,null,null,null,null,null,null,null,null,null,null,null,0,0]
[null,null,null,null,null,null,null,null,null,null,null,null,null,null,null,null,null,null,null,null,null,null,null,null,null,null,null,null,0,0]
[null,null,null,null,null,null,null,null,null,null,null,null,null,null,null,null,null,null,null,null,null,null,null,null,null,null,null,null,0,0]
[null,null,null,null,null,null,null,null,null,null,null,null,null,null,null,null,null,null,null,null,null,null,null,null,null,null,null,null,0,0]
[null,null,null,null,null,null,null,null,null,null,null,null,null,null,null,null,null,null,null,null,null,null,null,null,null,null,null,null,0,0]
[null,null,null,null,null,null,null,null,null,null,null,null,null,null,null,null,null,null,null,null,null,null,null,null,null,null,null,null,0,0]
[null,null,null,null,null,null,null,null,null,null,null,null,null,null,null,null,null,null,null,null,null,null,null,null,null,null,null,null,0,0]
[null,null,null,null,null,null,null,null,null,null,null,null,null,null,null,null,null,null,null,null,null,null,null,null,null,null,null,null,0,0]
[null,null,null,null,null,null,null,null,null,null,null,null,null,null,null,null,null,null,null,null,null,null,null,null,null,null,null,null,0,0]
[null,null,null,null,null,null,null,null,null,null,null,null,null,null,null,null,null,null,null,null,null,null,null,null,null,null,null,null,0,0]
[null,null,null,null,null,null,null,null,null,null,null,null,null,null,null,null,null,null,null,null,null,null,null,null,null,null,null,null,0,0]
[null,null,null,null,null,null,null,null,null,null,null,null,null,null,null,null,null,null,null,null,null,null,null,null,null,null,null,null,0,0]
[null,null,null,null,null,null,null,null,null,null,null,null,null,null,null,null,null,null,null,null,null,null,null,null,null,null,null,null,0,0]
[null,null,null,null,null,null,null,null,null,null,null,null,null,null,null,null,null,null,null,null,null,null,null,null,null,null,null,null,0,0]
[null,null,null,null,null,null,null,null,null,null,null,null,null,null,null,null,null,null,null,null,null,null,null,null,null,null,null,null,0,0]
[null,null,null,null,null,null,null,null,null,null,null,null,null,null,null,null,null,null,null,null,null,null,null,null,null,null,null,null,0,0]
[null,null,null,null,null,null,null,null,null,null,null,null,null,null,null,null,null,null,null,null,null,null,null,null,null,null,null,null,0,0]
[null,null,null,null,null,null,null,null,null,null,null,null,null,null,null,null,null,null,null,null,null,null,null,null,null,null,null,null,0,0]
[null,null,null,null,null,null,null,null,null,null,null,null,null,null,null,null,null,null,null,null,null,null,null,null,null,null,null,null,0,0]
[null,null,null,null,null,null,null,null,null,null,null,null,null,null,null,null,null,null,null,null,null,null,null,null,null,null,null,null,0,0]
[null,null,null,null,null,null,null,null,null,null,null,null,null,null,null,null,null,null,null,null,null,null,null,null,null,null,null,null,0,0]
[null,null,null,null,null,null,null,null,null,null,null,null,null,null,null,null,null,null,null,null,null,null,null,null,null,null,null,null,0,0]
[null,null,null,null,null,null,null,null,null,null,null,null,null,null,null,null,null,null,null,null,null,null,null,null,null,null,null,null,0,0]
[null,null,null,null,null,null,null,null,null,null,null,null,null,null,null,null,null,null,null,null,null,null,null,null,null,null,null,null,{"$f":"IF(AA1474=0,0,_xlfn.DAYS(AA1474,TODAY()))","v":0},{"$f":"IF(AB1474=0,0,_xlfn.DAYS(AB1474,TODAY()))","v":0}]
[null,null,null,null,null,null,null,null,null,null,null,null,null,null,null,null,null,null,null,null,null,null,null,null,null,null,null,null,0,0]
[null,null,null,null,null,null,null,null,null,null,null,null,null,null,null,null,null,null,null,null,null,null,null,null,null,null,null,null,0,0]
[null,null,null,null,null,null,null,null,null,null,null,null,null,null,null,null,null,null,null,null,null,null,null,null,null,null,null,null,0,0]
[null,null,null,null,null,null,null,null,null,null,null,null,null,null,null,null,null,null,null,null,null,null,null,null,null,null,null,null,0,0]
[null,null,null,null,null,null,null,null,null,null,null,null,null,null,null,null,null,null,null,null,null,null,null,null,null,null,null,null,0,0]
[null,null,null,null,null,null,null,null,null,null,null,null,null,null,null,null,null,null,null,null,null,null,null,null,null,null,null,null,0,0]
[null,null,null,null,null,null,null,null,null,null,null,null,null,null,null,null,null,null,null,null,null,null,null,null,null,null,null,null,0,0]
[null,null,null,null,null,null,null,null,null,null,null,null,null,null,null,null,null,null,null,null,null,null,null,null,null,null,null,null,0,0]
[null,null,null,null,null,null,null,null,null,null,null,null,null,null,null,null,null,null,null,null,null,null,null,null,null,null,null,null,0,0]
[null,null,null,null,null,null,null,null,null,null,null,null,null,null,null,null,null,null,null,null,null,null,null,null,null,null,null,null,0,0]
[null,null,null,null,null,null,null,null,null,null,null,null,null,null,null,null,null,null,null,null,null,null,null,null,null,null,null,null,0,0]
[null,null,null,null,null,null,null,null,null,null,null,null,null,null,null,null,null,null,null,null,null,null,null,null,null,null,null,null,0,0]
[null,null,null,null,null,null,null,null,null,null,null,null,null,null,null,null,null,null,null,null,null,null,null,null,null,null,null,null,0,0]
[null,null,null,null,null,null,null,null,null,null,null,null,null,null,null,null,null,null,null,null,null,null,null,null,null,null,null,null,0,0]
[null,null,null,null,null,null,null,null,null,null,null,null,null,null,null,null,null,null,null,null,null,null,null,null,null,null,null,null,0,0]
[null,null,null,null,null,null,null,null,null,null,null,null,null,null,null,null,null,null,null,null,null,null,null,null,null,null,null,null,0,0]
[null,null,null,null,null,null,null,null,null,null,null,null,null,null,null,null,null,null,null,null,null,null,null,null,null,null,null,null,0,0]
[null,null,null,null,null,null,null,null,null,null,null,null,null,null,null,null,null,null,null,null,null,null,null,null,null,null,null,null,0,0]
[null,null,null,null,null,null,null,null,null,null,null,null,null,null,null,null,null,null,null,null,null,null,null,null,null,null,null,null,0,0]
[null,null,null,null,null,null,null,null,null,null,null,null,null,null,null,null,null,null,null,null,null,null,null,null,null,null,null,null,0,0]
[null,null,null,null,null,null,null,null,null,null,null,null,null,null,null,null,null,null,null,null,null,null,null,null,null,null,null,null,0,0]
[null,null,null,null,null,null,null,null,null,null,null,null,null,null,null,null,null,null,null,null,null,null,null,null,null,null,null,null,0,0]
[null,null,null,null,null,null,null,null,null,null,null,null,null,null,null,null,null,null,null,null,null,null,null,null,null,null,null,null,0,0]
[null,null,null,null,null,null,null,null,null,null,null,null,null,null,null,null,null,null,null,null,null,null,null,null,null,null,null,null,0,0]
[null,null,null,null,null,null,null,null,null,null,null,null,null,null,null,null,null,null,null,null,null,null,null,null,null,null,null,null,0,0]
[null,null,null,null,null,null,null,null,null,null,null,null,null,null,null,null,null,null,null,null,null,null,null,null,null,null,null,null,0,0]
[null,null,null,null,null,null,null,null,null,null,null,null,null,null,null,null,null,null,null,null,null,null,null,null,null,null,null,null,0,0]
[null,null,null,null,null,null,null,null,null,null,null,null,null,null,null,null,null,null,null,null,null,null,null,null,null,null,null,null,0,0]
[null,null,null,null,null,null,null,null,null,null,null,null,null,null,null,null,null,null,null,null,null,null,null,null,null,null,null,null,0,0]
[null,null,null,null,null,null,null,null,null,null,null,null,null,null,null,null,null,null,null,null,null,null,null,null,null,null,null,null,0,0]
[null,null,null,null,null,null,null,null,null,null,null,null,null,null,null,null,null,null,null,null,null,null,null,null,null,null,null,null,0,0]
[null,null,null,null,null,null,null,null,null,null,null,null,null,null,null,null,null,null,null,null,null,null,null,null,null,null,null,null,0,0]
[null,null,null,null,null,null,null,null,null,null,null,null,null,null,null,null,null,null,null,null,null,null,null,null,null,null,null,null,0,0]
[null,null,null,null,null,null,null,null,null,null,null,null,null,null,null,null,null,null,null,null,null,null,null,null,null,null,null,null,0,0]
[null,null,null,null,null,null,null,null,null,null,null,null,null,null,null,null,null,null,null,null,null,null,null,null,null,null,null,null,0,0]
[null,null,null,null,null,null,null,null,null,null,null,null,null,null,null,null,null,null,null,null,null,null,null,null,null,null,null,null,0,0]
[null,null,null,null,null,null,null,null,null,null,null,null,null,null,null,null,null,null,null,null,null,null,null,null,null,null,null,null,0,0]
[null,null,null,null,null,null,null,null,null,null,null,null,null,null,null,null,null,null,null,null,null,null,null,null,null,null,null,null,0,0]
[null,null,null,null,null,null,null,null,null,null,null,null,null,null,null,null,null,null,null,null,null,null,null,null,null,null,null,null,0,0]
[null,null,null,null,null,null,null,null,null,null,null,null,null,null,null,null,null,null,null,null,null,null,null,null,null,null,null,null,0,0]
[null,null,null,null,null,null,null,null,null,null,null,null,null,null,null,null,null,null,null,null,null,null,null,null,null,null,null,null,0,0]
[null,null,null,null,null,null,null,null,null,null,null,null,null,null,null,null,null,null,null,null,null,null,null,null,null,null,null,null,0,0]
[null,null,null,null,null,null,null,null,null,null,null,null,null,null,null,null,null,null,null,null,null,null,null,null,null,null,null,null,0,0]
[null,null,null,null,null,null,null,null,null,null,null,null,null,null,null,null,null,null,null,null,null,null,null,null,null,null,null,null,0,0]
[null,null,null,null,null,null,null,null,null,null,null,null,null,null,null,null,null,null,null,null,null,null,null,null,null,null,null,null,0,0]
[null,null,null,null,null,null,null,null,null,null,null,null,null,null,null,null,null,null,null,null,null,null,null,null,null,null,null,null,0,0]
[null,null,null,null,null,null,null,null,null,null,null,null,null,null,null,null,null,null,null,null,null,null,null,null,null,null,null,null,0,0]
[null,null,null,null,null,null,null,null,null,null,null,null,null,null,null,null,null,null,null,null,null,null,null,null,null,null,null,null,0,0]
[null,null,null,null,null,null,null,null,null,null,null,null,null,null,null,null,null,null,null,null,null,null,null,null,null,null,null,null,0,0]
[null,null,null,null,null,null,null,null,null,null,null,null,null,null,null,null,null,null,null,null,null,null,null,null,null,null,null,null,0,0]
[null,null,null,null,null,null,null,null,null,null,null,null,null,null,null,null,null,null,null,null,null,null,null,null,null,null,null,null,0,0]
[null,null,null,null,null,null,null,null,null,null,null,null,null,null,null,null,null,null,null,null,null,null,null,null,null,null,null,null,0,0]
[null,null,null,null,null,null,null,null,null,null,null,null,null,null,null,null,null,null,null,null,null,null,null,null,null,null,null,null,0,0]
[null,null,null,null,null,null,null,null,null,null,null,null,null,null,null,null,null,null,null,null,null,null,null,null,null,null,null,null,0,0]
[null,null,null,null,null,null,null,null,null,null,null,null,null,null,null,null,null,null,null,null,null,null,null,null,null,null,null,null,0,0]
[null,null,null,null,null,null,null,null,null,null,null,null,null,null,null,null,null,null,null,null,null,null,null,null,null,null,null,null,0,0]
[null,null,null,null,null,null,null,null,null,null,null,null,null,null,null,null,null,null,null,null,null,null,null,null,null,null,null,null,0,0]
[null,null,null,null,null,null,null,null,null,null,null,null,null,null,null,null,null,null,null,null,null,null,null,null,null,null,null,null,0,0]
[null,null,null,null,null,null,null,null,null,null,null,null,null,null,null,null,null,null,null,null,null,null,null,null,null,null,null,null,0,0]
[null,null,null,null,null,null,null,null,null,null,null,null,null,null,null,null,null,null,null,null,null,null,null,null,null,null,null,null,0,0]
[null,null,null,null,null,null,null,null,null,null,null,null,null,null,null,null,null,null,null,null,null,null,null,null,null,null,null,null,0,0]
[null,null,null,null,null,null,null,null,null,null,null,null,null,null,null,null,null,null,null,null,null,null,null,null,null,null,null,null,0,0]
[null,null,null,null,null,null,null,null,null,null,null,null,null,null,null,null,null,null,null,null,null,null,null,null,null,null,null,null,0,0]
[null,null,null,null,null,null,null,null,null,null,null,null,null,null,null,null,null,null,null,null,null,null,null,null,null,null,null,null,{"$f":"IF(AA1538=0,0,_xlfn.DAYS(AA1538,TODAY()))","v":0},{"$f":"IF(AB1538=0,0,_xlfn.DAYS(AB1538,TODAY()))","v":0}]
[null,null,null,null,null,null,null,null,null,null,null,null,null,null,null,null,null,null,null,null,null,null,null,null,null,null,null,null,0,0]
[null,null,null,null,null,null,null,null,null,null,null,null,null,null,null,null,null,null,null,null,null,null,null,null,null,null,null,null,0,0]
[null,null,null,null,null,null,null,null,null,null,null,null,null,null,null,null,null,null,null,null,null,null,null,null,null,null,null,null,0,0]
[null,null,null,null,null,null,null,null,null,null,null,null,null,null,null,null,null,null,null,null,null,null,null,null,null,null,null,null,0,0]
[null,null,null,null,null,null,null,null,null,null,null,null,null,null,null,null,null,null,null,null,null,null,null,null,null,null,null,null,0,0]
[null,null,null,null,null,null,null,null,null,null,null,null,null,null,null,null,null,null,null,null,null,null,null,null,null,null,null,null,0,0]
[null,null,null,null,null,null,null,null,null,null,null,null,null,null,null,null,null,null,null,null,null,null,null,null,null,null,null,null,0,0]
[null,null,null,null,null,null,null,null,null,null,null,null,null,null,null,null,null,null,null,null,null,null,null,null,null,null,null,null,0,0]
[null,null,null,null,null,null,null,null,null,null,null,null,null,null,null,null,null,null,null,null,null,null,null,null,null,null,null,null,0,0]
[null,null,null,null,null,null,null,null,null,null,null,null,null,null,null,null,null,null,null,null,null,null,null,null,null,null,null,null,0,0]
[null,null,null,null,null,null,null,null,null,null,null,null,null,null,null,null,null,null,null,null,null,null,null,null,null,null,null,null,0,0]
[null,null,null,null,null,null,null,null,null,null,null,null,null,null,null,null,null,null,null,null,null,null,null,null,null,null,null,null,0,0]
[null,null,null,null,null,null,null,null,null,null,null,null,null,null,null,null,null,null,null,null,null,null,null,null,null,null,null,null,0,0]
[null,null,null,null,null,null,null,null,null,null,null,null,null,null,null,null,null,null,null,null,null,null,null,null,null,null,null,null,0,0]
[null,null,null,null,null,null,null,null,null,null,null,null,null,null,null,null,null,null,null,null,null,null,null,null,null,null,null,null,0,0]
[null,null,null,null,null,null,null,null,null,null,null,null,null,null,null,null,null,null,null,null,null,null,null,null,null,null,null,null,0,0]
[null,null,null,null,null,null,null,null,null,null,null,null,null,null,null,null,null,null,null,null,null,null,null,null,null,null,null,null,0,0]
[null,null,null,null,null,null,null,null,null,null,null,null,null,null,null,null,null,null,null,null,null,null,null,null,null,null,null,null,0,0]
[null,null,null,null,null,null,null,null,null,null,null,null,null,null,null,null,null,null,null,null,null,null,null,null,null,null,null,null,0,0]
[null,null,null,null,null,null,null,null,null,null,null,null,null,null,null,null,null,null,null,null,null,null,null,null,null,null,null,null,0,0]
[null,null,null,null,null,null,null,null,null,null,null,null,null,null,null,null,null,null,null,null,null,null,null,null,null,null,null,null,0,0]
[null,null,null,null,null,null,null,null,null,null,null,null,null,null,null,null,null,null,null,null,null,null,null,null,null,null,null,null,0,0]
[null,null,null,null,null,null,null,null,null,null,null,null,null,null,null,null,null,null,null,null,null,null,null,null,null,null,null,null,0,0]
[null,null,null,null,null,null,null,null,null,null,null,null,null,null,null,null,null,null,null,null,null,null,null,null,null,null,null,null,0,0]
[null,null,null,null,null,null,null,null,null,null,null,null,null,null,null,null,null,null,null,null,null,null,null,null,null,null,null,null,0,0]
[null,null,null,null,null,null,null,null,null,null,null,null,null,null,null,null,null,null,null,null,null,null,null,null,null,null,null,null,0,0]
[null,null,null,null,null,null,null,null,null,null,null,null,null,null,null,null,null,null,null,null,null,null,null,null,null,null,null,null,0,0]
[null,null,null,null,null,null,null,null,null,null,null,null,null,null,null,null,null,null,null,null,null,null,null,null,null,null,null,null,0,0]
[null,null,null,null,null,null,null,null,null,null,null,null,null,null,null,null,null,null,null,null,null,null,null,null,null,null,null,null,0,0]
[null,null,null,null,null,null,null,null,null,null,null,null,null,null,null,null,null,null,null,null,null,null,null,null,null,null,null,null,0,0]
[null,null,null,null,null,null,null,null,null,null,null,null,null,null,null,null,null,null,null,null,null,null,null,null,null,null,null,null,0,0]
[null,null,null,null,null,null,null,null,null,null,null,null,null,null,null,null,null,null,null,null,null,null,null,null,null,null,null,null,0,0]
[null,null,null,null,null,null,null,null,null,null,null,null,null,null,null,null,null,null,null,null,null,null,null,null,null,null,null,null,0,0]
[null,null,null,null,null,null,null,null,null,null,null,null,null,null,null,null,null,null,null,null,null,null,null,null,null,null,null,null,0,0]
[null,null,null,null,null,null,null,null,null,null,null,null,null,null,null,null,null,null,null,null,null,null,null,null,null,null,null,null,0,0]
[null,null,null,null,null,null,null,null,null,null,null,null,null,null,null,null,null,null,null,null,null,null,null,null,null,null,null,null,0,0]
[null,null,null,null,null,null,null,null,null,null,null,null,null,null,null,null,null,null,null,null,null,null,null,null,null,null,null,null,0,0]
[null,null,null,null,null,null,null,null,null,null,null,null,null,null,null,null,null,null,null,null,null,null,null,null,null,null,null,null,0,0]
[null,null,null,null,null,null,null,null,null,null,null,null,null,null,null,null,null,null,null,null,null,null,null,null,null,null,null,null,0,0]
[null,null,null,null,null,null,null,null,null,null,null,null,null,null,null,null,null,null,null,null,null,null,null,null,null,null,null,null,0,0]
[null,null,null,null,null,null,null,null,null,null,null,null,null,null,null,null,null,null,null,null,null,null,null,null,null,null,null,null,0,0]
[null,null,null,null,null,null,null,null,null,null,null,null,null,null,null,null,null,null,null,null,null,null,null,null,null,null,null,null,0,0]
[null,null,null,null,null,null,null,null,null,null,null,null,null,null,null,null,null,null,null,null,null,null,null,null,null,null,null,null,0,0]
[null,null,null,null,null,null,null,null,null,null,null,null,null,null,null,null,null,null,null,null,null,null,null,null,null,null,null,null,0,0]
[null,null,null,null,null,null,null,null,null,null,null,null,null,null,null,null,null,null,null,null,null,null,null,null,null,null,null,null,0,0]
[null,null,null,null,null,null,null,null,null,null,null,null,null,null,null,null,null,null,null,null,null,null,null,null,null,null,null,null,0,0]
[null,null,null,null,null,null,null,null,null,null,null,null,null,null,null,null,null,null,null,null,null,null,null,null,null,null,null,null,0,0]
[null,null,null,null,null,null,null,null,null,null,null,null,null,null,null,null,null,null,null,null,null,null,null,null,null,null,null,null,0,0]
[null,null,null,null,null,null,null,null,null,null,null,null,null,null,null,null,null,null,null,null,null,null,null,null,null,null,null,null,0,0]
[null,null,null,null,null,null,null,null,null,null,null,null,null,null,null,null,null,null,null,null,null,null,null,null,null,null,null,null,0,0]
[null,null,null,null,null,null,null,null,null,null,null,null,null,null,null,null,null,null,null,null,null,null,null,null,null,null,null,null,0,0]
[null,null,null,null,null,null,null,null,null,null,null,null,null,null,null,null,null,null,null,null,null,null,null,null,null,null,null,null,0,0]
[null,null,null,null,null,null,null,null,null,null,null,null,null,null,null,null,null,null,null,null,null,null,null,null,null,null,null,null,0,0]
[null,null,null,null,null,null,null,null,null,null,null,null,null,null,null,null,null,null,null,null,null,null,null,null,null,null,null,null,0,0]
[null,null,null,null,null,null,null,null,null,null,null,null,null,null,null,null,null,null,null,null,null,null,null,null,null,null,null,null,0,0]
[null,null,null,null,null,null,null,null,null,null,null,null,null,null,null,null,null,null,null,null,null,null,null,null,null,null,null,null,0,0]
[null,null,null,null,null,null,null,null,null,null,null,null,null,null,null,null,null,null,null,null,null,null,null,null,null,null,null,null,0,0]
[null,null,null,null,null,null,null,null,null,null,null,null,null,null,null,null,null,null,null,null,null,null,null,null,null,null,null,null,0,0]
[null,null,null,null,null,null,null,null,null,null,null,null,null,null,null,null,null,null,null,null,null,null,null,null,null,null,null,null,0,0]
[null,null,null,null,null,null,null,null,null,null,null,null,null,null,null,null,null,null,null,null,null,null,null,null,null,null,null,null,0,0]
[null,null,null,null,null,null,null,null,null,null,null,null,null,null,null,null,null,null,null,null,null,null,null,null,null,null,null,null,0,0]
[null,null,null,null,null,null,null,null,null,null,null,null,null,null,null,null,null,null,null,null,null,null,null,null,null,null,null,null,0,0]
[null,null,null,null,null,null,null,null,null,null,null,null,null,null,null,null,null,null,null,null,null,null,null,null,null,null,null,null,0,0]
[null,null,null,null,null,null,null,null,null,null,null,null,null,null,null,null,null,null,null,null,null,null,null,null,null,null,null,null,{"$f":"IF(AA1602=0,0,_xlfn.DAYS(AA1602,TODAY()))","v":0},{"$f":"IF(AB1602=0,0,_xlfn.DAYS(AB1602,TODAY()))","v":0}]
[null,null,null,null,null,null,null,null,null,null,null,null,null,null,null,null,null,null,null,null,null,null,null,null,null,null,null,null,0,0]
[null,null,null,null,null,null,null,null,null,null,null,null,null,null,null,null,null,null,null,null,null,null,null,null,null,null,null,null,0,0]
[null,null,null,null,null,null,null,null,null,null,null,null,null,null,null,null,null,null,null,null,null,null,null,null,null,null,null,null,0,0]
[null,null,null,null,null,null,null,null,null,null,null,null,null,null,null,null,null,null,null,null,null,null,null,null,null,null,null,null,0,0]
[null,null,null,null,null,null,null,null,null,null,null,null,null,null,null,null,null,null,null,null,null,null,null,null,null,null,null,null,0,0]
[null,null,null,null,null,null,null,null,null,null,null,null,null,null,null,null,null,null,null,null,null,null,null,null,null,null,null,null,0,0]
[null,null,null,null,null,null,null,null,null,null,null,null,null,null,null,null,null,null,null,null,null,null,null,null,null,null,null,null,0,0]
[null,null,null,null,null,null,null,null,null,null,null,null,null,null,null,null,null,null,null,null,null,null,null,null,null,null,null,null,0,0]
[null,null,null,null,null,null,null,null,null,null,null,null,null,null,null,null,null,null,null,null,null,null,null,null,null,null,null,null,0,0]
[null,null,null,null,null,null,null,null,null,null,null,null,null,null,null,null,null,null,null,null,null,null,null,null,null,null,null,null,0,0]
[null,null,null,null,null,null,null,null,null,null,null,null,null,null,null,null,null,null,null,null,null,null,null,null,null,null,null,null,0,0]
[null,null,null,null,null,null,null,null,null,null,null,null,null,null,null,null,null,null,null,null,null,null,null,null,null,null,null,null,0,0]
[null,null,null,null,null,null,null,null,null,null,null,null,null,null,null,null,null,null,null,null,null,null,null,null,null,null,null,null,0,0]
[null,null,null,null,null,null,null,null,null,null,null,null,null,null,null,null,null,null,null,null,null,null,null,null,null,null,null,null,0,0]
[null,null,null,null,null,null,null,null,null,null,null,null,null,null,null,null,null,null,null,null,null,null,null,null,null,null,null,null,0,0]
[null,null,null,null,null,null,null,null,null,null,null,null,null,null,null,null,null,null,null,null,null,null,null,null,null,null,null,null,0,0]
[null,null,null,null,null,null,null,null,null,null,null,null,null,null,null,null,null,null,null,null,null,null,null,null,null,null,null,null,0,0]
[null,null,null,null,null,null,null,null,null,null,null,null,null,null,null,null,null,null,null,null,null,null,null,null,null,null,null,null,0,0]
[null,null,null,null,null,null,null,null,null,null,null,null,null,null,null,null,null,null,null,null,null,null,null,null,null,null,null,null,0,0]
[null,null,null,null,null,null,null,null,null,null,null,null,null,null,null,null,null,null,null,null,null,null,null,null,null,null,null,null,0,0]
[null,null,null,null,null,null,null,null,null,null,null,null,null,null,null,null,null,null,null,null,null,null,null,null,null,null,null,null,0,0]
[null,null,null,null,null,null,null,null,null,null,null,null,null,null,null,null,null,null,null,null,null,null,null,null,null,null,null,null,0,0]
[null,null,null,null,null,null,null,null,null,null,null,null,null,null,null,null,null,null,null,null,null,null,null,null,null,null,null,null,0,0]
[null,null,null,null,null,null,null,null,null,null,null,null,null,null,null,null,null,null,null,null,null,null,null,null,null,null,null,null,0,0]
[null,null,null,null,null,null,null,null,null,null,null,null,null,null,null,null,null,null,null,null,null,null,null,null,null,null,null,null,0,0]
[null,null,null,null,null,null,null,null,null,null,null,null,null,null,null,null,null,null,null,null,null,null,null,null,null,null,null,null,0,0]
[null,null,null,null,null,null,null,null,null,null,null,null,null,null,null,null,null,null,null,null,null,null,null,null,null,null,null,null,0,0]
[null,null,null,null,null,null,null,null,null,null,null,null,null,null,null,null,null,null,null,null,null,null,null,null,null,null,null,null,0,0]
[null,null,null,null,null,null,null,null,null,null,null,null,null,null,null,null,null,null,null,null,null,null,null,null,null,null,null,null,0,0]
[null,null,null,null,null,null,null,null,null,null,null,null,null,null,null,null,null,null,null,null,null,null,null,null,null,null,null,null,0,0]
[null,null,null,null,null,null,null,null,null,null,null,null,null,null,null,null,null,null,null,null,null,null,null,null,null,null,null,null,0,0]
[null,null,null,null,null,null,null,null,null,null,null,null,null,null,null,null,null,null,null,null,null,null,null,null,null,null,null,null,0,0]
[null,null,null,null,null,null,null,null,null,null,null,null,null,null,null,null,null,null,null,null,null,null,null,null,null,null,null,null,0,0]
[null,null,null,null,null,null,null,null,null,null,null,null,null,null,null,null,null,null,null,null,null,null,null,null,null,null,null,null,0,0]
[null,null,null,null,null,null,null,null,null,null,null,null,null,null,null,null,null,null,null,null,null,null,null,null,null,null,null,null,0,0]
[null,null,null,null,null,null,null,null,null,null,null,null,null,null,null,null,null,null,null,null,null,null,null,null,null,null,null,null,0,0]
[null,null,null,null,null,null,null,null,null,null,null,null,null,null,null,null,null,null,null,null,null,null,null,null,null,null,null,null,0,0]
[null,null,null,null,null,null,null,null,null,null,null,null,null,null,null,null,null,null,null,null,null,null,null,null,null,null,null,null,0,0]
[null,null,null,null,null,null,null,null,null,null,null,null,null,null,null,null,null,null,null,null,null,null,null,null,null,null,null,null,0,0]
[null,null,null,null,null,null,null,null,null,null,null,null,null,null,null,null,null,null,null,null,null,null,null,null,null,null,null,null,0,0]
[null,null,null,null,null,null,null,null,null,null,null,null,null,null,null,null,null,null,null,null,null,null,null,null,null,null,null,null,0,0]
[null,null,null,null,null,null,null,null,null,null,null,null,null,null,null,null,null,null,null,null,null,null,null,null,null,null,null,null,0,0]
[null,null,null,null,null,null,null,null,null,null,null,null,null,null,null,null,null,null,null,null,null,null,null,null,null,null,null,null,0,0]
[null,null,null,null,null,null,null,null,null,null,null,null,null,null,null,null,null,null,null,null,null,null,null,null,null,null,null,null,0,0]
[null,null,null,null,null,null,null,null,null,null,null,null,null,null,null,null,null,null,null,null,null,null,null,null,null,null,null,null,0,0]
[null,null,null,null,null,null,null,null,null,null,null,null,null,null,null,null,null,null,null,null,null,null,null,null,null,null,null,null,0,0]
[null,null,null,null,null,null,null,null,null,null,null,null,null,null,null,null,null,null,null,null,null,null,null,null,null,null,null,null,0,0]
[null,null,null,null,null,null,null,null,null,null,null,null,null,null,null,null,null,null,null,null,null,null,null,null,null,null,null,null,0,0]
[null,null,null,null,null,null,null,null,null,null,null,null,null,null,null,null,null,null,null,null,null,null,null,null,null,null,null,null,0,0]

{"sheet":"Proyectos en Ejecución SGR ","index":4,"n_rows":236,"n_cols":25,"rows_kept":236,"cut":false,"hidden":false,"merged":[[0,0,0,24],[234,1,234,6],[235,1,235,6]]}
[" SISTEMAS GENERAL DEL REGALÍAS-BASE DE PROYECTOS APROBADOS"]
["N°","EJECUTOR (Dpto / Entidad)","EJECUTOR INTERNO","ENCARGADO DE LA ENTIDAD ","ENLACE EMTIDAD EJECUTORA","BPIN","PROYECTO","ALCANCE","SECTOR","VALOR PROYECTO","VALOR SGR","OTRAS FUENTES","FECHA DE APROBACIÓN OCAD","AÑO DE APROBACIÓN","ACUERDO DE APROBACIÓN","Cumplimiento de requisitos previos al inicio de la ejecución","Proyecto fue aprobado en SUIFP SGR pero no ha migrado a Gesproy","CDP","Proyecto fue migrado a Gesproy pero no tiene asignación de recursos en SPGR.","Proyecto con asignación de recursos en SPGR y sin apertura del primer proceso de contratación","Proyecto con asignación de recursos y sin apertura del primer proceso de contratación y sin identificación de alcance,  hitos y programación","Proyecto con apertura del primer proceso de contratación y sin suscripción del primer contrato.","ESTADO","\tAVANCE FÍSICO","\tAVANCE FINANCIERO"]
[1,"CUNDINAMARCA","SECRETARIA DE AMBIENTE","ALEXANDER RIVEROS Y YAHIR ARCINIEGAS","EDUARDO ",2012000050005,"ESTUDIOS Y DISEÑOS DE DETALLE EMBALSE CALANDAIMA MUNICIPIO DE EL COLEGIO DEPARTAMENTO DE CUNDINAMARCA",null,"AMBIENTE Y DESARROLLO SOSTENIBLE",4000000000,1000000000,{"$f":"J3-K3","v":3000000000},41271,2012,"004 DE 2012","04/04/2013\t","OK","15/04/2013\t","25/01/2013\t","30/08/2013\t","HACE FALTA ALCANCE DEL PROYECTO","12/07/2013\t","CERRADO",1,1]
[2,"DESENTRALIZADOS","ICCU - GESPROY GB","DIEGO TORRES / JEIMY FORERO","GIOVANY QUEVEDO",2012000050006,"CONSTRUCCIÓN CUBIERTA COLISEO DEL CENTRO AGROTECNOLOGICO DE EXPOSICIONES Y COMERCIALIZACION DE LA REGION DEL SUMAPAZ EN EL MUNICIPIO DE FUSAGASUGA - CUNDINAMARCA",null,"TRANSPORTE",6352617736,3581530801,2771086935,41271,2012,"004 DE 2012","S.D 31/05/2013","OK","217-24/04/2013",41299,41639,"VALOR TOTAL DEL PROYECTO A PROGRAMAR ES DIFERENTE A VALOR ACTIVIDADES PROGRAMADAS Y EJECUTADAS",41808,"CERRADO",1,0.99539999999999995]
[3,"CUNDINAMARCA","SECRETARIA DE AGRICULTURA","DIEGO TORRES/VALENTINA PORTILLO","JAVIER HERREDIA",2012000050007,"FORTALECIMIENTO DE LAS CADENAS HORTIFRUTICOLA Y AROMATICAS EN CUNDINAMARCA","MEJORAR LA COMPETITIVIDAD ECONÓMICA, SOCIAL Y AMBIENTAL DE PRODUCTORES DE LAS CADENAS DE MANGO, MORA Y AROMÁTICAS, DEL DEPARTAMENTO DE CUNDINAMARCA, ACOMPAÑADO DE PRODUCCIÓN DE ABONOS ORGANICOS E IMPLEMENTACIÓN DE POSCOSECHA Y VALOR AGREGADO.","AGRICULTURA ",2490400000,1300000000,1190400000,41271,2012,"004 DE 2012","013-03/05/2013","OK",41453,"0018-25/01/2013",41458,"HACE FALTA ALCANCE DEL PROYECTO ",41458,"CERRADO",1,1]
[4,"CUNDINAMARCA","SECRETARIA DE AGRICULTURA","DIEGO TORRES/VALENTINA PORTILLO","JAVIER HERREDIA",2012000050009,"FORTALECIMIENTO DE LA PRODUCTIVIDAD Y COMPETITIVIDAD DEL SECTOR CACAOTERO EN EL DEPARTAMENTO DE CUNDINAMARCA ","AUMENTO DE LA PRODUCTIVIDAD DE LAS ÁREAS CACAOTERAS DEL DEPARTAMENTO DE CUNDINAMARCA ","AGRICULTURA ",2334689275,1200000000,1134689275,41271,2012,"004 DE 2012","012-04/04/2013","OK",41431,"0018-25/01/2013","001 de 2013- 24/06/2013","HACE FALTA ALCANCE DEL PROYECTO ",41449,"CERRADO",1,0.96340000000000003]
[5,"CUNDINAMARCA","SECRETARIA GENERAL","YAHIR ARCINIEGAS","JIMENA TAFUR",2012000050010,"ESTUDIOS Y DISEÑOS PARA LA RECUPERACIÓN Y ADECUACION DEL PATRIMONIO HISTORICO CULTURAL PALACIO DE SAN FRANCISCO EN BOGOTA D.C. DEPARTAMENTO DE CUNDINAMARCA ","GESTIONAR INTEGRALMENTE EL DESARROLLO DE LA RESTAURACION Y ADECUACION CON LA FORMULACION DE ESTUDIOS Y DISEÑOS DEL MONUMENTO HISTORICO PALACIO DE SAN FRANCISCO","CULTURA ",1000000000,1000000000,0,41271,2012,"004 DE 2012","01-04/04/2013","OK",41705,41299,41795,"OK",41852,"TERMINADO",1,0.94640000000000002]
[6,"CUNDINAMARCA","SECRETARIA DE EDUCACIÓN","YAHIR ARCINIEGAS Y ALEXANDER RIVEROS","GENNY PADILLA",2012000050011,"FORTALECIMIENTO DE LA PERMANENCIA DE LOS ESTUDIANTES EN LOS MUNICIPIOS DEL DEPARTAMENTO DE CUNDINAMARCA DEPARTAMENTO DE CUNDINAMARCA\n","\nDISMINUIR LA DESERCIÓN EN LOS MUNICIPIOS DEL DEPARTAMENTO DE CUNDINAMARCA","EDUCACIÓN",6000000000,6000000000,0,41187,2012,"003 DE 2012","1-01/04/2013","OK",41247,41227,41247,"HACE FALTA ALCANCE DEL PROYECTO  Y DIFERENCIA EN LA INFORMACION DE ACTIVIDAD DEL PROYECTO",41247,"CERRADO",1,0.58189999999999997]
[7,"CUNDINAMARCA","SECRETARIA DE DESARROLLO E INCLUSIÓN SOCIAL","ALEXANDER RIVEROS Y JEIMY FORERO","TATIANA HERNANDEZ",2012000050012,"IMPLEMENTACIÓN DEL PROGRAMA DE COMPLEMENTACION ALIMENTARIA Y NUTRICIONAL EN MENORES DE 5 AÑOS, MUJERES GESTANTES Y LACTANTES EN TODO EL DEPARTAMENTO DE CUNDINAMARCA","MEJORAR Y FORTALECER LA SEGURIDAD ALIMENTARIA Y NUTRICIONAL EN EL DEPARTAMENTO FACILITANDO EL ACCESO A LOS ALIMENTOS Y NUTRIENTES CRÍTICOS A LOS GRUPOS POBLACIONALES MÁS VULNERABLES.","SALUD Y PROTECCIÓN SOCIAL",4531022720,3000000000,1531022720,41187,2012,"003 DE 2012","08/11/2013 -031","OK",41335,41267,41520,"HACE FALTA ALCANCE DEL PROYECTO  Y DIFERENCIA EN LA INFORMACION DE ACTIVIDAD DEL PROYECTO",41541,"CERRADO",0.99039999999999995,0.99719999999999998]
[8,"CUNDINAMARCA","SECRETARIA DE TRANSPORTE Y MOVILIDAD","DAYANA FERNANDEZ Y EDGAR YAHIR ARCINIEGAS","JORGE PINZON",2012000050013,"ACTUALIZACION Y FORMULACION DE LOS ESTUDIOS Y DISEÑOS FASE II Y III DE LA EXTENCION NORTE - QUITO - SUR DEL SISTEMA TRANSMILENIO AL MUNICIPIO DE SOACHA DEPARTAMENTO DE CUNDINAMARCA ","INTRANSITABILIDAD VEHICULAR DE LA VIA LIMITE DEL DISTRITO AL MUNICIPIO DE SOACHA","SALUD Y PROTECCIÓN SOCIAL",4026917304,3130787355,896129949,41187,2012,"003 DE 2012","04/04/2013-32","OK",41586,41508,41600,"HACE FALTA ALCANCE DEL PROYECTO ",41632,"CERRADO",0.96220000000000006,0.97030000000000005]
[9,"CUNDINAMARCA","SECRETARIA DE AGRICULTURA","DIEGO TORRES/VALENTINA PORTILLO","JAVIER HERREDIA",2012000050014,"MEJORAMIENTO DE LA COMPETITIVIDAD Y SOSTENIBILIDAD DEL SUB SECTOR PANELERO DE CUNDINAMARCA","FORTALECER LA COMPETITIVIDAD DEL SUBSECTOR PANELERO A TRAVÉS DE LA IMPLEMENTACIÓN DEL PLAN DEPARTAMENTAL DE RECONVERSIÓN TECNOLÓGICA EN 8\nMUNCIPIOS DEL DEPARTAMENTO DE CUNDINAMARCA","AGRICULTURA ",1559272190,1300000000,259272190,41271,2012,"004 DE 2012","04/04/2013-014","OK",41449,41299,41451,"HACE FALTA ALCANCE DEL PROYECTO",41451,"CERRADO",1,1]
[10,"CUNDINAMARCA","SECRETARIA DE AGRICULTURA","DIEGO TORRES/VALENTINA PORTILLO","JAVIER HERREDIA",2012000050023,"FORTALECIMIENTO DE LA ACTIVIDAD CAFETERA COMO ALTERNATIVA SOSTENIBLE DE DESARROLLO REGIONAL EN EL DEPARTAMENTO DE CUNDINAMARCA ","CONTRIBUIR EN LA GENERACIÓN DE INGRESOS ESTABLES Y AL MEJORAMIENTO DE LAS CONDICIONES DE VIDA DE LAS FAMILIAS CAFETERAS DE CUNDINAMARCA, ATRAVÉS DE LA INSTALACIÓN DE CULTIVOS RENOVADOS Y TECNIFICADOS, Y LA IMPLEMENTACIÓN DE ESQUEMAS AGROFORESTALES.","AGRICULTURA ",77168795512,1300000000,75868795512,41271,2012,"004 DE 2012","10/04/2013 015\n","OK",41431,41299,41453,"OK",41453,"CERRADO",1,0.99990000000000001]
[11,"CUNDINAMARCA","SECRETARIA DE AGRICULTURA","DIEGO TORRES/VALENTINA PORTILLO","JAVIER HERREDIA",2012000050024,"IMPLEMENTACION DE UN MODELO DE PRODUCCION EN SISTEMAS DE DOBLE PROPOSITO EN PEQUEÑOS PRODUCTORES DEL DEPARTAMENTO DE CUNDINAMARCA","DESARROLLAR UN MODELO ALTERNATIVO DE PRODUCCIÓN DE CARNE Y LECHE PARA SISTEMAS DE DOBLE PROPOSITO ORIENTADO A MEJORAR LOS NIVELES DE PRODUCCIÓN Y RENTABILIDAD DE PEQUEÑOS PRODUCTORES LOCALIZADOS EN CUATRO MUNICIPIOS DEL DEPARTAMENTO DE CUNDINAMARCA","AGRICULTURA ",3371686373,1823985000,1547701373,41271,2012,"004 DE 2012","20/05/2013 011","OK",41570,41299,41579,"HACE FALTA ALCANCE DEL PROYECTO ",41579,"CERRADO",1,0.99439999999999995]
[12,"CUNDINAMARCA","SECRETARIA DE GOBIERNO","YESID CASTAÑO","EDUARDO ",2012000050025,"ESTUDIOS Y DISEÑOS PARA LA CONSTRUCCIÓN DE UN CENTRO ESPECIALIZADO AL SERVICIO DE ADOLESCENTES INFRACTORES DE LA LEY EN EL DEPARTAMENTO DE CUNDINAMARCA","DESARROLLAR DESDE LA ETAPA DE PREINVERSION UN CENTRO DE ATENCION ESPECIALIZADO PARA ATENDER, ORIENTAR Y RESOCIALIZAR A MENORES INFRACTORES DE\nLA LEY EN EL DEPARTAMENTO DE CUNDINAMARCA","DEFENSA",200000000,200000000,0,41271,2012,"004 DE 2012","1-29/04/2013","OK",41376,41299,41254,"HACE FALTA ALCANCE DEL PROYECTO ",41387,"CERRADO",1,1]
[13,"ENTIDAD APORTANTE RECURSOS","MUNICIPIO DE COGUA","ALEXANDER RIVEROS","SANDRA SHUAIB",2012000050026,"MEJORAMIENTO DE LA VA COGUA-SAN CAYETANO (SECTOR LAS MARGARITAS K8+300 SECTOR LAS MARGARITAS HASTA K10+300) CON K0+00 EN COGUA DEPARTAMENTO DE CUNDINAMARCA","AUMENTAR LA TRANSITABILIDAD VEHICULAR EN LA VÌA COGUA - SAN CAYETANO DEL DEPARTAMENTO DE CUNDINAMARCA","TRANSPORTE",2000000000,2000000000,0,41271,2012,"005 DE 2012","28/12/2012-05","OK",41501,41444,41530,"HACE FALTA ALCANCE DEL PROYECTO ",41578,"CERRADO",1,1]
[14,"DESENTRALIZADOS","ICCU - GESPROY GB","DIEGO TORRES / JEIMY FORERO","LUZ MARINA GALINDO",2012000050027,"MEJORAMIENTO DE LA VA UBALA-PALOMAS-MAMBITA (K0+00 UBICADO EN EL SITIO PROFESIONALES MUNICIPIO DE UBALA), DEPARTAMENTO DE CUNDINAMARCA ","AUMENTAR LA TRANSITABILIDAD VEHICULAR EN LA VIA UBALA - PALOMAS - MAMBITA","TRANSPORTE",3359160462,3000000000,359160462,41271,2012,"04 DE 2012",41425,"OK",41381,41299,41519,"HACE FALTA ALCANCE DEL PROYECTO ",41561,"CERRADO",1,0.98660000000000003]
[15,"DESENTRALIZADOS","ICCU - GESPROY GB","DIEGO TORRES / JEIMY FORERO","GIOVANY QUEVEDO",2012000050028,"MEJORAMIENTO Y MANTENIMIENTO DE LA RED VIAL SECUNDARIA Y TERCIARIA MEDIANTE LA DOTACIÓN DE MAQUINARIA A LOS MUNICIPIOS DEL DEPARTAMENTO DE CUNDINAMARCA ","MEJORAR LA TRANSITABILIDAD DE LAS VIAS SECUNDARIAS Y TERCIARIAS DE 41 MUNICIPIOS DEL DEPARTAMENTO DE CUNDINAMARCA","TRANSPORTE",19769772343,8103535586,11666236757,41271,2012,"004 DE 2012",41423,"OK",41339,41299,41422,"HACE FALTA ALCANCE DEL PROYECTO",41422,"CERRADO",1,0.93179999999999996]
[16,"CUNDINAMARCA","SECRETARIA DE MINAS, ENERGIA Y GAS","DIEGO TORRES","JAHIR HERNANDEZ",2012000050029,"IMPLEMENTACIÓN Y MASIFICACION DEL SERVICIO DE GAS COMBUSTIBLE POR REDES PARA MUNICIPIOS DE ANOLAIMA, CACHIPAY, CHOACHI, FOMEQUE, UBAQUE Y VIOTA CUNDINAMARCA","AMPLIAR LA COBERTURA DEL SERVICIO DE GAS NATURAL COMBUSTIBLE EN LOS MUNICIPIOS DE ANOLAIMA, CACHIPAY, CHOACHI, FOMEQUE Y UBAQUE CUNDINAMARCA,","MINAS Y ENERGÍA",15253036000,2199142000,13053894000,41271,2012,"004 DE 2012","29/05/2013-008","OK",41519,41299,41541,"OK",41541,"CERRADO",1,0.94499999999999995]
[17,"CUNDINAMARCA","SECRETARIA DE COMPETITIVIDAD","ALEXANDER RIVEROS/JEIMY FORERO","FABIAN CUESTA",2012000050030,"DESARROLLO CREACION Y FORTALECIMIENTO DE NUEVE (9) CENTROS DE EMPREDIMIENTO Y FORTALECIMIENTO EMPRESARIAL EN EL DEPARTAMENTO DE CUNDINAMARCA ","CREACION Y FUNCIONAMIENTO DE CENTRO DE EMPRENDIMIENTO A NIVEL REGIONAL ENVARGADOS DE GENERAR CULTURA EMPRENDEDORA Y APOYAR LAS INICIATIVAS POR OPORTUNIDAD O NECESIDAD PARA LA CREACION DE NUEVAS EMPRESAS","COMERCIO, INDUSTRIA Y TURISMO ",1752501814,1708104361,44397453,41271,2012,"004 DE 2012",41393,"OK",41397,41299,41423,"DIFERENTES VALOR EN PROGRAMACIÓN DE ACTIVIDADES",41423,"PARA CIERRE",1,0.95069999999999999]
[18,"ENTIDAD APORTANTE RECURSOS","MUNICIPIO DE MOSQUERA","DAYANA FERNANDEZ","GIOVANY QUEVEDO",2012000050039,"MEJORAMIENTO DE LA VIA CALLE 23 ENTRE CRA 3 Y 9B EN MOSQUERA CLL 7 ENTRE CRA 13 Y 24 EN FUNZA DEPARTAMENTO DE CUNDINAMARCA","AUMENTAR LA TRANSITABILIDAD EN LA VÍA URBANA DE LA CALLE 23 ENTRE CARRERAS 3 Y 9B DEL MUNICIPIO DE MOSQUERA CUNDINAMARCA Y/O CALLE 7 ENTRE CARRRERAS 13 Y 24 MUNICIPIO DE FUNZA CUNDINAMARCA","TRANSPORTE",2816415712,1000000000,1816415712,41271,2012,"004 DE 2012","11/12/2012-007","OK",41585,41564,41431,"HACE FALTA ALCANCE DEL PROYECTO",41519,"CERRADO",1,1]
[19,"ENTIDAD APORTANTE RECURSOS","MUNICIPIO DE SOACHA","ALEXANDER RIVEROS","LUZ MARINA GALINDO",2012000050044,"REHABILITACIÓN Y MEJORAMIENTO DE LA VIA PARALELA ( TRANSVERSAL 8 Y CARRERA 7) ENTRE CARRERA 13 CON AUTOPISTA SUR BARRIO LA DESPENSA, HASTA LA CALLE 27 DEL CENTRO DEL MUNICIPIO DE SOACHA CUNDINAMARCA (TRAMO N 1 - K0+000 HASTA K0+262)","MEJORAMIENTO DE LA MOVILIDAD EN LA VIA PARALELA UBICADA EN LA TRANSVERSAL 8 Y CALLE 7 ENTRE CARRERAS 13 CON AUTOPISTA SUR BARRIO LA DESPENSA HASTA LA CALLE 27 DEL CENTRO DEL MUNICIPIO DE SOACHA CUNDINAMARCA (TRAMO N° 1 - K0+000 HASTA EL K0+262)","TRANSPORTE",1000000000,1000000000,0,41271,2012,"004 DE 2012","01/04/2013-01","OK",41627,"NO HAY INFORMACION",41352,"DIFERENTES VALOR EN PROGRAMACIÓN DE ACTIVIDADES Y HACE FALTA ALCANCE DEL PROYECTO",41400,"CERRADO",1,1]
[20,"DESENTRALIZADOS","ICCU - GESPROY GB","DIEGO TORRES / JEIMY FORERO","GIOVANY QUEVEDO",2012000050051,"MEJORAMIENTO DEL PUENTE GUATIMBOL SOBRE EL RIO SUMAPAZ EN LA VA VENECIA - ICONONZO DEPARTAMENTO DE CUNDINAMARCA","MEJORAR LA TRANSITABILIDAD VEHICULAR EN LA VÌA VENECIA - ICONONZO SOBRE EL RIO SUMAPAZ","TRANSPORTE",827195639,620304130,206891509,41271,2012,"004 DE 2012",41425,"OK",41381,41269,41417,"HACE FALTA ALCANCE DEL PROYECTO ",41515,"CERRADO",1,0.98089999999999999]
[21,"DESENTRALIZADOS","ICCU - GESPROY GB","DIEGO TORRES / JEIMY FORERO","GIOVANY QUEVEDO",2012000050052,"FORMULACIÓN Y ACTUALIZACION DE LOS ESTUDIOS Y DISEÑOS DE LA VIA UBAQUE - LOS CEREZOS - CHIPAQUE DEPARTAMENTO DE CUNDINAMARCA","ELABORAR Y ACTULIZAR LOS ESTUDIOS Y DISEÑOS PARA EL MEJORAMEINTO DE LA VÍA UBAQUE - LOS CEREZOS - CHIPAQUE","TRANSPORTE",257457261,250000000,7457261,41271,2012,"004 DE 2012",41365,"OK",41401,41299,41508,"HACE FALTA ALCANCE DEL PORYECTO ",41554,"CERRADO",1,0.99960000000000004]
[22,"DESENTRALIZADOS","ICCU - GESPROY GB","DIEGO TORRES / JEIMY FORERO","GIOVANY QUEVEDO",2012000050054,"FORMULACIÓN Y ACTUALIZACION DE LOS ESTUDIOS Y DISEÑOS PARA EL MEJORAMIENTO DE LA TRONCAL DEL CARBON EN LONGITUD DE 43 KMS (K0+00 LOCALIZADO EN TIERRA NEGRA) DEPARTAMENTO DE CUNDINAMARCA","ELABORAR Y ACTUALIZAR LOS ESTUDIOS Y DISEÑOS PARA EL MEJORAMIENTO DE LA TRONCAL DEL CARBÓN VÍA TAUSA-CUCUNUBA-GUACHETA\nY LENGUAZAQUE.","TRANSPORTE",777429075,755000000,22429075,41271,2012,"004 DE 2012",41365,"OK",41381,41299,41507,"HACE FALTA ALCANCE  DEL PROYECTO ",41550,"CERRADO",1,0.99839999999999995]
[23,"CUNDINAMARCA","SECRETARIA DE CIENCIA, TECNOLOGIA E INNOVACIÓN","ALEXANDER RIVEROS Y YAHIR ARCINIEGAS","LUIS MANUEL GONZALEZ",2012000100010,"FORTALECIMIENTO DE LAS REGIONES COLOMBIANAS EN SUS CAPACIDADES DE CTI - CUNDINAMARCA",":FORTALECIMIENTO DE LAS REGIONES COLOMBIANA EN SUS CAPACIDADES DE INVESTIGACIÓN Y USO DE CIENCIA,\nTECNOLOGÍA E INNOVACIÓN ESTÁ BASADA EN CINCO FASES","CTEL",8721806744,8721806744,0,41263,2012,"001 DE 2012","15/12/2012 Acta No. 4\n","OK",41662,41369,41663,"OK",41663,"CONTRATADO EN EJECUCIÓN",0.8488,0.97289999999999999]
[24,"CUNDINAMARCA","SECRETARIA DE CIENCIA, TECNOLOGIA E INNOVACIÓN","ALEXANDER RIVEROS Y YAHIR ARCINIEGAS","LUIS MANUEL GONZALEZ",2012000100056,"INVESTIGACIÓN ESTRATEGIAS DE VALORACION Y APROPIACION DE LOS RECURSOS NATURALES MECANISMOS DE ADAPTACION A CAMBIO CLIMATICO. REGION DEL BAJO MAGDALENA","DISEÑAR E IMPLEMENTAR ALTERNATIVAS PARA AUMENTAR LA SOSTENIBILIDAD AMBIENTAL Y ECOLÓGICA DE LOS SECTORES GANADERO, PANELERO, CAFETERO, ENERGÉTICO Y DE INFRAESTRUCTURA DE TRANSPORTE COMO\nMECANISMO DE ADAPTACION A CAMBIO CLIMÁTICO.","CTEL",7184175232,4100000000,3084175232,41263,2012,"001 DE 2012","20/12/2012 -001","OK",41492,41369,41569,"OK",41569,"CERRADO",1,0.99970000000000003]
[25,"CUNDINAMARCA","SECRETARIA DE CIENCIA, TECNOLOGIA E INNOVACIÓN","ALEXANDER RIVEROS Y YAHIR ARCINIEGAS","LUIS MANUEL GONZALEZ",2012000100063,"FORTALECIMIENTO DE LAS CAPACIDADES DE INNOVACIÓN SOCIAL POR MEDIO DEL PARQUE CIENTIFICO EN BOGOTA - CUNDINAMARCA","FORTALECER LAS CAPACIDADES DE INNOVACIÓN SOCIAL DE LA REGIÓN DE BOGOTÁ-CUNDINAMARCA POTENCIANDO EL MODELO DEL PARQUE CIENTÍFICO DE INNOVACIÓN SOCIAL EN EL QUE SE INTEGRAN Y ARTICULAN\nINICIATIVAS Y RECURSOS DESTINADOS A ATENDER PROBLEMÁTICAS SOCIALES.","CTEL",16942704000,8250704000,8692000000,41263,2012,"001 DE 2012","20/12/2012 001","OK",41492,41369,41578,"HACE FALTA ALCANCE DEL PROYECTO ",41578,"CERRADO",1,0.94730000000000003]
[26,"CUNDINAMARCA","SECRETARIA DE CIENCIA, TECNOLOGIA E INNOVACIÓN","ALEXANDER RIVEROS Y YAHIR ARCINIEGAS","LUIS MANUEL GONZALEZ",2012000100118,"FORMACION EN CIENCIA, TECNOLOGIA E INNOVACION EN LA COMUNIDAD EDUCATIVA DE LAS INSTITUCIONES EDUCATIVAS OFICIALES DE LOS MUNICIPIOS NO CERTIFICADOS DEL DEPARTAMENTO","LIMITADAS CONDICIONES REGIONALES PARA LA FORMACION EN CIENCIA, TECNOLOGIA E INNOVACION EN LA POBLACION EN EDAD ESCOLAR Y LOS DIRECTIVOS DOCENTES Y DOCENTES DEL DEPARTAMENTO","CTEL",22788739251,17739839251,5048900000,41295,2013,"001 DE 2012","21/01/2013 002","OK",41638,41269,41570,"HACE FALTA ALCANCE DEL PROYECTO ",41570,"CERRADO",0.98180000000000001,0.94810000000000005]
[27,"CUNDINAMARCA","SECRETARIA DE CIENCIA, TECNOLOGIA E INNOVACIÓN","ALEXANDER RIVEROS Y YAHIR ARCINIEGAS","LUIS MANUEL GONZALEZ",2012000100144,"INVESTIGACIÓN INVESTIGACION, DESARROLLO Y TRANSFERENCIA TECNOLOGICA EN EL SECTOR AGROPECUARIO Y AGROINDUSTRIAL CON EL FIN DE MEJORAR L TODO EL DEPARTAMENTO, CUNDINAMARCA, CENTRO ORIENTE","DESARROLLAR ACTIVIDADES DE INVESTIGACIÓN, DESARROLLO TECNOLÓGICO E INNOVACIÓN RURAL EN EL SECTOR AGROPECUARIO Y AGROINDUSTRIAL QUE PERMITA MEJORAR LAS CONDICIONES DE SEGURIDAD ALIMENTARIA Y\nNUTRICIONAL, INCREMENTAR LOS NIVELES DE PRODUCTIVIDAD Y COMPETITIVIDAD","CTEL",50514736439,34707000000,15807736439,41263,2012,"001 DE 2012",41263,"OK",41492,41369,41586,"OK",43329,"CONTRATADO EN EJECUCIÓN",0.84099999999999997,0.81569999999999998]
[28,"CUNDINAMARCA","SECRETARIA DE CIENCIA, TECNOLOGIA E INNOVACIÓN","ALEXANDER RIVEROS Y YAHIR ARCINIEGAS","LUIS MANUEL GONZALEZ",2012000100156,"CONSTRUCCIÓN DEL ECOSISTEMA DE INNOVACION TIC PARA EL DEPTO DE CUNDINAMARCA","ARTICULAR Y PONER EN MARCHA EL ECOSISTEMA DE INNOVACIÓN TIC EN EL DEPARTAMENTO DE CUNDINAMARCA , INTEGRADO POR ACTORES PÚBLICOS Y PRIVADOS DEL SISTEMA NACIONAL DE CIENCIA, TECNOLOGÍA E\nINNOVACIÓN, VER ANEXO INFORMACION IMPORTANTE","CTEL",7088000000,5000000000,2088000000,41263,2012,"001 DE 2012",41263,"OK",41492,41369,41948,"HACE FALTA ALCANCE DEL PROYECTO ",41948,"CERRADO",0.98980000000000001,0.93179999999999996]
[29,"DESENTRALIZADOS","ICCU - GESPROY GB","DIEGO TORRES / JEIMY FORERO","GIOVANY QUEVEDO",2013000050003,"ESTUDIOS Y DISEÑOS PARA EL MEJORAMIENTO DE LA VA VILLAPINZON-TURMEQUE EN LONGITUD DE 11 KMS (K0+00 LOCALIZADO EN VILLAPINZON DEPARTAMENTO DE CUNDINAMARCA","MEJORAR LA COMUNICACIÓN VEHICULAR ENTRE LOS MUNICIPIOS DE VILLAPINZÓN Y TURMEQUE CON LA REGIÓN","TRANSPORTE",245000000,245000000,0,41400,2013,"006 DE 2013",41571,"OK",41785,41632,41934,"HACE FALTA ALCANCE DEL PROYECTO ",42023,"CERRADO",1,0.73470000000000002]
[30,"DESENTRALIZADOS","ICCU - GESPROY GB","DIEGO TORRES / JEIMY FORERO","EDWIN",2013000050004,"ESTUDIOS Y DISEÑOS PARA EL MEJORAMIENTO DE LA VA YACOPI - LA VICTORIA CON K0+00 EN YACOPI DEPARTAMENTO DE CUNDINAMARCA","MEJORAR LA COMUNICACIÓN VEHICULAR ENTRE LOS MUNICIPIOS DE YACOPI Y LA VICTORIA Y LA REGIÓN","TRANSPORTE",250000000,250000000,0,41400,2013,"006 DE 2013",41571,"OK",41785,41632,41963,"HACE FALTA ALCANCE DEL PROYECTO",41974,"CERRADO",1,0.74909999999999999]
[31,"CUNDINAMARCA","SECRETARIA DE DESARROLLO E INCLUSIÓN SOCIAL","YAHIR ARCINIEGAS Y ALEXANDER RIVEROS","TATIANA HERNANDEZ",2013000050005,"IMPLEMENTACIÓN DEL PROGRAMA DE COMPLEMENTACION ALIMENTARIA Y NUTRICIONAL PARA MENORES DE CINCO AÑOS Y MUJERES GESTANTES Y LACTANTES EN TODO EL DEPARTAMENTO DE CUNDINAMARCA","MEJORAR Y FORTALECER LA SEGURIDAD ALIMENTARIA Y NUTRICIONAL EN EL DEPARTAMENTO FACILITANDO EL ACCESO A LOS ALIMENTOS Y NUTRIENTES CRÍTICOS A LOS GRUPOS POBLACIONALES MÁS VULNERABLES.","EDUCACIÓN",6189832118,6000000000,189832118,41400,2013,"006 DE 2013","1-24/10/2013","OK",41738,41586,41995,"HACE FALTA ALCANCE DEL RPOYECTO ",41967,"CERRADO",0.99819999999999998,0.9899]
[32,"CUNDINAMARCA","SECRETARIA DE EDUCACIÓN","YAHIR ARCINIEGAS Y ALEXANDER RIVEROS","GENNY PADILLA",2013000050011,"FORTALECIMIENTO DE LA PERMANENCIA DE LOS ESTUDIANTES EN LOS MUNICIPIOS DEL DEPARTAMENTO DE CUNDINAMARCA 2013-2014 CUNDINAMARCA, CENTRO ORIENTE","LOGRAR LA PERMANENCIA DE LOS ESTUDIANTES BENEFICIADOS CON LA ESTRATEGIA DE TRANSPORTE ESCOLAR EN LOS MUNICIPIOS DE CUNDINAMARCA","EDUCACIÓN",13360387595,13360387595,0,41400,2013,"006 DE 2013",41508,"OK",41562,41530,41827,"HACE FALTA ALCANCE DEL PROYECTO Y VALORES DIFERENTES AL TOTAL ",41791,"CERRADO",0.998,0.9234]
[33,"CUNDINAMARCA","SECRETARIA DE MINAS, ENERGIA Y GAS","DIEGO TORRES","ALVARO CHACON",2013000050026,"CONSTRUCCIÓN REDES ELECTRICAS EN LA ZONA RURAL DE LOS MUNICIPIOS DE PARATEBUENO Y GUTIERREZ EN EL DEPARTAMENTO DE CUNDINAMARCA","AUMENTAR LA COBERTURA Y SUMINISTRO EN LA PRESTACIÓN DEL SERVICIO DE ENERGÍA ELECTRICA PARA FAMILIAS DE BAJOS RECURSOS UBICADAS EN LAS ZONAS RURALES DE LOS MUNICIPIOS DE PARATEBUENO Y GUTIERREZ.","MINAS Y ENERGÍA",1068319227,1045119227,23200000,41502,2013,"007 DE 2013","18/10/2013 009","OK",41586,41577,41586,"VALOR DE ACTIVIDADES ES DIFERENTE AL VALOR TOTAL DE PROYECTO ",41586,"PARA CIERRE",0.44929999999999998,0.44700000000000001]
[34,"CUNDINAMARCA","SECRETARIA DE AGRICULTURA","DIEGO TORRES/VALENTINA PORTILLO","JAVIER HERREDIA",2013000050027,"FORTALECIMIENTO DE LA ACTIVIDAD CAFETERA COMO ESTRATEGIA DE MEJORAMIENTO DE LA PRODUCTIVIDAD Y LA COMPETITIVIDAD EN EL DEPARTAMENTO DE CUNDINAMARCA, CENTRO ORIENTE","MEJORAR LA PRODUCTIVIDAD, COMPETITIVIDAD Y RENTABILIDAD DEL CULTIVO DE CAFE EN EL DEPARTAMENTO DE CUNDINAMARCA","AGRICULTURA ",18756930869,3000000000,15756930869,41502,2013,"025 DE 2014","18/10/2013 17","OK",41586,41585,41555,"OK",41586,"CERRADO",1,0.99490000000000001]
[35,"CUNDINAMARCA","SECRETARIA DE AGRICULTURA","DIEGO TORRES/VALENTINA PORTILLO","JAVIER HERREDIA",2013000050028,"FORTALECIMIENTO DEL SUBSECTOR PANELERO EN EL DEPARTAMENTO DE CUNDINAMARCA","DETRIMENTO EN LA CALIDAD DE VIDA DE LA POBLACION RURAL PANELERA, DEBIDO A FALTA DE COMPETITIVIDAD EN LA IMPLEMENTACION DE LOS DIFERENTES PROCESOS TECNOLOGICOS, AMBIENTALES, PRODUCTIVOS, COMERCIALES Y AGROEMPRESARIALES DEL SUBSECTOR PANELERO EN EL DEPARTAMENTO","AGRICULTURA ",3427279826,2599564478,827715348,41502,2013,"007 DE 2013","18/10/2013 016","OK",41586,41585,41586,"OK",41586,"CERRADO",1,0.99960000000000004]
[36,"DESENTRALIZADOS","ICCU - GESPROY GB","DIEGO TORRES / JEIMY FORERO","GIOVANY QUEVEDO",2013000050043,"MEJORAMIENTO Y REHABILITACION DE LA VIA GUACHETA - CAPELLANIA (SECTOR K0+780 AL K2+240) K0+000 LOCALIZADO EN EL RIO UBATE GUACHET, CUNDINAMARCA, CENTRO ORIENTE","MEJORAR Y REHABILITAR LA VÍA CAPELLANÍA - FUQUENE QUE CONDUCE AL MUNICIPIO DE GUACHETA EN EL SECTOR DE LA VEREDA TICHA","TRANSPORTE",1019047619,1000000000,19047619,41639,2013,"015 DE 2013",41729,"OK",41782,41744,41806,"HACE FALTA ALCANCE DEL PROYECTO ",41876,"CERRADO",1,0.98060000000000003]
[37,"ENTIDAD APORTANTE RECURSOS","BANCO AGRARIO DE COLOMBIA","DIEGO TORRES / JEIMY FORERO",null,2013000050044,"CONSTRUCCIÓN CUNDINAMARCA VISR 2013 TODO EL DEPARTAMENTO, CUNDINAMARCA, CENTRO ORIENTE","AUMENTAR LA VIVIENDA NUEVA RURAL EN CUNDINAMARCA","AGRICULTURA ",60041780218,15888838218,44152942000,41569,2013,"005 DE 2015",41915,"OK",42024,42024,41884,"OK",41983,"CONTRATADO EN EJECUCIÓN",0.81020000000000003,0.85289999999999999]
[38,"DESENTRALIZADOS","ICCU - GESPROY GB","DIEGO TORRES / JEIMY FORERO","GIOVANY QUEVEDO",2013000050045,"MEJORAMIENTO Y PAVIMENTACIÓN DE LA VIA FOSCA - GUTIERREZ, DESDE EL KM 2+000 AL KM 3+000 (K0+000 LOCALIZADO EN FOSCA), DEPARTAMENTO DE CUNDINAMARCA","REALIZAR EL MEJORAMIENTO Y LA PAVIMENTACIÓN DE LA VÍA FOSCA - GUTIÉRREZ, DESDE EL KM 2+00 AL KM 3+00 (K0+000 LOCALIZADO EN FOSCA) DEPARTAMENTO DE CUNDINAMARCA.","TRANSPORTE",2534999997,2000000000,534999997,41579,2013,"012 DE 2013",41676,"OK",41785,41632,41899,"HACE FALTA ALCANCE DEL PROYECTO ",41971,"CERRADO",1,0.97450000000000003]
[39,"CUNDINAMARCA","SECRETARIA DE MINAS, ENERGIA Y GAS","DIEGO TORRES","JAHIR HERNANDEZ",2013000050046,"IMPLEMENTACIÓN Y MASIFICACION DEL SERVICIO DE GAS COMBUSTIBLE POR REDES PARA LOS MUNICIPIOS DE CAPARRAPI, EL PEÑON, LA PALMA, PAIME, TOPAIPI Y VILLAGOMEZ CUNDINAMARCA","AMPLIAR LA COBERTURA DEL SERVICIO DE GAS NATURAL COMBUSTIBLE POR REDES EN LOS MUNICIPIOS DE CAPARRAPI, EL PEÑON, LA PALMA, PAIME, TOPAIME Y\nVILLAGOMEZ CUNDINAMARCA.","MINAS Y ENERGÍA",6609136508,2118963154,4490173354,41579,2013,"012 DE 2013",41676,"OK",41928,41744,41934,"HACE FALTA ALCANCE DEL PROYECTO",41934,"CERRADO",1,1]
[40,"DESENTRALIZADOS","ICCU - GESPROY GB","DIEGO TORRES / JEIMY FORERO","GIOVANY QUEVEDO",2013000050047,"MEJORAMIENTO Y PAVIMENTACIÓN VIA GUANACAS - EL PEÑON DESDE EL K0+000 AL K2+000 (K0+000 UBICADO EN GUANACAS) MUNICIPIO EL PEÑON, CUNDINAMARCA","MEJORAR Y PAVIMENTAR LA VIA GUANACAS - EL PEÑON","TRANSPORTE",3000000000,3000000000,0,41808,2014,"022 DE 2014",41887,"OK",41918,41899,41941,"HACE FALTA ALCANCE DELP ROYECTO ",41985,"CERRADO",1,0.99639999999999995]
[41,"DESENTRALIZADOS","ICCU - GESPROY GB","DIEGO TORRES / JEIMY FORERO","GIOVANY QUEVEDO",2013000050049,"MEJORAMIENTO Y MANTENIMIENTO DE LA RE VIAL MEDIANTE LA ADQUISICION DE MAQUINARIA AÑO 2013-2014 PARA LOS MUNICIPIOS DEL DEPARTAMENTO DE CUNDINAMARCA","MEJORAR LA TRANSITABILIDAD VEHICULAR Y LA COMUNICACIÓN DE LA RED VIAL SECUNDARIA Y TERCIARIA CON EL MANTENIMIENTO PREVENTIVO Y OPORTUNO CON LA ADQUISICIÓN DE MAQUINARIA.","TRANSPORTE",14330854376,12431431552,1899422824,41609,2013,"012 DE 2013",41676,"OK",41822,41599,41836,"HACE FALTA ALCANCE DEL PROYECTO",41884,"CERRADO",1,0.99960000000000004]
[42,"DESENTRALIZADOS","ICCU - GESPROY GB","DIEGO TORRES / JEIMY FORERO","GIOVANY QUEVEDO",2013000050050,"MEJORAMIENTO Y PAVIMENTACIÓN DE LA VIA SANAME - PUENTE QUETAME DESDE K0+000 AL K1+500 (K0+000 LOCALIZADO EN PUENTE QUEMADO) MUNICIPIO FOSCA, CUNDINAMARCA","MEJORAR Y PAVIMENTAR LA VÍA SANAME -PUENTE QUETAME- Y EL MUNICIPIO DE FOSCA, CUNDINAMARCA ","TRANSPORTE",6000000000,6000000000,0,41639,2013,"015 DE 2013",41729,"OK",41782,41744,41807,"HACE FALTA ALCANCE DEL PROEYCTO",41887,"CERRADO",1,0.49209999999999998]
[43,"CUNDINAMARCA","SECRETARIA DE AMBIENTE","ALEXANDER RIVEROS Y YAHIR ARCINIEGAS",null,2013000050051,"FORTALECIMIENTO DE LA GESTION INTEGRAL DE RESIDUOS SOLIDOS, A TRAVES DE SISTEMAS RECIONALES EN LAS PROVINCIAS DE UBATE Y RIONEGRO EN EL DEPARTAMENTO DE CUNDINAMARCA","\nIMPLEMENTAR ALTERNATIVAS VIABLES DE MANEJO Y APROVECHAMIENTO DE RESIDUOS SOLIDOS, PARA GENERAR UNA GESTION INTEGRAL DE RESIDUOS SOLIDOS EN CUNDINAMARCA","VIVIENDA, CIUDAD Y TERRITORIO ",3000000000,3000000000,0,41579,2013,"012 DE 2013",41736,"OK",41885,41712,41954,"HACE FALTA ALCANCE DEL PROYECTO",41970,"CERRADO",0.48280000000000001,0.47399999999999998]
[44,"CUNDINAMARCA","SECRETARIA DE AGRICULTURA","DIEGO TORRES/VALENTINA PORTILLO","JAVIER HERREDIA",2013000050054,"MEJORAMIENTO DE LA PRODUCTIVIDAD Y COMPETITIVIDAD DEL SECTOR CAUCHERO EN EL DEPARTAMENTO DE CUNDINAMARCA","MEJORARA LA PRODUCTIVIDAD Y COMPETITIVIDAD DEL SECTOR CAUCHERO EN EL DEPARTAMENTO DE CUNDINAMARCA, CON EL FIN DE MEJORAR EL NIVEL DE INGRESOS DE LOS CAUCHEROS DEL DEPARTAMENTO","AGRICULTURA ",3765860000,2459000000,1306860000,41639,2013,"015 DE 2013","06/02/2014 007","OK",41948,41935,41976,"HACE FALTA ALCANCE DEL PROYECTO ",41976,"CERRADO",1,1]
[45,"CUNDINAMARCA","SECRETARIA DE GOBIERNO","YESID CASTAÑO","EDUARDO ",2013000050056,"PREVENCIN DE INCENDIOS FORESTALES CON LA ADQUISICION DE VEHICULOS 4X4 ACCION RAPIDA TIPO FORESTAL PARA EL DEPARTAMENTO DE CUNDINAMARCA","FORTALECIMIENTO DE LAS INSTITUCIONES BOMBERILES EN CUNDINAMARCA","AMBIENTE Y DESARROLLO SOSTENIBLE",4000000000,4000000000,0,41579,2013,"012 DE 2013",41676,"OK",41723,41579,41809,"HACE FALTA ALCANCE DEL PROYECTO",41851,"CERRADO",1,0.99990000000000001]
[46,"CUNDINAMARCA","SECRETARIA DE AGRICULTURA","DIEGO TORRES/VALENTINA PORTILLO","JAVIER HERREDIA",2013000050081,"MEJORAMIENTO DE LA PRODUCTIVIDAD, CALIDAD, POSCOSECHA Y MERCADEO DE LAS CADENAS HORTIFRUTCOLA Y AROMATICAS DE CUNDINAMARCA","MEJORAR LA PRODUCTIVIDAD, COMPETITIVIDAD, CALIDAD Y COMERCIALIZACIÓN DE LAS CADENAS PRODUCTIVAS HORTIFRUTÍCOLA Y AROMÁTICAS EN EL DEPARTAMENTO DE CUNDINAMARCA.","AGRICULTURA ",4900400000,2600000000,2300400000,41808,2014,"022 DE 2014",41872,"OK",41964,41935,41976,"HACE FALTA ALCANCE DEL PROYECTO",41976,"CERRADO",1,1]
[47,"CUNDINAMARCA","SECRETARIA DE AGRICULTURA","DIEGO TORRES/VALENTINA PORTILLO","JAVIER HERREDIA",2013000050083,"IMPLEMENTACIÓN Y PUESTA EN MARCHA DE UNA PLANTA HOMOGENIZADORA DE MIELES PARA LA PRODUCCION DE PANELA EN CAPARRAPI CUNDINAMARCA, CENTRO ORIENTE","FORTALECER LA COMPETITIVIDAD DEL SUBSECTOR PANELERO A TRAVÉS DE LA IMPLEMENTACIÓN Y PUESTA EN MARCHA DE UNA PLANTA HOMOGENIZADORA DE MIELES PARA LA ELABORACIÓN DE PANELA PARA MEJORAR LA\nCALIDAD DE VIDA DE LOS PRODUCTORES PANELEROS DE CAPARRAPI","AGRICULTURA ",3322683076.3200002,3126242524.3200002,196440552,41808,2014,"022 DE 2014",41872,"OK",41948,41935,41948,"HACE FALTA ALCANCE DEL PROYECTO ",41948,"CERRADO",1,1]
[48,"DESENTRALIZADOS","ICCU - GESPROY GB","DIEGO TORRES / JEIMY FORERO","GIOVANY QUEVEDO",2013000050094,"MEJORAMIENTO Y REHABILITACION DE LA VIA TABIO - CHIA DEL K1+100 AL K3+200","MEJORAR LA MOVILIDAD PARA LA POBLACIÓN DEL MUNICIPIO EN LA VÍA QUE CONDUCE DE TABIO A CHIA","TRANSPORTE",2000000000,2000000000,0,41639,2013,"015 DE 2013",41729,"OK",41782,41744,"Sin Dato","DESAPROBADO","Sin Dato","DESAPROBADO",0,0]
[49,"CUNDINAMARCA","SECRETARIA DE CIENCIA, TECNOLOGIA E INNOVACIÓN","ALEXANDER RIVEROS Y YAHIR ARCINIEGAS","LUIS MANUEL GONZALEZ",2013000100129,"INCREMENTO EN LAS ESTRATEGIAS SUSTENTABLES EN EL USO DEL RECURSO DE ENERGA ELECTRICA PARA LA POBLACION VULNERABLE EN EL DPTO. DE CUNDINAMARCA","INCREMENTAR EL CONSUMO EFICIENTE DE ENERGÍA, ELECTRIFICACIÓN RURAL Y SENSIBILIZACIÓN EN EL PAGO DEL SERVICIO ALUMBRADO PÚBLICO, A TRAVÉS DE LA METODOLOGÍA DIAGNÓSTICO SOCIAL PARTICIPATIVO\nGENERANDO HERRAMIENTAS DE ASOCIATIVIDAD EN DEPTO. CUNDINAMARCA","CTEL",5264002961,4097083299,1166919662,41789,2014,"025 DE 2014",41789,"OK",42172,42139,42178,"OK",42178,"CONTRATADO EN EJECUCIÓN",0.82420000000000004,0.68520000000000003]
[50,"CUNDINAMARCA","SECRETARIA DE CIENCIA, TECNOLOGIA E INNOVACIÓN","ALEXANDER RIVEROS Y YAHIR ARCINIEGAS","LUIS MANUEL GONZALEZ",2013000100131,"INVESTIGACIÓN ESTIMAR VULNERABILIDAD AL CAMBIO CLIMATICO DE SISTEMAS CAFETEROS Y DISEÑO DE ARREGLOS AGROFORESTALES CON BIOTECNOLOGIA PACHO, TIBACUY, SAN JUAN DE RIO SECO, CUNDINAMARCA","ESTIMAR LA VULNERABILIDAD FRENTE AL CAMBIO CLIMÁTICO DE LOS SISTEMAS DE PRODUCCIÓN CON CAFÉ Y PROPONER MEDIDAS DE ADAPTACIÓN BASADAS EN EL DISEÑO DE SISTEMAS AGROFORESTALES Y BIOTECNOLOGÍA","AGRICULTURA ",3287867000,2622860000,665007000,41474,2013,"005 DE 2013",41626,"OK",41663,41577,41663,"HACE FALTA ALCANCE DEL PROYECTO",41663,"CERRADO",0.98450000000000004,0.89039999999999997]
[51,"CUNDINAMARCA","SECRETARIA DE CIENCIA, TECNOLOGIA E INNOVACIÓN","ALEXANDER RIVEROS Y YAHIR ARCINIEGAS","LUIS MANUEL GONZALEZ",2013000100149,"INNOVACIÓN EN EL MODELO DE GESTION DE MEDICAMENTO EN EL DEPARTAMENTO DE CUNDINAMARCA FASE II","REALIZAR INVESTIGACIÓN SOBRE UTILIZACIÓN Y GESTIÓN DE MEDICAMENTOS EN CUNDINAMARCA Y REUNIR EXPERIENCIAS INTERNACIONALES PARA DISEÑAR MODELO INNOVADOR EN LA GESTIÓN DEL MEDICAMENTO.","CTEL",3079583047,2490946916,588636131,41474,2013,"005 DE 2013",41638,"OK",41579,41547,41598,"HACE FALTA ALCANCE DEL PROYECTO",41612,"CERRADO",1,1]
[52,"CUNDINAMARCA","SECRETARIA DE CIENCIA, TECNOLOGIA E INNOVACIÓN","ALEXANDER RIVEROS Y YAHIR ARCINIEGAS","LUIS MANUEL GONZALEZ",2013000100176,"INNOVACIÓN SISTEMA DE PRODUCCION DE FRUTAS/HORTALIZAS FRESCAS/PROCESADAS TIPO EXPORTACION CON TECNOLOGIA BIOLOGICA /INTEGRAL INOCUA SUBACHOQUE, CUNDINAMARCA, CENTRO ORIENTE","DDESARROLLAR, IMPLEMENTAR Y VALIDAR SISTEMAS DE PRODUCCIÓN DE FRUTAS Y HORTALIZAS FRESCAS O PROCESADAS TIPO EXPORTACIÓN PRODUCIDAS POR BIOAGRICULTURA O AGRICULTURA INTEGRAL INÓCUA QUE FORTALEZCAN\nLA COMPETITIVIDAD DE LAS CADENAS DE VALOR DEL SECTOR.","CTEL",9285096292,6556945302,2728150990,41474,2013,"005 DE 2013",41656,"OK",43819,41577,41664,"OK",41887,"TERMINADO",1,0.68710000000000004]
[53,"CUNDINAMARCA","SECRETARIA DE CIENCIA, TECNOLOGIA E INNOVACIÓN","ALEXANDER RIVEROS Y YAHIR ARCINIEGAS","LUIS MANUEL GONZALEZ",2013000100180,"DISEÑO SMART TON: TALENTO E INNOVACION APLICADA AL TERRITORIO","GENERAR UN MODELO DE ESPACIOS DE APRENDIZAJE PARA DESARROLLO DEL TALENTO EN JÓVENES SOPORTADO EN TECNOLOGÍA Y ORIENTADO A COMPETENCIAS PARA IMPACTO EN SU TERRITORIO","CTEL",3089954000,2497510000,592444000,41509,2013,"008 DE 2013",41583,"OK",41663,41577,41663,"HACE FALTA ALCANCE AL PROYECTO",41663,"CERRADO",1,0.86539999999999995]
[54,"CUNDINAMARCA","SECRETARIA DE CIENCIA, TECNOLOGIA E INNOVACIÓN","ALEXANDER RIVEROS Y YAHIR ARCINIEGAS","LUIS MANUEL GONZALEZ",2013000100215,"FORTALECIMIENTO DE LA GESTIN COMUNITARIA DEL RECURSO HIDRICO, POR MEDIO DE LA DISMINUCION DEL CONSUMO DE ESTE, UTILIZANDO TP Y TICS , CUNDINAMARCA, CENTRO ORIENTE","FORTALECER LAS CAPACIDADES EN LA GESTIÓN DE RECURSO HÍDRICO EN ALGUNOS MUNICIPIOS DE LAS PROVINCIAS DEL GUAVIO Y SABANA CENTRO, BAJO UN ENFOQUE DE APROPIACIÓN SOCIAL DE LA INNOVACIÓN.","CTEL",1811292700,1608461700,202831000,41565,2013,"011 DE 2013",41583,"OK",41782,41709,41969,"HACE FALTA ALCANCE DEL PROYECTO",41969,"CERRADO",1,0.90739999999999998]
[55,"CUNDINAMARCA","SECRETARIA DE CIENCIA, TECNOLOGIA E INNOVACIÓN","ALEXANDER RIVEROS Y YAHIR ARCINIEGAS","LUIS MANUEL GONZALEZ",2013000100217,"FORTALECIMIENTO DE LA COMPETITIVIDAD DEL SECTOR FLORICULTOR COLOMBIANO MEDIANTE EL USO DE CIENCIA, TECNOLOGA E INNOVACION APLICADAS EN EL DEPARTAMENTO DE CUNDINAMARCA","FORTALECER LA COMPETITIVIDAD DEL SECTOR FLORICULTOR COLOMBIANO EN LOS MERCADOS INTERNACIONALES A TRAVÉS DE LA GENERACIÓN, EVALUACIÓN Y TRANSFERENCIA DE SOLUCIONES TECNOLÓGICAS.","CTEL",7204002875,4618409839,2585593036,41789,2014,"025 DE 2014",41789,"OK",42174,42160,42178,"VALOR POR DEBAJO DEL TOTAL Y HACE FALTA EL ALCANCE DEL PROYECTO",42178,"CERRADO",1,0.9859]
[56,"CUNDINAMARCA","SECRETARIA DE CIENCIA, TECNOLOGIA E INNOVACIÓN","ALEXANDER RIVEROS Y YAHIR ARCINIEGAS","LUIS MANUEL GONZALEZ",2013000100247,"INVESTIGACIÓN E INNOVACIÓN TECNOLÓGICA Y APROPIACIÓN SOCIAL DE CONOCIMIENTO CIENTÍFICO DE ORQUÍDEAS NATIVAS DE CUNDINAMARCA","INCREMENTAR EL CONOCIMIENTO SOBRE LAS ORQUÍDEAS NATIVAS DE CUNDINAMARCA PARA ORIENTAR ESTRATEGIAS DE USO SOSTENIBLE Y CONSERVACIÓN POR PARTE DE LOS PRODUCTORES LOCALES EN LAS PROVINCIAS DE\nTEQUENDAMA Y SUMAPAZ","CTEL",3400306874,2551931927,848374947,41856,2014,"027 DE 2014",41856,"OK",42174,42160,42179,"OK",42179,"CERRADO",0.96699999999999997,0.9526]
[57,"CUNDINAMARCA","SECRETARIA DE CIENCIA, TECNOLOGIA E INNOVACIÓN","ALEXANDER RIVEROS Y YAHIR ARCINIEGAS","LUIS MANUEL GONZALEZ",2013000100248,"INNOVACIÓN , CIENCIA Y TECNOLOGIA PARA PRODUCTORES DE LECHE EN LA PROVINCIA DE UBATE, CUNDINAMARCA.","MEJORAR LA PRODUCTIVIDAD Y COMPETITIVIDAD DE LOS PRODUCTORES DE LECHE DE LA PROVINCIA DE UBATÉ DESARROLLANDO SISTEMAS PRODUCTIVOS EFICIENTES, QUE MEJOREN EL ACCESO A LOS MERCADOS A TRAVÉS DE\nLA GENERACIÓN DE TECNOLOGÍA Y ASISTENCIA TÉCNICA.","CTEL",11619725567,9380319099,2239406468,41565,2013,"011 DE 2013",41626,"OK",42172,42139,42173,"OK",42178,"TERMINADO",0.80249999999999999,0.81969999999999998]
[58,"ENTIDAD APORTANTE RECURSOS","MUNICIPIO DE MADRID","ALEXANDER RIVEROS",null,2013000050048,"MEJORAMIENTO Y PAVIMENTACIÓN DE LA VIA AJOVER-SANTA CRUZ EN 2 KILOMETROS, MUNICIPIO DE MADRID, CUNDINAMARCA","MEJORAR LA TRANSITABILIDAD DE LOS\nHABITANTES DEL MUNICIPIO DE MADRID","TRANSPORTE",8946944399,8700000000,246944399,41689,2014,"017 DE 2014",41564,"OK",42009,41672,42075,"OK",42264,"CERRADO",1,1]
[59,"ENTIDAD APORTANTE RECURSOS","CORMAGDALENA","ALEXANDER RIVEROS",null,20132401060001,"MANTENIMIENTO Y RECUPERACIÓN DE LA NAVEGABILIDAD DEL RIO MAGDALENA","MEJORAR LAS CONDICIONES TÉCNICAS DEL CANAL NAVEGABLE","TRANSPORTE",3527443454052,117000000000,3410443454052,41514,2013,"001 DE 2013",41631,"OK",41781,41640,41766,"OK",41895,"CERRADO",4.4999999999999998E-2,3.8300000000000001E-2]
[60,"DESENTRALIZADOS","ICCU - GESPROY GB","DIEGO TORRES / JEIMY FORERO","GIOVANY QUEVEDO",2014000050033,"MEJORAMIENTO Y REHABILITACIÓN DE LA VIA TABIO - CHIA DEL K0+000 AL K1+800","MEJORAR LA MOVILIDAD PARA LA POBLACIÓN DEL MUNICIPIO EN LA VÍA QUE CONDUCE DE TABIO A CHIA\n","TRANSPORTE",2570000000,2000000000,570000000,41893,2014,"026 DE 2014",42003,"OK",42151,41949,42206,"HACE FALTA ALCANCE",42244,"CERRADO",1,1]
[61,"DESENTRALIZADOS","ICCU - GESPROY GB","DIEGO TORRES / JEIMY FORERO","GIOVANY QUEVEDO",2014257720001,"MEJORAMIENTO Y PAVIMENTACIÓN DE LA VIA SUESCA LA PLAYA - SESQUILE DEPARTAMENTO DE CUNDINAMARCA","MEJORAR LA MOVILIDAD DE LA COMUNIDAD DE LOS MUNICIPIOS DE SUESCA Y SESQUILE.","TRANSPORTE",4191000000,1391000000,2800000000,41743,2014,"001 DE 2014",41760,"OK",41669,41632,41631,"HACE FALTA ALCANCE, VALORES INFERIORES AL TOTAL ",41760,"CERRADO",1,0.98670000000000002]
[62,"CUNDINAMARCA","SECRETARIA DE GOBIERNO","DAYANA FERNANDEZ ","EDUARDO ",2014000050010,"CONSTRUCCIÓN DE UN CENTRO DE ATENCION ESPECIALIZADA AL SERVICIO DE ADOLESCENTES INFRACTORES DE LA LEY PENAL EN EL DEPARTAMENTO DE CUNDINAMARCA","CONSTRUCCION DE UN CENTRO ESPECIALIZADO PARA LA ATENCION DE LOS MENORES INFRACTORES DE LA LEY PENAL ADOLESCENTE, YA QUE EN EL DEPARTAMENTO DE CUNDINAMARCA NO EXISTE UNO CON LA CAPACIDAD NECESARIA PARA SUPLIR LAS NECESIDADES DE ESTE PROBLEMA","JUSTICIA Y DEL DERECHO ",9260000000,8500000000,760000000,41808,2014,"022 DE 2014",42178,"OK",42174,42139,42179,"VALOR SUPERIOR AL TOTAL",42179,"PARA CIERRE",1,1]
[63,"ENTIDAD APORTANTE RECURSOS","MUNICIPIO DE VILLETA","ALEXANDER RIVEROS",null,2014000050048,"MEJORAMIENTO Y PAVIMENTACIÓN DE LA VIA VILLETA-PANTANILLO-CORREDOR CHUGUACAL -CAMBAO DEL K0+360 AL K1+060 VILLETA, CUNDINAMARCA, CENTRO ORIENTE","MEJORAR LA ESTRUCTURA DE LA SUPERFICIE DE VIA","TRANSPORTE",1701612797,1489209370.23,212403426.76999998,42089,2015,"033 DE 2015",42146,"OK",42149,42116,42185,"HACE FALTA ALCANCE DEL PROYECTO",42250,"CERRADO",1,1]
[64,"DESENTRALIZADOS","ICCU - GESPROY GB","DIEGO TORRES / JEIMY FORERO","GIOVANY QUEVEDO",2015000050010,"MEJORAMIENTO DE LA VA SAN CAYETANO - COGUA SECTOR K6+670 - K8+366 (K0+000 LOCALIZADO EN EL CASCO URBANO DEL MUNICIPIO DE SAN CAYETANO) CUNDINAMARCA","MEJORAR LA MOVILIDAD Y DISMNUIR EL TIEMPO DE DESPLAZAMIENTO EN LAVÍA QUE CONDUCE DEL MUNICIPIO DE SAN CAYETANO AL MUNICIPIO DE COGUA.\n","TRANSPORTE",3796247522,3000000000,796247522,42158,2015,"036 DE 2015",42213,"OK",42243,42216,42265,"HACE FALTA ALCANCE DEL PROYECTO",42338,"CERRADO",1,0.98760000000000003]
[65,"DESENTRALIZADOS","ICCU - GESPROY GB","DIEGO TORRES / JEIMY FORERO","GIOVANY QUEVEDO",2015000050013,"MEJORAMIENTO DE LA VA UBAQUE - LOS CEREZOS - CHIPAQUE SECTORES DEL K0+000 AL K2+040 Y DEL K16+000 AL K18+260 (K0+000 LOCALIZADO EN UBAQUE) DEPARTAMENTO DE CUNDINAMARCA","MEJORAR LA CONECTIVIDAD Y LA TRANSITABILIDAD EN LA REGIÓN","TRANSPORTE",8000000000,8000000000,{"$f":"J67-K67","v":0},42159,2015,"036 de 2015",42213,"OK",42236,42216,42265,"VALOR ACTIVIDADES SUPERA AL VALOR TOTAL, HACE FALTA ALCANCE DEL PROYECTO ",42338,"CERRADO",0.99709999999999999,0.98750000000000004]
[66,"CUNDINAMARCA","SECRETARIA DE HABITAT Y VIVIENDA","ALEXANDER RIVEROS/JEIMY FORERO","BEATRIZ GAMEZ",2015000050014,"CONSTRUCCIÓN DE VIVIENDAS NUEVAS RURALES VISR 2015 EN EL DEPARTAMENTO DE CUNDINAMARCA-SGR","MEJORAR LAS CONDICIONES HABITACIONALES DE LAS 322 FAMILIAS EN LAS DIFERENTES VEREDAS DE LOS 15 MUNICIPIOS, CONSTRUYENDO 322 VIVIENDAS NUEVAS RURALES Y MEJORANDO LAS CONDICIONES DE SANEAMIENTO BÁSICO.","AGRICULTURA ",7588896000,6840269782,748626218,42173,2015,"036 de 2015",42158,"OK",42178,42174,42179,"VALOR ACTIVIDADES INFERIOR AL VALOR TOTAL - HACE FALTA ALCANCE DEL PROYECTO",42179,"CERRADO",1,0.92759999999999998]
[67,"CUNDINAMARCA","SECRETARIA DE EDUCACIÓN","DAYANA FERNANDEZ","GENNY PADILLA",2015000050015,"FORTALECIMIENTO DE LA PERMANENCIA DE LOS ESTUDIANTES EN LOS MUNICIPIOS DEL DEPARTAMENTO DE CUNDINAMARCA, CENTRO ORIENTE - 2015","GARANTIZAR LA PERMANENCIA DE LOS ESTUDIANTES EN LAS INSTITUCIONES EDUCATIVAS EXISTENTES EN EL DEPARTAMENTO DE CUNDINAMARCA","EDUCACIÓN",8373797030,8373797030,0,42159,2015,"036 de 2015",42297,"OK",42242,42209,42255,"HACE FALTA ALCANCE DEL PROYECTO",42255,"CERRADO",0.97070000000000001,0.85189999999999999]
[68,"DESENTRALIZADOS","ICCU - GESPROY GB","DIEGO TORRES / JEIMY FORERO","GIOVANY QUEVEDO",2015000050025,"MEJORAMIENTO Y PAVIMENTACIÓN DE LA TRONCAL DEL CARBON SECTOR K0+000 AL K2+860 (K0+000 LOCALIZADO EN TIERRA NEGRA, MUNICIPIO DE TAUSA), DEPARTAMENTO DE CUNDINAMARCA","MEJORAR LA CONECTIVIDAD Y LA TRANSITABILIDAD DE LA REGIÓN\n","TRANSPORTE",7913699780,6000000000,1913699780,42159,2015,"036 DE 2015",42213,"OK",42236,42584,42264,"HACE FALTA ALCANCE DEL PROYECTO",42328,"CERRADO",1,1]
[69,"CUNDINAMARCA","SECRETARIA DE EDUCACIÓN","DAYANA FERNANDEZ","GENNY PADILLA",2015000050026,"FORTALECIMIENTO A LA ESTRATEGIA DE ALIMENTACIÓN ESCOLAR PARA MUNICIPIOS NO CERTIFICADOS DEL DEPARTAMENTO DE CUNDINAMARCA, CENTRO ORIENTE","DISMINUIR LOS ALTOS INDICES DE DESERCIN ESCOLAR EN MUNICIPIOS NO CERTIFICADOS DEL DEPARTAMENTO DE CUNDINAMARCA.","EDUCACIÓN",2100000000,2100000000,0,42159,2015,"036 de 2015",42283,"OK",42237,42209,42317,"HACE FALTA ALCANCE DEL PROYECTO",42317,"CERRADO",1,0.85509999999999997]
[70,"CUNDINAMARCA","SECRETARIA DE AGRICULTURA","DIEGO TORRES/VALENTINA PORTILLO","JAVIER HERREDIA",2015000050029,"IMPLEMENTACIÓN Y PUESTA EN MARCHA DE UNA PLANTA HOMOGENIZADORA DE MIELES PARA LA PRODUCCION DE PANELA EN EL MUNICIPIO DE QUIPILE, CUNDINAMARCA, CENTRO ORIENTE","FORTALECER LA COMPETITIVIDAD DEL SUBSECTOR PANELERO A TRAVS DE LA IMPLEMENTACION Y PUESTA EN MARCHA DE UNA PLANTA HOMOGENIZADORA DE MIELES PARA ELABORACION DE PANELA PARA MEJORAR LA CALIDAD DE VIDA DE LOS PRODUCTORES PANELEROS DE QUIPILE.","AGRICULTURA ",3395531657,3139511657,256020000,42180,2015,"037 de 25 2015",42213,"OK",42654,42587,42709,"HACE FALTA ALCANCE DEL PROYECTO",42709,"CERRADO",1,1]
[71,"CUNDINAMARCA","SECRETARIA DE AGRICULTURA","DIEGO TORRES/VALENTINA PORTILLO","JAVIER HERREDIA",2015000050030,"FORTALECIMIENTO A LA CADENA PRODUCTIVA DEL CACAO EN EL DEPARTAMENTO DE CUNDINAMARCA","MEJORAR LA COMPETITIVIDAD Y PRODUCTIVIDAD DE LA CADENA DEL CACAO EN EL DEPARTAMENTO DE CUNDINAMARCA","AGRICULTURA ",2253334400,1200000000,1053334400,42159,2015,"036 de 2015",42228,"OK",42227,42213,42228,"HACE FALTA ALCANCE DEL PROYECTO",42228,"CERRADO",1,1]
[72,"CUNDINAMARCA","SECRETARIA DE GOBIERNO","DAYANA FERNANDEZ","EDUARDO ",2015000050031,"ADQUISICIÓN DE VEHICULOS PARA LOS CUERPOS OPERATIVOS (BOMBEROS) PARA LAS PROVINCIAS DEL DEPARTAMENTO DE CUNDINAMARCA","AUMENTAR LA CAPACIDAD DE RESPUESTA DE LOS CUERPOS OPERATIVOS DE CUNDINAMARCA PARA ATENDER LOS INCENDIOS FORESTALES","AMBIENTE Y DESARROLLO SOSTENIBLE",3670000000,3670000000,0,42159,2015,"036 de 2015",42213,"OK",42195,42181,42303,"VALOR ACTIVIDADES INFERIOR AL VALOR TOTAL - HACE FALTA ALCANCE DEL PROYECTO",42303,"CERRADO",1,0.98]
[73,"CUNDINAMARCA","SECRETARIA DE AGRICULTURA","DIEGO TORRES/VALENTINA PORTILLO","JAVIER HERREDIA",2015000050034,"FORTALECIMIENTO DE LA PRODUCTIVIDAD Y COMPETITIVIDAD DEL SECTOR CAUCHERO EN EL DEPARTAMENTO DE CUNDINAMARCA","FORTALECER LA PRODUCTIVIDAD Y COMPETITIVIDAD DEL SECTOR CAUCHERO EN EL DEPARTAMENTO DE CUNDINAMARCA.","AGRICULTURA ",2158800000,1500000000,658800000,42159,2015,"036 de 2015",42234,"OK",42227,42213,42240,"HACE FALTA ALCANCE DEL PROYECTO",42240,"CERRADO",1,1]
[74,"DESENTRALIZADOS","ICCU - GESPROY GB","DIEGO TORRES / JEIMY FORERO","GIOVANY QUEVEDO",2015000050041,"MEJORAMIENTO DE LA VA UBALA - PALOMAS - MAMBITA - MEDINA (K0+000 UBICADO EN EL SITIO PROFESIONALES MUNICIPIO DE UBALA, DEPARTAMENTO DE CUNDINAMARCA","MEJORAR LA CONECTIVIDAD Y LA TRANSITABILIDAD EN LA REGIÓN\n","TRANSPORTE",13663491451,12663491451,1000000000,42180,2015,"037 DE 2015",42213,"OK",42706,42216,42264,"HACE FALTA ALCANCE DEL PROYECTO ",42326,"CERRADO",1,1]
[75,"CUNDINAMARCA","SECRETARIA DE DESARROLLO E INCLUSIÓN SOCIAL","DAYANA FERNANDEZ","TATIANA HERNANDEZ",2015000050048,"IMPLEMENTACIÓN DEL PROGRAMA DE COMPLEMENTACION ALIMENTARIA Y NUTRICIONAL PARA MENORES DE 5 AÑOS, MADRES GESTANTES Y LACTANTES EN TODO EL DEPARTAMENTO DE CUNDINAMARCA 2015","MEJORAR Y FORTALECER LA SEGURIDAD ALIMENTARIA Y NUTRICIONAL EN EL DEPARTAMENTO DE CUNDINAMARCA.","SALUD Y PROTECCIÓN SOCIAL",2900000000,2900000000,0,42348,2015,"044 de 2015",42348,"OK",42621,42605,42668,"HACE FALTA ALCANCE DEL PROYECTO",42692,"CERRADO",1,1]
[76,"CUNDINAMARCA","SECRETARIA DE EDUCACIÓN","YAHIR ARCINIEGAS Y ALEXANDER RIVEROS",null,2016000050005,"FORTALECIMIENTO DE LA PERMANENCIA DE LOS ESTUDIANTES EN LOS MUNICIPIOS DEL DEPARTAMENTO DE CUNDINAMARCA, CENTRO ORIENTE - 2016","DISMINUIR LA TASA DE DESERCIÓN ESCOLAR EN EL DEPARTAMENTO DE CUNDINAMARCA. ","EDUCACIÓN",14963757156,14963757156,0,42605,2016,"054 DE 2016",42606,"OK",42634,42629,42647,"OK",42647,"CERRADO",0.96699999999999997,0.56169999999999998]
[77,"CUNDINAMARCA","SECRETARIA DE EDUCACIÓN","DAYANA FERNANDEZ","GENNY PADILLA",2016000050014,"FORTALECIMIENTO A LA ESTRATEGIA DE ALIMENTACION ESCOLAR PARA MUNICIPIOS NO CERTIFICADOS DEL DEPARTAMENTO DE CUNDINAMARCA, SGR 2016.","DISMINUIR LOS ALTOS INDICES DE DESERCIÓN ESCOLAR EN MUNICIPIOS NO CERTIFICADOS DEL DEPARTAMENTO DE CUNDINAMARCA.","EDUCACIÓN",12339894658,12339894658,0,42625,2016,"055 de 2016",42629,"OK",42634,42633,42634,"VALOR ACTIVIDADES SUPERA AL VALOR TOTAL, HACE FALTA ALCANCE DEL PROYECTO ",42634,"CERRADO",0.76700000000000002,0.74729999999999996]
[78,"DESENTRALIZADOS","ICCU - GESPROY GB","DIEGO TORRES / JEIMY FORERO","GIOVANY QUEVEDO",2016000050023,"MANTENIMIENTO DE LA RED VIAL EN AFIRMADO A TRAVS DE LA ADQUISICION DE MAQUINARIA PESADA Y EQUIPO DE TRANSPORTE EN EL DEPARTAMENTO DE CUNDINAMARCA","MEJORAR LA MOVILIDAD EN LA RED VIAL SECUNDARIA EN AFIRMADO EN EL DEPARTAMENTO","TRANSPORTE",24179817530,24179817530,0,43066,2017,"068 de 2017",43131,"OK",43494,43474,43277,"VALOR DE ACTIVIDADES ES INFERIOR AL VALOR TOTAL DE PROYECTO ",43223,"CERRADO",0.9133,0.62809999999999999]
[79,"DESENTRALIZADOS","ICCU - GESPROY GB","DIEGO TORRES / JEIMY FORERO","GIOVANY QUEVEDO",2016000050025,"REHABILITACIÓN DE LA VIA BOQUERON - PANDI DEL DEPARTAMENTO DE CUNDINAMARCA","MEJORAR LA MOVILIDAD DE LA VÍA BOQUERÓN-PANDI","TRANSPORTE",4991550669,4991550669,0,42825,2017,"061 DE 2017",43000,"OK",42984,42891,43021,"HACE FALTA ALCANCE DEL PROYECTO",43087,"CERRADO",1,0.98740000000000006]
[80,"DESENTRALIZADOS","ICCU - GESPROY GB","DIEGO TORRES / JEIMY FORERO","GIOVANY QUEVEDO",2016000050029,"REHABILITACIÓN DE LA VIA LA QUINTA - REPRESA DEL NEUSA, MUNICIPIO DE COGUA, DEPARTAMENTO DE CUNDINAMARCA","MEJORAR LA MOVILIDAD DE LA VÍA LA QUINTA - NEUSA","TRANSPORTE",6798676732,5625757063,1172919669,42846,2017,"061 de 2017",43000,"OK",43626,42891,43021,"HACE FALTA ALCANCE DEL PROYECTO ",43098,"CERRADO",1,0.99990000000000001]
[81,"DESENTRALIZADOS","ICCU - GESPROY GB","DIEGO TORRES / JEIMY FORERO","GIOVANY QUEVEDO",2016000050032,"REHABILITACIÓN DE LA VIA CLUB EL BOSQUE - TIBACUY - CUMACA DEL DEPARTAMENTO DE CUNDINAMARCA","MEJORAR LA MOVILIDAD DE LA VÍA CLUB EL BOSQUE-TIBACUY-CUMACA.","TRANSPORTE",4022150134,3022150134,1000000000,42825,2017,"061 DE 2017",43000,"OK",42984,42891,43021,"HACE FALTA ALCANCE DEL PROYECTO",43118,"CERRADO",1,0.99980000000000002]
[82,"ENTIDAD APORTANTE RECURSOS","ALCALDIA MAYOR DE BOGOTA","ALEXANDER RIVEROS","ESPERANZA GUZMAN",2016000050033,"ELABORACIÓN DE LA ENCUESTA MULTIPROPOSITO 2017 : BOGOTA - CUNDINAMARCA","REALIZAR LA ENCUESTA MULTIPROPÓSITO\n2017 BOGOTÁ - CUNDINAMARCA SOBRE\nTEMAS SOCIALES Y ECONÓMICOS DE LOS\nHOGARES QUE HABITAN EN EL TERRITORIO URBANO DE BOGOTÁ D.C. Y LA REGIÓN Y LA ZONA RURAL DEL DISTRITO CAPITAL.","VIVIENDA, CIUDAD Y TERRITORIO ",17282722269,16761722269,521000000,42825,2017,"061 DE 2017",42947,"OK",42872,42872,43342,"OK",43006,"CERRADO",1,0.99950000000000006]
[83,"CUNDINAMARCA","SECRETARIA DE HABITAT Y VIVIENDA","ALEXANDER RIVEROS/JEIMY FORERO","BEATRIZ GAMEZ",2016000050052,"CONSTRUCCIÓN DE VIVIENDAS NUEVAS RURALES EN EL DEPARTAMENTO DE CUNDINAMARCA","DISMINUIR EL DËFICIT DE VIVIENDA RURAL EN EL DEPARTAMENTO DE CUNDINAMARCA ","AGRICULTURA ",5983779025.1700001,5343748804.6800003,640030220.48999977,43090,2017,"069 de 2017",43438,"OK",43523,43507,43360,"OK",43539,"CONTRATADO EN EJECUCIÓN",0.99990000000000001,0.99360000000000004]
[84,"CUNDINAMARCA","SECRETARIA DE CIENCIA, TECNOLOGIA E INNOVACIÓN","ALEXANDER RIVEROS Y YAHIR ARCINIEGAS","LUIS MANUEL GONZALEZ",2016000100027,"ANLISIS DE FACTORES GENETICOS, SANITARIOS Y MEDIOAMBIENTALES QUE AFECTAN LAS TASAS DE PREÑEZ A PARTIR DE EMBRIONES IN VITRO EN EL DEPARTAMENTO DE CUNDINAMARCA","ANALIZAR LOS FACTORES QUE AFECTAN LA PRODUCCIÓN DE EMBRIONES, LAS TASAS DE PREÑEZ Y LA SUPERVIVENCIA EMBRIONARIA, EN UN PROGRAMA DE PRODUCCIÓN DE EMBRIONES IN VITRO EN EL DEPARTAMENTO DE\nCUNDINAMARCA ","CTEL",8135504363,6359045755,{"$f":"J86-K86","v":1776458608},43098,2017,"063 DE 2017",43277,"OK",43244,43244,43369,"OK",43369,"CONTRATADO EN EJECUCIÓN",0.2409,0.86880000000000002]
[85,"CUNDINAMARCA","ENTIDAD DESIGNADA PARA LA SUPERVISIÓN DEL PROYECTO O PARA CONTRATAR LA INTERVENTORÍA RAPE - INTERVENTORIA SECRETARIA DE PLANEACIÓN","YAHIR ARCINIEGAS","ANGELA MARTINEZ",2016000050012,"IMPLEMENTACIÓN DE ACCIONES DE CONSERVACION Y RESTAURACION DE LOS COMPLEJOS DE PARAMO, BOSQUE ALTO-ANDINO Y SERVICIOS ECOSISTEMICOS DE LA REGION CENTRAL","CONSERVAR Y RESTAURAR LOS SERVICIOS ECOSISTÉMICOS Y LA BIODIVERSIDAD ASOCIADA A LOS COMPLEJOS DE PÁRAMOS Y BOSQUE ALTO ANDINO, UBICADOS EN LA JURISDICCIÓN DE LA REGIÓN CENTRAL DE COLOMBIA. ","AMBIENTE Y DESARROLLO SOSTENIBLE",32499987282,{"$f":"J87","v":32499987282},0,42829,2017," 058 DE 2016",42999,"OK",42934,42976,43035,"OK",43070,"TERMINADO",0.99809999999999999,0.99880000000000002]
[86,"CUNDINAMARCA","SECRETARIA DE DESARROLLO E INCLUSIÓN SOCIAL","ALEXANDER RIVEROS Y JEIMY FORERO","TATIANA HERNANDEZ",2017000050017,"FORTALECIMIENTO DEL PROGRAMA DE COMPLEMENTACIÓN ALIMENTARIA Y NUTRICIONAL PARA NIÑAS, NIÑOS MENORES DE 5 AÑOS Y MADRES GESTANTES Y LACTANTES EN RIESGO DE DESNUTRICIÓN DEL DEPARTAMENTO DE CUNDINAMARCA","CONTRIBUIR AL FORTALECIMIENTO DE LA SEGURIDAD ALIMENTARIA DE LA POBLACIÓN Y DEL ESTADO NUTRICIONAL DE LOS NIÑOS Y NIÑAS MENORES DE CINCO AÑOS Y MUJERES GESTANTES MÁS POBRES DEL DEPARTAMENTO DE CUNDINAMARCA, CON EL FIN DE REDUCIR LOS NIVELES DE DES... ","INCLUSIÓN SOCIAL Y RECONCILIACIÓN",8199993544,8199993544,0,42915,2017,"062 de 2017",43059,"OK",43055,43055,43123,"HACE FALTA ALCANCE DEL PROYECTO",43124,"CERRADO",1]
[87,"CUNDINAMARCA","SECRETARIA DE EDUCACIÓN","YAHIR ARCINIEGAS Y ALEXANDER RIVEROS","PABLO CAJAMARCA",2017000050027,"FORTALECIMIENTO DE LA PERMANENCIA DE LOS ESTUDIANTES EN LOS MUNICIPIOS DEL DEPARTAMENTO DE CUNDINAMARCA , CENTRO ORIENTE 2017 CUNDINAMARCA","DISMINUIR LA TASA DE DESERCIN ESCOLAR EN EL DEPARTAMENTO DE CUNDINAMARCA.\n","EDUCACIÓN",14995289800,14995289800,0,42961,2017,"064 de 2017",42961,"OK",43040,43021,42965,"VALOR DE ACTIVIDADES INFERIOR AL VALOR TOTAL PROGRAMADO, HACE FALTA ALCANCE DEL PROYECTO",43034,"CERRADO",1,0.88590000000000002]
[88,"ENTIDAD APORTANTE RECURSOS","MUNICIPIO DE ZIPAQUIRA","ALEXANDER RIVEROS","JAIRO JARA",2017000050029,"CONSERVACIÓN  Y GESTIÓN INTEGRAL DEL RECURSO HÍDRICO MEDIANTE LA ADQUISICIÓN Y RESTAURACIÓN DE PREDIOS DE INTERÉS ECOSISTÉMICO EN ELDEPARTAMENTO DE   CUNDINAMARCA","MITIGAR LA DEGRADACIÓN  Y LA DESFORESTACIÓN DE  ÁREAS DE IMPORTANCIA HÍDRICA, MEDIANTE LA CONSERVACIÓN Y RESTAURACIÓN  DE 58 HAS DEL PÁRAMO DE GUERRERO EN ZONAS AFERENTES DE LA SUBCUENCA DEL RIO FRIO.","AMBIENTE Y DESARROLLO SOSTENIBLE",900000000,467000000,433000000,43340,2018,"077 DE 2018",43503,"OK",43427,43081,43571,"OK",43585,"CONTRATADO EN EJECUCIÓN",0.3327,0.47539999999999999]
[89,"CUNDINAMARCA","SECRETARIA DE EDUCACIÓN","YAHIR ARCINIEGAS Y ALEXANDER RIVEROS","GENNY PADILLA",2017000050033,"FORTALECIMIENTO A LA ESTRATEGIA DE ALIMENTACIÓN ESCOLAR PARA MUNICIPIOS NO CERTIFICADOS DEL DEPARTAMENTO DE CUNDINAMARCA","DISMINUIR LOS ALTOS INDICES DE DESERCIÓN ESCOLAR EN MUNICIPIOS NO CERTIFICADOS DEL DEPARTAMENTO DE CUNDINAMARCA. ","EDUCACIÓN",14000000000,14000000000,0,42977,2017,"065 de 2017",43056,"OK",43075,43075,43056,"OK",43048,"CERRADO",1,0.26939999999999997]
[90,"CUNDINAMARCA","SECRETARIA DE MINAS, ENERGIA Y GAS","DIEGO TORRES / LIYUGETH ALFONSO","JAHIR HERNANDEZ",2017000050036,"IMPLEMENTACIÓN Y EXPANSIÓN DEL SERVICIO DE GAS COMBUSTIBLE POR REDES PARA VEREDAS Y CENTROS POBLADOS DEL DEPARTAMENTO DE CUNDINAMARCA","DISMINUIR LOS ÍNDICES DE POBREZA EN VEREDAS Y CENTROS POBLADOS DEL DEPARTAMENTO DE CUNDINAMARCA. ","MINAS Y ENERGÍA",4751658472,3069656503,1682001969,43356,2018,"077 DE 2018",43504,"OK",43545,43507,43584,"OK",43584,"CERRADO",0.91510000000000002,0.92069999999999996]
[91,"CUNDINAMARCA","SECRETARIA DE PLANEACIÓN","YESID CASTAÑO Y JEIMY FORERO","RUSVEL NIETO",2017000050039,"MEJORAMIENTO DE VÍAS TERCIARIAS MEDIANTE EL USO DE PLACA HUELLA EN LOS MUNICIPIOS DE GUATAVITA, PACHO, SAN JUAN DE RIOSECO, SUBACHOQUE, TENA Y ZIPAQUIRÁ, DEPARTAMENTO DE CUNDINAMARCA","MEJORAR LA INTERCOMUNICACIÓN TERRESTRE DE UNA PARTE DE LA POBLACIÓN RURAL DE LOS MUNICIPIOS DE GUATAVITA, PACHO, SAN JUAN DE RIOSECO, SUBACHOQUE, TENA Y ZIPAQUIRÁ, DEPARTAMENTO DE CUNDINAMARCA. ","TRANSPORTE",6791102421.6400003,6725380621.6400003,65721800,43124,2017,"067 DE 2017",43224,"OK",43224,43220,43291,"VALOR DE ACTIVIDAD SUPERIOR AL VALOR TOTAL DEL PROYECTO A PROGRAMAR",43328,"CONTRATADO EN EJECUCIÓN",0.98519999999999996,0.92030000000000001]
[92,"CUNDINAMARCA","SECRETARIA DE HABITAT Y VIVIENDA","ALEXANDER RIVEROS/JEIMY FORERO","BEATRIZ GAMEZ",2017000050042,"MEJORAMIENTO DE VIVIENDAS RURALES DE LA PROVINCIA DE UBATÉ - CUNDINAMARCA","DISMINUIR EL NÚMERO DE FAMILIAS CON DEFICIENTES CONDICIONES HABITACIONALES UBICADAS EN LA ZONA RURAL DE LOS MUNICIPIOS\n","VIVIENDA, CIUDAD Y TERRITORIO ",2354318125,2354318125,0,43096,2017,"069 de 2017",43270,"OK",43300,43259,43341,"OK",43341,"TERMINADO",1,0.99729999999999996]
[93,"CUNDINAMARCA","SECRETARIA DE SALUD","DAYANA FERNANDEZ Y EDGAR YAHIR ARCINIEGAS","OLGA LUCIA GARZON",2017000050061,"ADQUISICIÓN AMBULANCIAS DE TRANSPORTE ASISTENCIAL BÁSICO (TAB) Y TRANSPORTE ASISTENCIAL MEDICALIZADA (TAM), PARA EL APOYO DEL SISTEMA DE REFERENCIA Y CONTRA REFERENCIA DE LA RED HOSPITALARIA DEL DEPARTAMENTO DE CUNDINAMARCA","MEJORAR LA PRESTACIÓN DEL SERVICIO DE TRANSPORTE ASISTENCIAL DE URGENCIAS DE SALUD ","SALUD Y PROTECCIÓN SOCIAL",3764666699,2000553024,1764113675,43081,2017,"069 de 2017",43081,"OK",43175,43166,43235,"VALOR ACTIVIDADES INFERIOR AL VALOR TOTAL ",43318,"CERRADO",1,0.9708]
[94,"CUNDINAMARCA","SECRETARIA DE AGRICULTURA","DIEGO TORRES/VALENTINA PORTILLO","JAVIER HERREDIA",2017000050062,"FORTALECIMIENTO DE LAS CADENAS PRODUCTIVAS DE MANGO, AGUACATE Y CÍTRICOS EN EL DEPARTAMENTO DE CUNDINAMARCA","MEJORAR LA PRODUCTIVIDAD Y COMPETITIVIDAD DE CULTIVOS FRUTÍCOLAS PRIORIZADOS PARA EL DEPARTAMENTO DE CUNDINAMARCA, MEDIANTE EL ESTABLECIMIENTO DE ÁREAS NUEVAS CON ÉNFASIS EN BUENAS PRÁCTICAS AGRÍCOLAS (BPA).\n","AGRICULTURA ",3000129600,2100129600,900000000,43124,2018,"072 DE 2018",43126,"OK",43126,43126,43126,"OK",43126,"CERRADO",1,1]
[95,"CUNDINAMARCA","SECRETARIA DE MINAS, ENERGIA Y GAS","DIEGO TORRES / LIYUGETH ALFONSO","JAHIR HERNANDEZ",2017000050064,"CONSTRUCCIÓN DE REDES ELÉCTRICAS EN ZONA RURAL DE 13 MUNICIPIOS, EN EL MARCO DEL PROYECTO ILUMINANDO VIDAS DEL DEPARTAMENTO DE CUNDINAMARCA","\nAMPLIAR LA COBERTURA DEL SERVICIO DE ENERGÍA ELÉCTRICA EN LA ZONA RURAL DE 13 MUNICIPIOS DE CUNDINAMARCA.\n","MINAS Y ENERGÍA",2972842689,2532327281,440515408,43273,2018,"076 DE 2018",43418,"OK",43360,43360,43510,"OK",43510,"CERRADO",0.82330000000000003,0.81879999999999997]
[96,"CUNDINAMARCA","SECRETARIA DE AGRICULTURA","DIEGO TORRES/VALENTINA PORTILLO","JAVIER HERREDIA",2017000050065,"MEJORAMIENTO DE LA PRODUCTIVIDAD Y RENTABILIDAD DE LOS CAFICULTORES DEL DEPARTAMENTO DE CUNDINAMARCA","AUMENTAR LA PRODUCTIVIDAD Y RENTABILIDAD DE LA CAFICULTURA EN EL DEPARTAMENTO.","AGRICULTURA ",6523880054,4220000000,2303880054,43096,2017,"069 DE 2017",43125,"OK",43123,43122,43126,"OK",43126,"TERMINADO",0.86480000000000001,0.84630000000000005]
[97,"CUNDINAMARCA","SECRETARIA DE CIENCIA, TECNOLOGIA E INNOVACIÓN","ALEXANDER RIVEROS Y YAHIR ARCINIEGAS","LUIS MANUEL GONZALEZ",2017000100016,"IMPLEMENTACIÓN PROGRAMA DE INNOVACIÓN PARA LA VALIDACIÓN Y GENERACIÓN DE PRODUCTOS DERIVADOS DE LA BIODIVERSIDAD EN EL DEPARTAMENTO DE CUNDINAMARCA","FORTALECER LAS CAPACIDADES DE INNOVACIÓN DE BASE TECNOLÓGICA PARA EL APROVECHAMIENTO SOSTENIBLE DE LA BIODIVERSIDAD EN EL DEPARTAMENTO\nDE CUNDINAMARCA.\n","CTEL",4825004077.9799995,4664086788.1700001,160917289.80999947,42941,2017,"058 DE 2017",43039,"OK",43010,43004,43054,"OK",43089,"CONTRATADO EN EJECUCIÓN",0.7883,0.94320000000000004]
[98,"CUNDINAMARCA","SECRETARIA DE CIENCIA, TECNOLOGIA E INNOVACIÓN","ALEXANDER RIVEROS Y YAHIR ARCINIEGAS","LUIS MANUEL GONZALEZ",2017000100034,"IMPLEMENTACIÓN DE UN SISTEMA DE GESTIÓN DE INNOVACIÓN PARA LA INDUSTRIA DE CUNDINAMARCA","DESARROLLAR CAPACIDADES DE INNOVACIÓN EN LAS EMPRESAS PARA AUMENTAR LA COMPETITIVIDAD Y PRODUCTIVIDAD DEL DEPARTAMENTO DE\nCUNDINAMARCA","CTEL",3925471448,3714407118,211064330,42941,2017,"058 DE 2017",42928,"OK",43010,43004,43054,"OK",43049,"CONTRATADO EN EJECUCIÓN",0.99209999999999998,0.94179999999999997]
[99,"CUNDINAMARCA","SECRETARIA DE CIENCIA, TECNOLOGIA E INNOVACIÓN","ALEXANDER RIVEROS Y YAHIR ARCINIEGAS","LUIS MANUEL GONZALEZ",2017000100074,"IMPLEMENTACIÓN DE ESTRATEGIAS DE FOMENTO A LA CULTURA Y SERVICIOS DE INNOVACIÓN EN LAS PROVINCIAS SABANA OCCIDENTE, SABANA CENTRAL, SOACHA Y SUMAPAZ CUNDINAMARCA","AUMENTAR LOS NIVELES DE INNOVACIÓN EN LAS MICROS, PEQUEÑAS Y MEDIANAS EMPRESAS DE LA ENTIDAD TERRITORIAL","CTEL",6183633276,5533633276,650000000,43098,2017,"063 DE 2017"," 26/06/2018 ","OK",43523,43244,43418,"OK",43406,"TERMINADO",1,0.99709999999999999]
[100,"CUNDINAMARCA","SECRETARIA DE CIENCIA, TECNOLOGIA E INNOVACIÓN","ALEXANDER RIVEROS Y YAHIR ARCINIEGAS","LUIS MANUEL GONZALEZ",2017000100076,"FORTALECIMIENTO DE CAPACIDADES DE GESTIÓN DEL RIESGO A TRAVÉS DE APROPIACIÓN SOCIAL DE LA CIENCIA, LA TECNOLOGÍA Y LA INNOVACIÓN EN EL DEPARTAMENTO DE CUNDINAMARCA","IINCREMENTAR LOS NIVELES DE INTERCAMBIO DE CONOCIMIENTOS CIENTÍFICOS Y TECNOLÓGICOS EN TORNO A LA GESTIÓN DEL RIESGO ENTRE LAS COMUNIDADES, EL\nGOBIERNO Y EXPERTOS EN EL DEPARTAMENTO DE CUNDINAMARCA ","CTEL",4404970720,4000000000,404970720,43322,2018,"068 DE 2018",43511,"OK",43402,43402,43599,"OK",43602,"CONTRATADO EN EJECUCIÓN",0.70069999999999999,0.96120000000000005]
[101,"CUNDINAMARCA","SECRETARIA DE CIENCIA, TECNOLOGIA E INNOVACIÓN","ALEXANDER RIVEROS Y YAHIR ARCINIEGAS","LUIS MANUEL GONZALEZ",2017000100087,"FORMACIÓN DE TALENTO HUMANO DE ALTO NIVEL EN MAESTRÍAS EN EL DEPARTAMENTO DE CUNDINAMARCA","INCREMENTAR EL ACCESO A LA FORMACIÓN DE ALTO NIVEL PARA LA INVESTIGACIÓN, EL DESARROLLO TECNOLÓGICO Y LA INNOVACIÓN EN EL DEPARTAMENTO DE\nCUNDINAMARCA","CTEL",5148022960,5048022960,100000000,43698,2019,"078 DE 2019",43811,"OK",43787,"18/11/2019\t","28/02/2020\t","OK","28/02/2020\t","CONTRATADO EN EJECUCIÓN",0.60589999999999999,0.91639999999999999]
[102,"CUNDINAMARCA","SECRETARIA DE CIENCIA, TECNOLOGIA E INNOVACIÓN","ALEXANDER RIVEROS Y YAHIR ARCINIEGAS","LUIS MANUEL GONZALEZ",2017000100104,"FORTALECIMIENTO DE LA CULTURA DE LA GESTIÓN Y UTILIZACIÓN DEL CONOCIMIENTO EN CTEI EN NIÑOS, JÓVENES Y COMUNIDADES DEL DEPARTAMENTO DE CUNDINAMARCA","FORTALECER LA CULTURA DE LA GESTIÓN Y UTILIZACIÓN DEL CONOCIMIENTO EN CTEI EN NIÑOS, JÓVENES Y COMUNIDADES DE CUNDINAMARCA.","CTEL",9498967749,7498967749,2000000000,43565,2019,"074 DE 2019","07/10/2019\t","OK","19/09/2019\t","27/08/2019\t","08/10/2019\t","OK","07/11/2019\t","CONTRATADO EN EJECUCIÓN",0.93269999999999997,0.82489999999999997]
[103,"CUNDINAMARCA","UNIDAD ADMINISTRATIVA DE GESTIÓN DEL RIESGO.","DIEGO TORRES/VALENTINA PORTILLO","GINNA HERRERA",20172401060022,"ESTUDIOS DETALLADOS PARA LA INCORPORACIÓN DE LA GESTIÓN DEL RIESGO PARA LOS MUNICIPIOS DE GIRARDOT, RICAURTE","INCORPORAR DE MANERA GRADUAL LA GESTIÓN DEL RIESGO EN LA REVISIÓN DE LOS PLANES DE ORDENAMIENTO TERRITORIAL DE LOS MUNICIPIOS DE GIRARDOT Y RICAURTE.","AMBIENTE Y DESARROLLO SOSTENIBLE",3084907873,3084907873,0,43802,2019,"033 DE 2019",43745,"OK","27/08/2019\t","27/08/2019\t","08/10/2019\t","VALOR DE ACTIVIDADES INFERIOR AL VALOR TOTAL PROGRAMADO","05/10/2021\t","CONTRATADO EN EJECUCIÓN",0.20300000000000001,0.20269999999999999]
[104,"CUNDINAMARCA","SECRETARIA DE CIENCIA, TECNOLOGIA E INNOVACIÓN","ALEXANDER RIVEROS Y YAHIR ARCINIEGAS","LUIS MANUEL GONZALEZ",20170000100012,"CONFORMACIÓN DE UNA CONVOCATORIA REGIONAL DE PROYECTOS I+D EN FOCOS PRIORIZADOS CTEI PARA EL FORTALECIMIENTO DE LOS GRUPOS DE INVESTIGACIÓN CUNDINAMARCA","\nFORTALECER LA PRODUCCIÓN DE CONOCIMIENTO Y DESARROLLO EXPERIMENTAL DE ALTO IMPACTO PARA EL DEPARTAMENTO DE CUNDINAMARCA\n","CTEL",7586358670.8000002,7375550629.0600004,210808041.73999977,42941,2017,"058 DE 2017","09/11/2017\t","OK","20/02/2019\t","26/09/2017\t","12/12/2017\t","OK","20/12/2017\t","CONTRATADO EN EJECUCIÓN",0.88100000000000001,0.9708]
[105,"ENTIDAD APORTANTE RECURSOS","CAR","YESID CASTAÑO","CARLOS MURCIA",2017000050063,"RECUPERACIÓN HIDRÁULICA Y AMBIENTAL DEL COMPLEJO LAGUNAR  FÚQUENE","RECUPERAR EL EQUILIBRIO AMBIENTAL DEL COMPLEJO LAGUNAR FÚQUENE\n","AMBIENTE Y DESARROLLO SOSTENIBLE",18000000000,18000000000,0,43364,2018,"081 DE 2018","12/02/2019\t","OK","10/05/2019\t","10/05/2019\t","25/07/2019\t","OK","24/09/2019\t","CONTRATADO EN EJECUCIÓN",0.56879999999999997,0.58589999999999998]
[106,"ENTIDAD APORTANTE RECURSOS","CAR","YESID CASTAÑO","CARLOS MURCIA",2017000050070,"CONSTRUCCIÓN DE OBRAS DE MITIGACIÓN DEL RIESGO POR EVENTOS CLIMÁTICOS EN LA CUENCA DE LA QUEBRADA LA PARROQUIA EN EL CERRO DE FUSACATÁN DEL MUNICIPIO DE  FUSAGASUGÁ, CUNDINAMARCA","DISMINUIR EL RIESGO DE INUNDACIONES POR CRECIENTE SÚBITA DE LA CUENCA DE LA QUEBRADA LA PARROQUIA EN EL MUNICIPIO DE FUSAGASUGÁ.","AMBIENTE Y DESARROLLO SOSTENIBLE",1976558725,1376558725,600000000,43417,2018,"082 DE 2018","29/04/2019\t","OK","11/04/2019\t","10/04/2019\t","no hay datos","OK","no hay dato","DESAPROBADO",0,0]
[107,"ENTIDAD APORTANTE RECURSOS","MUNICIPIO DE UTICA","JUAN CARLOS TORRES","CESAR SIMANCAS",2017000050087,"MEJORAMIENTO DEL SENDERO TURÍSTICO DE LA PROVINCIA DEL GUALIVÁ  – ÚTICA  CUNDINAMARCA","MEJORAR LA INFRAESTRUCTURA TURÍSTICA  EN LA PROVINCIA DEL GUALIVA","COMERCIO, INDUSTRIA Y TURISMO ",2347004868,2123058880,223945988,43211,2018,"075 de 2018","25/06/2018\t","OK","01/06/2018\t","21/05/2018\t","12/09/2018\t","HACE FALTA ALCANCE","14/12/2018\t","CONTRATADO EN EJECUCIÓN",0.78920000000000001,0.94520000000000004]
[108,"CUNDINAMARCA","SECRETARIA DE EDUCACIÓN","YAHIR ARCINIEGAS Y ALEXANDER RIVEROS","PABLO CAJAMARCA",2018000050019,"FORTALECIMIENTO DE LA PERMANENCIA DE LOS ESTUDIANTES EN LOS MUNICIPIOS DEL DEPARTAMENTO DE CUNDINAMARCA, CENTRO ORIENTE 2018 CUNDINAMARCA","INCREMENTAR LOS NIVELES DE PERMANENCIA DE LOS NIÑOS, NIÑAS Y ADOLESCENTES QUE ASISTEN A LOS ESTABLECIMIENTOS EDUCATIVOS OFICIALES DE CUNDINAMARCA","EDUCACIÓN",19395559645,19395559645,0,43336,2018,"080 DE 2018","24/08/2018\t","OK","06/09/2018\t","31/08/2018\t","05/09/2018\t","VALOR TOTAL DEL PROYECTO A PROGRAMAR ES DIFERENTE A VALOR ACTIVIDADES PROGRAMADAS Y EJECUTADAS","05/09/2018\t","CERRADO",1,0.66120000000000001]
[109,"DESENTRALIZADOS","ICCU - GESPROY GB","DIEGO TORRES / JEIMY FORERO","GIOVANY QUEVEDO",2018000050022,"MEJORAMIENTO Y REHABILITACIÓN DE VÍAS SECUNDARIAS EN LA PROVINCIA DE UBATÉ, DEPARTAMENTO DE CUNDINAMARCA","MEJORAR LA INTERCOMUNICACIÓN TERRESTRE DE LA POBLACIÓN DE LOS MUNICIPIOS DE LA PROVINCIA DE UBATÉ EN EL DEPARTAMENTO DE CUNDINAMARCA","TRANSPORTE",7524876363,7441105086,83771277,43320,2018,"078 de 2018","07/02/2019\t","OK","18/02/2019\t","05/10/2018\t",43594,"OK","29/04/2019\t","CERRADO",0.98829999999999996,0.97309999999999997]
[110,"DESENTRALIZADOS","ICCU - GESPROY GB","DIEGO TORRES / JEIMY FORERO","GIOVANY QUEVEDO",2018000050024,"MEJORAMIENTO Y REHABILITACIÓN DE LA VÍA LA MARÍA – TOBIA - PASO EL REJO - LA PEÑA, DEPARTAMENTO DE CUNDINAMARCA","MEJORAR LA INTERCOMUNICACIÓN TERRESTRE DE LA POBLACIÓN DE LOS MUNICIPIOS DE LA PROVINCIA DE GUALIVÁ EN EL DEPARTAMENTO DE CUNDINAMARCA","TRANSPORTE",9149162991,8983328881,165834110,43417,2018,"082 de 2018","14/03/2019\t","OK","19/03/2019\t","14/03/2019\t","20/03/2019\t","OK","17/05/2019\t","TERMINADO",0.96450000000000002,0.94279999999999997]
[111,"DESENTRALIZADOS","ICCU - GESPROY GB","DIEGO TORRES / JEIMY FORERO","GIOVANY QUEVEDO",2018000050026,"MEJORAMIENTO DE VÍAS EN LA PROVINCIA DE SUMAPAZ PARA LA CONSOLIDACIÓN DE UNA PAZ ESTABLE Y DURADERA EN EL DEPARTAMENTO DE CUNDINAMARCA","MEJORAR LA INTERCOMUNICACIÓN TERRESTRE DE LA POBLACIÓN DE LOS MUNICIPIOS DE LA PROVINCIA DEL SUMAPAZ EN EL DEPARTAMENTO DE CUNDINAMARCA","TRANSPORTE",11457047617,11457047617,0,43462,2018,"011 de 2018 - OCAD PAZ","14/03/2019\t","OK","19/03/2019\t\t","14/03/2019\t","20/03/2019\t","OK",43617,"CONTRATADO EN EJECUCIÓN",0.52569999999999995,0.57879999999999998]
[112,"CUNDINAMARCA","UNIDAD ADMINISTRATIVA DE GESTIÓN DEL RIESGO.","DIEGO TORRES/VALENTINA PORTILLO","GINNA HERRERA",2018000050036,"CONSTRUCCIÓN DE OBRAS PARA LA MITIGACIÓN DEL RIESGO EN EL MUNICIPIO DE SAN BERNARDO, BENEFICIANDO A COMUNIDADES DE LOS MUNICIPIOS DE ARBELAEZ, PANDI Y VENECIA CUNDINAMARCA","DISMINUIR LA VULNERABILIDAD DE RIESGO DE DESLIZAMIENTO E INUNDACIN EN LA COMUNIDAD DE LOS BARRIOS JUAN XIII Y SAN ANTONIO DEL MUNICIPIO DE SAN BERNARDO, BENEFICIANDO A MUNICIPIOS ALEDAÑOS COMO ARBELAEZ, PANDI Y VENECIA CUNDINAMARCA","AMBIENTE Y DESARROLLO SOSTENIBLE",2305788182,2305788182,0,43629,2019,"089 de 2019","DESAPROBADO","OK","DESAPROBADO","DESAPROBADO","DESAPROBADO","DESAPROBADO","DESAPROBADO","DESAPROBADO",0,0]
[113,"CUNDINAMARCA","SECRETARIA DE HABITAT Y VIVIENDA","ALEXANDER RIVEROS/JEIMY FORERO","BEATRIZ GAMEZ",2018000050039,"MEJORAMIENTO DE VIVIENDA RURAL EN LOS MUNICIPIOS DE CUCUNUBÁ, JERUSALEN, QUEBRADANEGRA Y VIOTÁ - DEPARTAMENTO DE CUNDINAMARCA","\nDISMINUIR EL NÚMERO DE FAMILIAS CON DEFICIENTES CONDICIONES HABITACIONALES UBICADAS EN LA ZONA RURAL DE LOS MUNICIPIOS \n","AGRICULTURA ",4024793625,4024793625,0,43571,2019,"009 DE 2019","08/03/2019\t","OK","06/06/2019\t","28/05/2019\t","25/06/2019\t","OK","25/06/2019\t","PARA CIERRE",1,1]
[114,"DESENTRALIZADOS","ICCU - GESPROY GB","DIEGO TORRES / JEIMY FORERO","GIOVANY QUEVEDO",2018000050049,"MEJORAMIENTO DE LA VÍA SESQUILÉ – GUATAVITA - GACHETÁ, DEPARTAMENTO DE CUNDINAMARCA","MEJORAR LA INTERCOMUNICACIÓN TERRESTRE DE LA POBLACIÓN DE LOS MUNICIPIOS DE SESQUILÉ, GUATAVITA Y GACHETÁ EN EL DEPARTAMENTO DE CUNDINAMARCA.","TRANSPORTE",3997714045,3935792642,61921403,43455,2018,"084 de 2018","14/03/2019\t","OK","14/03/2019\t","14/03/2019\t","15/03/2019\t","OK","27/05/2019\t","CERRADO",0.80930000000000002,0.80869999999999997]
[115,"DESENTRALIZADOS","ICCU - GESPROY GB","DIEGO TORRES / JEIMY FORERO","GIOVANY QUEVEDO",2018000050055,"MEJORAMIENTO DE LA TRONCAL DE RIONEGRO, SECTOR LA PALMA CHARCO LARGO PARA LA CONSOLIDACIÓN DE UNA PAZ ESTABLE Y DURADERA EN EL DEPARTAMENTO DE CUNDINAMARCA","MEJORAR LA INTERCOMUNICACIÓN TERRESTRE DE UNA PARTE DE LA POBLACIÓN DE LA PROVINCIA DE RIONEGRO EN EL DEPARTAMENTO DE CUNDINAMARCA","TRANSPORTE",17928531277,17928531277,0,43532,2019,"086 de 2019","08/05/2019\t","OK","21/05/2019\t",43594,"23/05/2019\t","OK","05/08/2019\t","CERRADO",0.95509999999999995,0.92210000000000003]
[116,"DESENTRALIZADOS","ICCU - GESPROY GB","DIEGO TORRES / JEIMY FORERO","GIOVANY QUEVEDO",2018000050059,"MEJORAMIENTO DE LA VÍA GUSBITA - TIBIRITA DEL DEPARTAMENTO DE CUNDINAMARCA","MEJORAR EN LA INTERCOMUNICACIÓN TERRESTRE DE LA POBLACIÓN DE LOS MUNICIPIOS DE TIBIRITA Y MACHETÁ DEL DEPARTAMENTO DE CUNDINAMARCA","TRANSPORTE",5500531740,4870657724,629874016,43532,2019,"086 de 2019","26/09/2019\t","OK","03/10/2019\t","07/05/2019\t","10/10/2019\t","OK","30/12/2019\t","TERMINADO",0.99580000000000002,0.88549999999999995]
[117,"CUNDINAMARCA","SECRETARIA DE CIENCIA, TECNOLOGIA E INNOVACIÓN","ALEXANDER RIVEROS Y YAHIR ARCINIEGAS","LUIS MANUEL GONZALEZ",2018000100106,"INNOVACIÓN EN EL MODELO DE GESTIÓN DEL MEDICAMENTO FASE III EN EL DEPARTAMENTO DE  CUNDINAMARCA","MEJORAR LAS INEFICIENCIAS EN EL CICLO DE GESTIÓN DEL MEDICAMENTO EN EL DEPARTAMENTO DE CUNDINAMARCA\n","CTEL",3452890062,3071356262,381533800,43830,2019,"087 DE 2019","NO HA MIGRADO A GESPROY","NO HA MIGRADO A GESPROY","NO HA MIGRADO A GESPROY","NO HA MIGRADO A GESPROY","NO HA MIGRADO A GESPROY","NO HA MIGRADO A GESPROY","NO HA MIGRADO A GESPROY","DESAPROBADO",0,0]
[118,"CUNDINAMARCA","SECRETARIA DE CIENCIA, TECNOLOGIA E INNOVACIÓN","ALEXANDER RIVEROS Y YAHIR ARCINIEGAS","LUIS MANUEL GONZALEZ",2018000100160,"FORMACIÓN DE CAPITAL HUMANO DE ALTO NIVEL PARA LA INVESTIGACIÓN, EL DESARROLLO TECNOLÓGICO Y LA INNOVACIÓN MAESTRÍAS DE INVESTIGACIÓN PARA DOCENTES DEL DEPARTAMENTO DE CUNDINAMARCA","\nINCREMENTAR LA DISPONIBILIDAD DE CAPITAL HUMANO CON CAPACIDADES DE INVESTIGACIÓN EN PRÁCTICAS PEDAGÓGICAS EN ESTABLECIMIENTOS EDUCATIVOS OFICIALES DEL DEPARTAMENTO DE CUNDINAMARCA.\n","CTEL",5217415747,3519725709,1697690038,43731,2019,"080 DE 2019","21/02/2020\t","OK","30/12/2019\t","30/12/2019\t","12/11/2021\t","OK","12/11/2021\t","CONTRATADO EN EJECUCIÓN",0.1638,0.45700000000000002]
[119,"CUNDINAMARCA","ENTIDAD DESIGNADA PARA LA SUPERVISIÓN DEL PROYECTO O PARA CONTRATAR LA INTERVENTORÍA-EMPRESAS PUBLICAS DE CUNDINAMARCA -EPC","ALEXANDER RIVEROS/LIYUGETH ALFONSO","PAULA ACUÑA",20181301010555,"CONSTRUCCIÓN DE UNIDADES SANITARIAS EN EL ÁREA RURAL DEL DEPARTAMENTO DE CUNDINAMARCA","DISMINUIR LOS NIVELES DE DISPOSICIÓN DE AGUAS RESIDUALES EN LAS VIVIENDAS RURALES.","VIVIENDA, CIUDAD Y TERRITORIO ",4999900475,4999900475,0,43378,2018,"010 DE 2018 - OCAD PAZ","24/01/2019\t","OK","14/02/2019\t","19/02/2019\t","01/04/2019\t","OK","23/07/2019\t","CONTRATADO EN EJECUCIÓN",0.87680000000000002,0.78310000000000002]
[120,"DESENTRALIZADOS","ICCU - GESPROY GB","DIEGO TORRES / JEIMY FORERO","GIOVANY QUEVEDO",2019000050002,"MEJORAMIENTO DE LA VÍA DEPARTAMENTAL LA VICTORIA (EL COLEGIO) SAN GABRIEL (VIOTÁ), TRAMO LA VICTORIA ALTO DE LA MULA, DEPARTAMENTO DE CUNDINAMARCA","MEJORAR LA INTERCOMUNICACIÓN TERRESTRE DE LA POBLACIÓN DE LOS MUNICIPIOS DE EL COLEGIO Y VIOTÁ EN EL DEPARTAMENTO DE CUNDINAMARCA.","TRANSPORTE",5745879373,5745879373,0,43532,2019,"086 de 2019","08/05/2019\t","OK","21/05/2019\t","30/04/2019\t","31/05/2019\t","OK","01/08/2019\t","CERRADO",0.97219999999999995,0.98519999999999996]
[121,"DESENTRALIZADOS","ICCU - GESPROY GB","DIEGO TORRES / JEIMY FORERO","GIOVANY QUEVEDO",2019000050003,"MEJORAMIENTO DE LA VÍA CÁQUEZA FOSCA, DEPARTAMENTO DE CUNDINAMARCA","MEJORAR LA INTERCOMUNICACIÓN TERRESTRE DE LA POBLACIÓN DE LOS MUNICIPIOS DE CÁQUEZA Y FOSCA EN EL DEPARTAMENTO DE CUNDINAMARCA","TRANSPORTE",4049029755,4049029755,0,43585,2019,"088 de 2019","14/06/2019\t","OK","29/08/2019\t","29/08/2019\t","11/09/2019\t","OK","29/10/2019\t","CERRADO",0.93269999999999997,0.98540000000000005]
[122,"DESENTRALIZADOS","ICCU - GESPROY GB","DIEGO TORRES / JEIMY FORERO","GIOVANY QUEVEDO",2019000050005,"MEJORAMIENTO DE LA VÍA FÓMEQUE UBAQUE, DEPARTAMENTO DE CUNDINAMARCA","MEJORAR LA INTERCOMUNICACIÓN TERRESTRE DE LA POBLACIÓN DE LOS MUNICIPIOS DE CHOACHÍ, FÓMEQUE Y UBAQUE EN EL DEPARTAMENTO DE CUNDINAMARCA.","TRANSPORTE",16514204213,14057373703,2456830510,43629,2019,"089 DE 2019","27/08/2019\t","OK","29/08/2019\t","29/08/2019\t","03/09/2019\t","OK ","31/10/2019\t","CERRADO",0.99919999999999998,0.99919999999999998]
[123,"DESENTRALIZADOS","ICCU - GESPROY GB","DIEGO TORRES / JEIMY FORERO","GIOVANY QUEVEDO",2019000050011,"MEJORAMIENTO DE LA VÍA SUPATÁ - PACHO, DEPARTAMENTO DE CUNDINAMARCA","MEJORAR LA INTERCOMUNICACIÓN TERRESTRE DE LA POBLACIÓN DE LOS MUNICIPIOS DE PACHO, SUPATÁ Y VERGARA EN EL DEPARTAMENTO DE CUNDINAMARCA.","TRANSPORTE",7339441010,7339441010,0,43585,2019,"088 DE 2019","04/06/2019\t","OK","03/07/2019\t","31/05/2019\t","04/07/2019\t","OK","04/09/2019\t","CONTRATADO EN EJECUCIÓN",0.71309999999999996,0.71899999999999997]
[124,"DESENTRALIZADOS","ICCU - GESPROY GB","DIEGO TORRES / JEIMY FORERO","GIOVANY QUEVEDO",2019000050013,"CONSTRUCCIÓN DE LA PLAZA DE MERCADO DEL MUNICIPIO DE CHOACHÍ CUNDINAMARCA","FORTALECER LOS CANALES DE COMERCIALIZACIÓN DE LOS PRODUCTOS AGROPECUARIOS EN LOS MUNICIPIOS DE CHOACHÍ, UBAQUE Y FÓMEQUE EN EL DEPARTAMENTO DE CUNDINAMARCA.","AGRICULTURA ",4481109943.3100004,3152125044,1328984899.3100004,43687,2019,"090 DE 2019","04/09/2019\t","OK",43714,"05/08/2019\t","25/09/2019\t","OK","18/11/2019\t","CONTRATADO EN EJECUCIÓN",1,0.67859999999999998]
[125,"DESENTRALIZADOS","ICCU - GESPROY GB","DIEGO TORRES / JEIMY FORERO","GIOVANY QUEVEDO",2019000050016,"MEJORAMIENTO DE LA VÍA ANOLAIMA CORRALEJAS (INSPECCIÓN DE CORRALEJAS), DEPARTAMENTO DE CUNDINAMARCA","MEJORAR LA INTERCOMUNICACION TERRESTRE DE LA POBLACION DE LOS MUNICIPIOS DE ALBAN, ANOLAIMA Y QUIPILE EN EL DEPARTAMENTO DE CUNDINAMARCA","TRANSPORTE",6898362469,5718724028,1179638441,43629,2019,"089 DE 2019","27/08/2019\t","OK","29/08/2019\t","05/08/2019\t","03/09/2019\t","OK","05/11/2019\t","CERRADO",0.99850000000000005,0.99960000000000004]
[126,"CUNDINAMARCA","SECRETARIA DE EDUCACIÓN","YAHIR ARCINIEGAS Y ALEXANDER RIVEROS","PABLO CAJAMARCA",2019000050020,"FORTALECIMIENTO DE LA PERMANENCIA DE LOS ESTUDIANTES PARA EL AÑO 2019 EN LOS MUNICIPIOS DEL DEPARTAMENTO DE CUNDINAMARCA","INCREMENTAR LOS NIVELES DE PERMANENCIA DE LOS NIÑOS, NIÑAS Y ADOLESCENTES QUE ASISTEN A LOS ESTABLECIMIENTOS EDUCATIVOS OFICIALES DECUNDINAMARCA","EDUCACIÓN",20536293937,20536293937,0,43629,2019,"089 DE 2019","26/06/2019\t","OK","27/06/2019\t","27/06/2019\t","26/06/2019\t","OK","26/06/2019\t","TERMINADO",1,0.9103]
[127,"DESENTRALIZADOS","ICCU - GESPROY GB","DIEGO TORRES / JEIMY FORERO","GIOVANY QUEVEDO",2019000050023,"MEJORAMIENTO DE LA VÍA LENGUAZAQUE - VILLAPINZÓN, DEPARTAMENTO DE CUNDINAMARCA","MEJORAR LA INTERCOMUNICACIÓN TERRESTRE DE LA POBLACIÓN DE LOS MUNICIPIOS DE LENGUAZAQUE Y VILLAPINZÓNEN EL DEPARTAMENTO DE CUNDINAMARCA","TRANSPORTE",8636278689,7310087087,1326191602,43629,2019,"089 DE 2019","27/08/2019\t","OK","29/08/2019\t","29/08/2019\t","03/09/2019\t","OK","15/11/2019\t","TERMINADO",1,0.83830000000000005]
[128,"CUNDINAMARCA","SECRETARIA DE AGRICULTURA","DIEGO TORRES/VALENTINA PORTILLO","JAVIER HERREDIA",2019000050027," MEJORAMIENTO DE LA COMPETITIVIDAD  DE LA CADENA PRODUCTIVA DE CACAO EN EL DEPARTAMENTO DE CUNDINAMARCA","MEJORAR EL CULTIVO DE CACAO Y BENEFICIO DEL GRANO, FORTALECIENDO PRODUCTORES AGRÍCOLAS A TRAVÉS DEL ACOMPAÑAMIENTO TÉCNICO Y LA ADOPCIÓN DE TECNOLOGÍA EN LOS PROCESOS DE ESTABLECIMIENTO, SOSTENIMIENTO Y POST- COSECHA DEL CULTIVO.","AGRICULTURA ",5862983962,4397237971,1465745991,43819,2019,"098 DE 2019","24/04/2020\t","OK","04/05/2020\t","04/05/2020\t","24/06/2020\t","VALOR DE ACTIVIDADES SUPERIOR A VALOR TOTAL PROGRAMADO","24/06/2020\t","PARA CIERRE",1,1]
[129,"DESENTRALIZADOS","ICCU - GESPROY GB","DIEGO TORRES / JEIMY FORERO","GIOVANY QUEVEDO",2019000050029,"MEJORAMIENTO DE LA VÍA GACHETÁ - GAMA, DEPARTAMENTO DE CUNDINAMARCA","MEJORAR LA INTERCOMUNICACIÓN TERRESTRE DE LA POBLACIÓN DE LOS MUNICIPIOS DE GACHETÁ Y GAMA EN EL DEPARTAMENTO DE CUNDINAMARCA","TRANSPORTE",5477582208,5322582208,{"$f":"J131-K131","v":155000000},43629,2019,"089 DE 2019","27/08/2019\t","OK","29/08/2019\t","29/08/2019\t","03/09/2019\t","OK","31/10/2019\t","TERMINADO",0.95509999999999995,0.9425]
[130,"CUNDINAMARCA","SECRETARIA DE SALUD","DAYANA FERNANDEZ Y EDGAR YAHIR ARCINIEGAS","OLGA LUCIA GARZON",2019000050036,"ADQUISICIÓN DE AMBULANCIAS PARA EL FORTALECIMIENTO DE LA RED HOSPITALARIA DEL DEPARTAMENTO CUNDINAMARCA","MEJORAR LA PRESTACIÓN DEL SERVICIO DE TRANSPORTE ASISTENCIAL DE URGENCIAS DE SALUD.","SALUD Y PROTECCIÓN SOCIAL",42966037310,2385000000,{"$f":"J132-K132","v":40581037310},43656,2019,"090 DE 2019","27/08/2019\t","OK","29/08/2019\t","29/08/2019\t","03/09/2019\t","OK","11/10/2019\t","CERRADO",1,0.82809999999999995]
[131,"CUNDINAMARCA","UNIDAD ADMINISTRATIVA DE GESTIÓN DEL RIESGO.","DIEGO TORRES/VALENTINA PORTILLO","GINNA HERRERA",2019000050037," FORTALECIMIENTO DEL SISTEMA DEPARTAMENTAL PARA LA GESTIÓN DEL RIESGO DE DESASTRES DEL DEPARTAMENTO DE CUNDINAMARCA","FORTALECER OPERATIVAMENTE LOS ORGANISMOS DE SOCORRO PARA GARANTIZAR LA OPORTUNA ATENCIÓN DE EMERGENCIAS DENTRO DEL DEPARTAMENTO","PRESIDENCIA DE LA REPÚBLICA",24666685502,4936307506,19730377996,43748,2019,"094 DE 2019","DESAPROBADO","DESAPROBADO","DESAPROBADO","DESAPROBADO","DESAPROBADO","DESAPROBADO","DESAPROBADO","DESAPROBADO",0,0]
[132,"ENTIDAD APORTANTE RECURSOS","MEDICINA LEGAL Y CIENCIAS FORENSES","ALEXANDER RIVEROS","MARTIN SEPULVEDA",2019000050025,"ESTUDIOS Y DISEÑOS PARA LA CONSTRUCCIÓN DE LA SEDE DE MEDICINA LEGAL EN EL DEPARTAMENTO DE CUNDINAMARCA","REALIZAR ESTUDIOS Y DISEÑOS TÉCNICOS PARA LA CONSTRUCCIÓN Y DOTACIÓN DE LA SEDE SERVICIOS FORENSES DEL REGIONAL ORIENTE PARA EL DEPARTAMENTO CUNDINAMARCA","FISCALIA",904521100,904521100,0,43677,2019,"091 DE 2019","31/01/2020\t","OK","30/03/2020\t","04/12/2019\t","07/10/2020\t","OK","19/10/2020\t","TERMINADO",1,1]
[133,"CUNDINAMARCA","SECRETARIA DE MINAS, ENERGIA Y GAS","DIEGO TORRES / LIYUGETH ALFONSO","JAHIR HERNANDEZ",2019000050039," ESTUDIO Y DISEÑO PARA LA CONSTRUCCIÓN DE REDES ELÉCTRICAS AÉREAS EN ZONAS RURALES DEL DEPARTAMENTO DE CUNDINAMARCA","\nOBJETIVO PROYECTO\nREALIZAR ESTUDIO Y DISEÑO TÉCNICO PARA LA CONSTRUCCIÓN DE REDES ELÉCTRICAS AÉREAS DE MEDIA Y BAJA TENSIÓN EN ZONA RURAL DE 20 MUNICIPIOS DEL DEPARTAMENTO DE CUNDINAMARCA.","MINAS Y ENERGÍA",1616407501,1616407501,0,43714,2019,"092 DE 2019","09/12/2019\t","OK","NO HAY DATO","07/03/2020\t","NO HAY DATO","HACE FALTA ALCANCE DEL PROYECTO","NO HAY DATO","DESAPROBADO",0,0]
[134,"CUNDINAMARCA","SECRETARIA DE EDUCACIÓN","YAHIR ARCINIEGAS Y ALEXANDER RIVEROS","GENNY PADILLA",2019000050044,"FORTALECIMIENTO A LA ESTRATEGIA DE ALIMENTACIÓN ESCOLAR PARA MUNICIPIOS NO CERTIFICADOS, VIGENCIA 2019 DEL DEPARTAMENTO DE CUNDINAMARCA","\nOBJETIVO PROYECTO\nINCREMENTAR LOS NIVELES DE PERMANENCIA DE LOS NIÑOS, NIÑAS, ADOLESCENTES Y JÓVENES EN LA JORNADA ACADÉMICA QUE ASISTEN A LOS ESTABLECIMIENTOS EDUCATIVOS OFICIALES EN LA ENTIDAD TERRITORIAL ETC CUNDINAMARCA","EDUCACIÓN",18301749135,18301749135,0,43656,2019,"090 DE 2019",43685,"OK","13/08/2019\t",43690,43739,"OK",43739,"CERRADO",0.2152,0.53269999999999995]
[135,"DESENTRALIZADOS","ICCU - GESPROY GB","DIEGO TORRES / JEIMY FORERO","GIOVANY QUEVEDO",2019000050047,"MEJORAMIENTO DE LA VÍA SUSA - CARMEN DE CARUPA, DEPARTAMENTO DE CUNDINAMARCA","MEJORAR LA INTERCOMUNICACIÓN TERRESTRE DE LA POBLACIÓN DE LOS MUNICIPIOS DE SUSA Y CARMEN DE CARUPA EN EL DEPARTAMENTO DE CUNDINAMARCA.","TRANSPORTE",5203497467.6199999,4131178258,1072319209.6199999,43677,2019,"091 DE 2019",43915,"OK","31/03/2020\t","19/10/2019\t","16/04/2020\t","OK","06/07/2020\t","TERMINADO",1,0.79390000000000005]
[136,"DESENTRALIZADOS","ICCU - GESPROY GB","DIEGO TORRES / JEIMY FORERO","GIOVANY QUEVEDO",2019000050056,"MEJORAMIENTO DE LA VÍA QUE CONDUCE DEL MUNICIPIO DE NIMAIMA AL MUNICIPIO DE NOCAIMA, DEPARTAMENTO DE CUNDINAMARCA","MEJORAR LA INTERCOMUNICACIÓN TERRESTRE DE LA POBLACIÓN ENTRE LOS MUNICIPIOS DE NIMAIMA Y NOCAIMA EN EL DEPARTAMENTO DE CUNDINAMARCA","TRANSPORTE",5082491569.8000002,4614214508,468277061.80000019,43748,2019,"094 DE 2019","02/12/2019\t","OK","03/12/2019\t","27/11/2019\t","04/12/2019\t","OK","06/02/2020\t","TERMINADO",1,0.87219999999999998]
[137,"DESENTRALIZADOS","IDECUT","DIEGO TORRES Y YAHIR ARCINIEGAS","MARTHA VANEGAS",2019000050059,"FORTALECIMIENTO A LAS ESCUELAS MUNICIPALES DE MÚSICA, DANZA, TEATRO Y ARTES PLÁSTICAS Y VISUALES EN EL DEPARTAMENTO DE CUNDINAMARCA","FORTALECER LOS PROCESOS DE FORMACIÓN ARTÍSTICA Y DE GESTIÓN CULTURAL DE LOS MUNICIPIOS DEL DEPARTAMENTO DE CUNDINAMARCA.","CULTURA ",1972606058,1972606058,0,43748,2019,"094 DE 2019","22/05/2020\t","OK","28/07/2020\t","28/07/2020\t","02/07/2021\t","OK","20/08/2021\t","CERRADO",1,0.96099999999999997]
[138,"DESENTRALIZADOS","ICCU - GESPROY GB","DIEGO TORRES / JEIMY FORERO","GIOVANY QUEVEDO",2019000050060,"ESTUDIOS Y DISEÑOS DE VÍAS PARA MEJORAR LA COMPETITIVIDAD DEL DEPARTAMENTO DE CUNDINAMARCA","MEJORAR LA PLANIFICACIÓN DE LA INVERSIÓN SOBRE LA MALLA VIAL DE IMPORTANCIA ESTRATÉGICA EN EL DEPARTAMENTO DE CUNDINAMARCA.","TRANSPORTE",7089369627,7089369627,0,43714,2019,"092 DE 2019","14/11/2019\t","OK","03/12/2019\t","14/11/2019\t","03/12/2019\t","OK","31/12/2019\t","TERMINADO",0.98650000000000004,0.95530000000000004]
[139,"CUNDINAMARCA","SECRETARIA DE MINAS, ENERGIA Y GAS","DIEGO TORRES / LIYUGETH ALFONSO","JAHIR HERNANDEZ",2019000050073,"AMPLIACIÓN DE LA COBERTURA DEL SERVICIO DE GAS COMBUSTIBLE DOMICILIARIO A TRAVÉS DE LA FINANCIACIÓN DE LA CONEXIÓN Y LA RED INTERNA PARA USUARIOS DE BARRIOS PERIFÉRICOS, VEREDAS Y CENTROS POBLADOS DEL DEPARTAMENTO DE CUNDINAMARCA","DISMINUIR LOS ÍNDICES DE POBREZA MEDIANTE LA CONEXIÓN Y LA RED INTERNA DEL SERVICIO DE GAS COMBUSTIBLE DOMICILIARIO A USUARIOS EN LAS BARRIOS PERIFÉRICOS, VEREDAS Y CENTROS POBLADOS DE LOS MUNICIPIOS DEL DEPARTAMENTO DE CUNDINAMARCA.\n","MINAS Y ENERGÍA",12461377100,6651376060,5810001040,43805,2019,"097 DE 2019","06/02/2020\t","OK","11/03/2020\t","11/03/2020\t","18/03/2020\t","OK","18/03/2020\t","TERMINADO",0.93589999999999995,1.0329999999999999]
[140,"DESENTRALIZADOS","ICCU - GESPROY GB","DIEGO TORRES / JEIMY FORERO","GIOVANY QUEVEDO",2019000050075,"MEJORAMIENTO DE LA VÍA QUE CONDUCE DEL MUNICIPIO DE VIANI AL MUNICIPIO DE CHAGUANI, (DE LA Y DE SAN VICENTE A CHAGUANI), DEPARTAMENTO DE CUNDINAMARCA","MEJORAR LA INTERCOMUNICACIÓN TERRESTRE DE LA POBLACIÓN ENTRE LOS MUNICIPIOS DE VIANÍ, SAN JUAN DE RIO SECO Y CHAGUANÍ EN EL DEPARTAMENTO DE CUNDINAMARCA.","TRANSPORTE",7504443091,7504443091,0,43819,2019,"098 DE 2019","06/03/2020\t","OK","06/04/2020\t","06/04/2020\t","16/04/2020\t","OK","21/07/2020\t","TERMINADO",1,0.9516]
[141,"DESENTRALIZADOS","ICCU - GESPROY GB","DIEGO TORRES / JEIMY FORERO","GIOVANY QUEVEDO",2019000050079,"MEJORAMIENTO DE LA VÍA SERREZUELA - EL TRIUNFO, MUNICIPIO DE LA CALERA, DEPARTAMENTO DE CUNDINAMARCA","MEJORAR LA INTERCOMUNICACIÓN TERRESTRE DE LA POBLACIÓN DE LOS MUNICIPIOS DE LA CALERA, CHOACHI Y SOPÓ EN EL DEPARTAMENTO DE CUNDINAMARCA","TRANSPORTE",7614258187,7614258187,0,43748,2019,"094 DE 2019","22/11/2019\t","OK","03/12/2019\t","27/11/2019\t","05/12/2019\t","OK","05/02/2020\t","TERMINADO",0.94289999999999996,0.86319999999999997]
[142,"DESENTRALIZADOS","ICCU - GESPROY GB","DIEGO TORRES / JEIMY FORERO","GIOVANY QUEVEDO",2019000050085,"MEJORAMIENTO DE LA VÍA QUE CONDUCE DEL MUNICIPIO DE LA MESA AL MUNICIPIO DE CACHIPAY, (DE LA INSPECCIÓN DE PEÑA NEGRA AL MUNICIPIO DE CACHIPAY), DEPARTAMENTO DE CUNDINAMARCA","MEJORAR LA INTERCOMUNICACIÓN TERRESTRE DE LA POBLACIÓN ENTRE LOS MUNICIPIOS DE LA MESA Y CACHIPAY EN EL DEPARTAMENTODE CUNDINAMARCA.","TRANSPORTE",7019896083,7019896083,0,43852,2019,"96 DE 2019","05/03/2020\t","OK","30/03/2020\t","27/03/2020\t","16/04/2020\t","OK","08/07/2020\t","CONTRATADO EN EJECUCIÓN",0.71350000000000002,0.6774]
[143,"ENTIDAD APORTANTE RECURSOS","TV ANDINA","ALEXANDER RIVEROS","EDWIN",2019000050064,"PROTECCIÓN Y PRESERVACIÓN DEL PATRIMONIO AUDIOVISUAL COLOMBIANO QUE SE ENCUENTRA EN EL CANAL PÚBLICO TEVEANDINA LOCALIZADO EN EL DEPARTAMENTO DE  CUNDINAMARCA","RECUPERAR EL PATRIMONIO AUDIOVISUAL EN EL CANAL PÚBLICO TEVEANDINA","CULTURA ",5923285198,"$ 5.597.840.098",325445100,43774,2019,"095 DE 2019","24/01/2020\t","OK","05/03/2020\t","27/12/2019\t","20/03/2020\t","OK","05/03/2020\t","CERRADO",1,0.99350000000000005]
[144,"ENTIDAD APORTANTE RECURSOS","UNAD","ALEXANDER RIVEROS","ANDRES ACOSTA",2019000050069,"MEJORAMIENTO DE INFRAESTRUCTURA FÍSICA, DOTACIÓN DE MOBILIARIO Y EQUIPAMIENTO TECNOLÓGICO DE LA UNIVERSIDAD NACIONAL ABIERTA Y A DISTANCIA EN MUNICIPIOS DEL DEPARTAMENTO DE CUNDINAMARCA","MEJORAR LAS CONDICIONES EDUCATIVAS PARA LA FORMACIÓN Y EL DESARROLLO DE COMPETENCIAS BÁSICAS DE ESTUDIANTES EN EDUCACIÓN SUPERIOR DE LA UNAD EN EL DEPARTAMENTO DE CUNDINAMARCA.","EDUCACIÓN",16011115461,16011115461,0,43774,2019,"095 DE 2019","10/02/2020\t","OK","26/02/2020\t","01/02/2020\t","25/03/2020\t","OK","06/05/2020\t","CERRADO",1,1]
[145,"ENTIDAD APORTANTE RECURSOS","U TECNOLOGICA DE PEREIRA","YAHIR ARCINIEGAS","LUIS MANUEL GONZALEZ",2019000100009,"FORMACIÓN DE CAPITAL HUMANO DE ALTO NIVEL UNIVERSIDAD TECNOLÓGICA DE PEREIRA  NACIONAL","INCREMENTAR LAS CAPACIDADES DEL TALENTO HUMANO EN INVESTIGACIÓN DE CALIDAD E IMPACTO, APOYANDO EL PROGRAMA DE FORMACIÓN EN DOCTORADOS\n","CTEL",4360028215,3950208215,409820000,43781,2019,"083 DE 2019","29/01/2020\t","OK","17/03/2020\t","21/02/2020\t","10/07/2020\t","OK","14/05/2020\t","CONTRATADO EN EJECUCIÓN",0.62090000000000001,0.65339999999999998]
[146,"ENTIDAD APORTANTE RECURSOS","U EAN","YAHIR ARCINIEGAS","LUIS MANUEL GONZALEZ",2019000100015,"FORMACIÓN DE CAPITAL HUMANO DE ALTO NIVEL - UNIVERSIDAD EAN -  NACIONAL","INCREMENTAR LAS CAPACIDADES DEL TALENTO HUMANO EN INVESTIGACIÓN DE CALIDAD E IMPACTO, APOYANDO EL PROGRAMA DE FORMACIÓN EN DOCTORADOS\n","CTEL",1294375000,1250000000,44375000,43830,2019,"087 DE 2019","04/05/2020\t","OK","13/07/2020\t","31/07/2020\t","26/06/2020\t","OK","16/07/2020\t","CONTRATADO EN EJECUCIÓN",0.70289999999999997,0.69020000000000004]
[147,"ENTIDAD APORTANTE RECURSOS","U CATOLICA","YAHIR ARCINIEGAS","LUIS MANUEL GONZALEZ",2019000100022,"FORMACIÓN DE CAPITAL HUMANO DE ALTO NIVEL - UNIVERSIDAD CATÓLICA DE COLOMBIA -  NACIONAL","INCREMENTAR LAS CAPACIDADES DEL TALENTO HUMANO EN INVESTIGACIÓN DE CALIDAD E IMPACTO, APOYANDO EL PROGRAMA DE FORMACIÓN EN DOCTORADOS\n","CTEL",343595000,299220000,44375000,43812,2019,"086 DE 2019","14/04/2020\t","OK","10/06/2020\t","17/07/2020\t","13/07/2020\t","OK","11/06/2020\t","CONTRATADO EN EJECUCIÓN",0.84750000000000003,0.83789999999999998]
[148,"ENTIDAD APORTANTE RECURSOS","UNIVERSIDAD MILITAR NUEVA GRANADA","YAHIR ARCINIEGAS","LUIS MANUEL GONZALEZ",2019000100025,"FORMACIÓN DE CAPITAL HUMANO DE ALTO NIVEL UNIVERSIDAD MILITAR NUEVA GRANADA  NACIONAL","INCREMENTAR LAS CAPACIDADES DEL TALENTO HUMANO EN INVESTIGACIÓN DE CALIDAD E IMPACTO, APOYANDO EL PROGRAMA DE FORMACIÓN EN DOCTORADOS\n","CTEL",294375000,250000000,44375000,43812,2019,"086 DE 2019","06/05/2020\t","OK","26/06/2020\t","22/04/2020\t","05/06/2020\t","OK","15/07/2020\t","CONTRATADO EN EJECUCIÓN",0.64019999999999999,0.69910000000000005]
[149,"ENTIDAD APORTANTE RECURSOS","UNIVERSIDAD NACIONAL DE COLOMBIA","YAHIR ARCINIEGAS","LUIS MANUEL GONZALEZ",2019000100026,"FORMACIÓN DE CAPITAL HUMANO DE ALTO NIVEL UNIVERSIDAD NACIONAL DE COLOMBIA   NACIONAL","INCREMENTAR LAS CAPACIDADES DEL TALENTO HUMANO EN INVESTIGACIÓN DE CALIDAD E IMPACTO, APOYANDO EL PROGRAMA DE FORMACIÓN EN DOCTORADOS\n","CTEL",21162064500,20233937500,928127000,43781,2019,"083 DE 2019","03/02/2020\t","OK","01/04/2020\t","12/03/2020\t","07/04/2020\t","OK","26/05/2020\t","CONTRATADO EN EJECUCIÓN",0.6159,0.6573]
[150,"ENTIDAD APORTANTE RECURSOS","U DISTRITAL","YAHIR ARCINIEGAS","LUIS MANUEL GONZALEZ",2019000100027,"FORMACIÓN DE CAPITAL HUMANO DE ALTO NIVEL EN DOCTORADO PARA EL DESARROLLO REGIONAL, UNIVERSIDAD DISTRITAL FRANCISCO JOSÉ DE CALDAS, A NIVEL  NACIONAL","INCREMENTAR LAS CAPACIDADES DEL TALENTO HUMANO EN INVESTIGACIÓN DE CALIDAD E IMPACTO, APOYANDO EL PROGRAMA DE FORMACIÓN EN DOCTORADOS\n","CTEL",1218668841,1113595753,105073088,43798,2019,"085 DE 2019","20/05/2020\t","OK","09/07/2020\t","05/06/2020\t","30/06/2020\t","OK","04/08/2020\t","CONTRATADO EN EJECUCIÓN",0.59330000000000005,0.47670000000000001]
[151,"ENTIDAD APORTANTE RECURSOS","U JAVERIANA","YAHIR ARCINIEGAS","LUIS MANUEL GONZALEZ",2019000100028,"FORMACIÓN DE CAPITAL HUMANO DE ALTO NIVEL PONTIFICIA UNIVERSIDAD JAVERIANA SEDE CENTRAL  NACIONAL","INCREMENTAR LAS CAPACIDADES DEL TALENTO HUMANO EN INVESTIGACIÓN DE CALIDAD E IMPACTO, APOYANDO EL PROGRAMA DE FORMACIÓN EN DOCTORADOS\n","CTEL",6524500000,6524500000,0,43781,2019,"083 DE 2019","26/02/2020\t","OK","02/07/2020\t","18/05/2020\t","28/04/2020\t","OK","08/05/2020\t","CONTRATADO EN EJECUCIÓN",0.68010000000000004,0.67510000000000003]
[152,"ENTIDAD APORTANTE RECURSOS","U DE LOS ANDES","YAHIR ARCINIEGAS","LUIS MANUEL GONZALEZ",2019000100036,"FORMACIÓN  DE CAPITAL HUMANO DE ALTO NIVEL UNIVERSIDAD DE LOS ANDES   NACIONAL","INCREMENTAR LAS CAPACIDADES DEL TALENTO HUMANO EN INVESTIGACIÓN DE CALIDAD E IMPACTO, APOYANDO EL PROGRAMA DE FORMACIÓN EN DOCTORADOS\n","CTEL",2814671307,2748000000,66671307,43798,2019,"085 DE 2019","31/01/2020\t","OK","04/03/2020\t","27/04/2020\t","28/02/2020\t","OK","04/03/2020\t","CONTRATADO EN EJECUCIÓN",0.76729999999999998,0.77690000000000003]
[153,"ENTIDAD APORTANTE RECURSOS","UNIVERSIDAD NACIONAL DE COLOMBIA","YAHIR ARCINIEGAS","LUIS MANUEL GONZALEZ",2019000100061,"FORTALECIMIENTO DE LA CAPACIDAD TECNOLÓGICA INSTALADA EN EL CENTRO AGROPECUARIO MARENGO PARA LA INVESTIGACIÓN EN LOS SISTEMAS AGROPRODUCTIVOS DEL TRÓPICO ALTO, BAJO EL EFECTO DE LA VARIABILIDAD Y CAMBIO CLIMÁTICO -  CUNDINAMARCA","SE ESPERA QUE EL MEJORAMIENTO EN LA INFRAESTRUCTURA DEL CENTRO AGROPECUARIO MARENGO (CAM) Y EN\nEQUIPAMIENTO PERMITA FORTALECER LAS COMPETENCIAS DE LOS PROFESIONALES EN FORMACIÓN DE DIFERENTES\nÁREAS (AGRÍCOLA, CIENCIAS BIOLÓGICAS, AGROINDUSTRIAL), ASÍ COMO GENERAR CONOCIMIENTO BÁSICO Y APLICADO\nMEDIANTE TRABAJOS DE INVESTIGACIÓN DE PREGRADO Y POSGRADO (TESIS DE MAESTRÍA Y DOCTORADO), A LA VEZ\nDESARROLLAR JORNADAS DE CAPACITACIÓN (DÍAS DE CAMPO, CHARLAS TÉCNICAS, SEMINARIOS). ","CTEL",2521388540,1994146760,527241780,43830,2019,"087 DE 2019","31/01/2020\t","OK","03/03/2020\t","27/04/2020\t","28/02/2020\t","OK","04/03/2020\t","CONTRATADO EN EJECUCIÓN",0.83560000000000001,0.56920000000000004]
[154,"CUNDINAMARCA","SECRETARIA DE CIENCIA, TECNOLOGIA E INNOVACIÓN","ALEXANDER RIVEROS Y YAHIR ARCINIEGAS","LUIS MANUEL GONZALEZ",2020000100137,"FORTALECIMIENTO DE LAS CAPACIDADES DE INVESTIGACIÓN Y DESARROLLO PARA ATENDER PROBLEMÁTICAS ASOCIADAS CON AGENTES BIOLÓGICOS PARA LA SALUD PÚBLICA, A TRAVÉS DEL MEJORAMIENTO DEL LABORATORIO DE SALUD PÚBLICA DE CUNDINAMARCA","MEJORAR LAS CAPACIDADES EN CTEI PARA ATENDER PROBLEMÁTICAS ASOCIADAS CON AGENTES BIOLÓGICOS DE ALTO RIESGO PARA LA SALUD HUMANA EN EL DEPARTAMENTO DE CUNDINAMARCA","CTEL",4506359274,4048003426,458355848,43966,2020,"093 DE 2020","27/07/2020\t","OK","09/09/2020\t","22/07/2020\t","16/01/2021\t","OK","09/10/2020\t","CONTRATADO EN EJECUCIÓN",0.70689999999999997,0.59599999999999997]
[155,"CUNDINAMARCA","SECRETARIA DE SALUD","DAYANA FERNANDEZ/ LIYUGETH ALFONSO","OLGA LUCIA GARZON",2020000050003,"ADQUISICIÓN DE AMBULANCIAS,EQUIPOS BIOMÉDICOS, ELEMENTOS DE PROTECCIÓN PERSONAL, ASEO Y DESINFECCIÓN PARA LA ATENCIÓN DE LA CALAMIDAD SANITARIA POR COVID-19 EN LAS E.S.E DEL DEPARTAMENTO DE   CUNDINAMARCA","ADQUIRIR AMBULANCIAS Y EQUIPOS MEDICOS PARA LA CALAMIDAD DEL COVID-19","SALUD Y PROTECCIÓN SOCIAL",43433295564,43433295564,0,43986,2020,"102 de 2020","30/06/2020\t","OK","10/08/2020\t","23/06/2020\t","23/07/2020\t","OK","25/07/2020\t","PARA CIERRE",0.54379999999999995,0.54759999999999998]
[156,"CUNDINAMARCA","UNIDAD ADMINISTRATIVA DE GESTIÓN DEL RIESGO.","DIEGO TORRES/VALENTINA PORTILLO","GINNA HERRERA",2020000050012,"ADQUISICIÓN DE ELEMENTOS DE PROTECCIÓN DE CONTAGIO DEL VIRUS COVID-19 PARA LOS CUERPOS OPERATIVOS DE EMERGENCIA, EN ATENCIÓN DE LA CALAMIDAD SANITARIA EN EL DEPARTAMENTO DE   CUNDINAMARCA","DISMINUIR EL RIESGO DE MORBILIDAD Y MORTALIDAD POR EXPOSICIÓN A CONTAGIO DEL VIRUS COVID-19 EN EL DEPARTAMENTO DE CUNDINAMARCA","GOBIERNO TERRITORIAL",5419592232,5419592232,0,43986,2020,"102 DE 2020","30/06/2020\t","OK","23/07/2020\t","23/06/2020\t","25/08/2020\t","OK","18/09/2020\t","CERRADO",0.67,0.67]
[157,"CUNDINAMARCA","SECRETARIA DE EDUCACIÓN","YAHIR ARCINIEGAS Y ALEXANDER RIVEROS","GENNY PADILLA",2020000050019,"FORTALECIMIENTO A LA ESTRATEGIA DE ALIMENTACIÓN ESCOLAR PARA EL AÑO 2020, EN LOS MUNICIPIOS DEL DEPARTAMENTO DE CUNDINAMARCA ","ALIMENTACIÓN ESCOLAR EN EL DEPARTAMENTO DE CUNDINAMARCA","EDUCACIÓN",26240955000,26240955000,0,44040,2020,"105 DE 2020","27/07/2020\t","OK","06/04/2021\t","11/08/2020\t","20/09/2020\t","OK","18/09/2020\t","CERRADO",1,0.995]
[158,"CUNDINAMARCA","SECRETARIA DE CIENCIA, TECNOLOGIA E INNOVACIÓN","ALEXANDER RIVEROS Y YAHIR ARCINIEGAS","LUIS MANUEL GONZALEZ",2020000100266,"GENERACIÓN DE ESPACIOS DE ENCUENTRO DE LA SOCIEDAD CON LA CIENCIA Y LA TECNOLOGÍA - UN VIAJE CON LA CIENCIA EN EL DEPARTAMENTO DE CUNDINAMARCA","GENERAR UN MECANISMO DE INNOVACIÓN SOCIAL INCLUYENTE DIRIGIDO A NIÑOS, NIÑAS Y JÓVENES CON EL FIN DE FORTALECER EL DESARROLLO DE PROCESOS DE APROPIACIÓN SOCIAL DE LA CIENCIA Y LA TECNOLOGÍA EN LOS MUNICIPIOS DEL DEPARTAMENTO DE CUNDINAMARCA.","CTEL",2241429590,2218862102,22567488,44111,2020,"098 DE 2020","16/06/2021\t","OK","30/06/2021\t","17/06/2021\t","26/08/2021\t","OK","12/10/2021\t","CONTRATADO EN EJECUCIÓN",0.76980000000000004,0.68330000000000002]
[159,"CUNDINAMARCA","SECRETARIA DE CIENCIA, TECNOLOGIA E INNOVACIÓN","ALEXANDER RIVEROS Y YAHIR ARCINIEGAS","LUIS MANUEL GONZALEZ",2020000100246,"FORTALECIMIENTO DE LA COMPETITIVIDAD DE LA CADENA PRODUCTIVA DE LA GUADUA POR MEDIO DEL DESARROLLO E IMPLEMENTACIÓN DE DOS (2) PAQUETES TECNOLÓGICOS PARA LA GENERACIÓN DE PRODUCTOS CON VALOR AGREGADO EN EL DEPARTAMENTO DE CUNDINAMARCA ","AUMENTAR LA COMPETITIVIDAD DE LOS PRODUCTORES, TRANSFORMADORES Y COMERCIANTES DE LA GUADUA DE CUNDINAMARCA. ","CTEL",3144525520,2294345776,850179744,44111,2020,"098 DE 2020","17/06/2021\t","OK","30/06/2021\t","17/06/2021\t","07/09/2021\t","OK","27/09/2021\t","CONTRATADO EN EJECUCIÓN",0.88529999999999998,0.61950000000000005]
[160,"ENTIDAD APORTANTE RECURSOS","CONNECT BOGOTA REGIÓN","YAHIR ARCINIEGAS","LUIS MANUEL GONZALEZ",2020000100078,"DISEÑO E IMPLEMENTACIÓN DE UN MODELO DE GESTIÓN DE CONOCIMIENTO, INNOVACIÓN Y TRANSFERENCIA DE TECNOLOGÍA CON APLICACIÓN EN EL SECTOR AGROPECUARIO Y AGROINDUSTRIAL EN EL DEPARTAMENTO DE CUNDINAMARCA ","MEJORAR LA COMPETITIVIDAD DE LOS SECTORES AGROPECUARIO Y AGROINDUSTRIAL EN CADENAS PRODUCTIVAS DEL DEPARTAMENTO DE CUNDINAMARCA, A TRAVÉS DEL DISEÑO E IMPLEMENTACIÓN DE UN SISTEMA DE TRANSFERENCIA DE CONOCIMIENTO, TECNOLOGÍA E INNOVACIÓN","CTEL",3438832990.73,3028251016.23,410581974.5,44111,2020,"098 DE 2020","27/12/2021\t","OK","11/01/2022\t","17/12/2021\t","31/12/2021\t","OK","22/02/2022\t","CONTRATADO EN EJECUCIÓN",0.34670000000000001,0.4158]
[161,"ENTIDAD APORTANTE RECURSOS","FEDERACIÓN NACIONAL DE CAFETEROS","YAHIR ARCINIEGAS","LUIS MANUEL GONZALEZ",2020000100205,"TRASLADO DE TECNOLOGÍAS INNOVADORAS A CAFICULTORES CON IMPACTO SOBRE LA CALIDAD DEL CAFÉ Y LA GESTIÓN DEL RECURSO HÍDRICO DURANTE EL PROCESO DE BENEFICIO EN ZONA CAFETERA DEL DEPARTAMENTO DE CUNDINAMARCA ","AUMENTAR LA ADOPCIÓN E IMPLEMENTACIÓN DE TECNOLOGÍAS DURANTE LOS PROCESOS DE COSECHA Y POSCOSECHA DEL CAFÉ PRODUCIDO EN MUNICIPIOS CAFETEROS EN EL DEPARTAMENTO DE CUNDINAMARCA.","CTEL",13783557324,12848931736,934625588,44111,2020,"098 DE 2020","28/06/2021\t","OK","15/12/2021\t","24/06/2021\t","16/12/2021\t","OK","20/12/2021\t","CONTRATADO EN EJECUCIÓN",0.2676,0.3458]
[162,"ENTIDAD APORTANTE RECURSOS","AGROSAVIA","YAHIR ARCINIEGAS","LUIS MANUEL GONZALEZ",2020000100197,"DESARROLLO DE BIOPLAGUICIDAS POTENCIADOS DE NUEVA GENERACIÓN PARA EL MEJORAMIENTO DE LA PRODUCTIVIDAD E INOCUIDAD DEL CULTIVO DE TOMATE Y CRUCÍFERAS EN EL DEPARTAMENTO DE CUNDINAMARCA ","DESARROLLAR Y OPTIMIZAR BIOINSUMOS EFICIENTES PARA EL MANEJO DE PLAGAS DE LAS HORTALIZAS (TOMATE, BRÓCOLI Y REPOLLO) PRODUCIDAS EN EL DEPARTAMENTO DE CUNDINAMARCA","CTEL",4583970033,3282745260,1301224773,44111,2020,"098 DE 2020","06/04/2021\t","OK","06/04/2021\t","06/04/2021\t","15/12/2021\t","OK","01/01/2022\t","CONTRATADO EN EJECUCIÓN",0.35510000000000003,0.35510000000000003]
[163,"ENTIDAD APORTANTE RECURSOS","UNIVERSIDAD NACIONAL DE COLOMBIA","YAHIR ARCINIEGAS","LUIS MANUEL GONZALEZ",2020000100240,"ESTUDIO DE PREFACTIBILIDAD PARA LA CREACIÓN DE UN CENTRO DE INNOVACIÓN Y DE PRODUCTIVIDAD PARA EL SECTOR AGROPECUARIO DE SABANA OCCIDENTE DE CUNDINAMARCA ","GENERAR ESPACIOS EFICIENTES PARA LA COORDINACIÓN Y DESARROLLO DE ACTIVIDADES DE CTEI EN BENEFICIO DEL SECTOR AGROPECUARIO DE SABANA OCCIDENTE DEL DEPARTAMENTO DE CUNDINAMARCA (FASE: PRE FACTIBILIDAD)","CTEL",1896154229,1707430133,188724096,44111,2020,"098 DE 2020","26/03/2021\t","OK","05/04/2021\t","13/01/2021\t","26/03/2021\t","OK","06/04/2021\t","CONTRATADO EN EJECUCIÓN",0.94059999999999999,0.82520000000000004]
[164,"ENTIDAD APORTANTE RECURSOS","UNIVERSIDAD DE CUNDINAMARCA","YAHIR ARCINIEGAS","LUIS MANUEL GONZALEZ",2020000100158,"FORTALECIMIENTO DE LA INFRAESTRUCTURA FÍSICA Y TECNOLÓGICA DEL CENTRO DE ESTUDIOS AGROAMBIENTALES DE LA UNIVERSIDAD DE CUNDINAMARCA AGROU CUNDINAMARCA ","FORTALECER LA INFRAESTRUCTURA FÍSICA Y TECNOLÓGICA DEL CENTRO DE ESTUDIOS AGROAMBIENTALES DE LA UNIVERSIDAD DE CUNDINAMARCA – AGROUCUNDINAMARCA","CTEL",2024433669,1997753509,26680160,44111,2020,"098 DE 2020","SIN DATO","OK","SIN DATO","SIN DATO","SIN DATO","SIN VALORES","SIN DATO","CONTRATADO EN EJECUCIÓN",0.58620000000000005,7.9000000000000008E-3]
[165,"ENTIDAD APORTANTE RECURSOS","ZIPAQUIRA","YESID CASTAÑO / JEIMY FORERO",null,2020000050013,"MEJORAMIENTO DE LA VÍA QUE COMUNICA A LOS MUNICIPIOS DE ZIPAQUIRÁ Y TOCANCIPÁ, TRAMO BARANDILLAS - LA FUENTE, DEPARTAMENTO DE CUNDINAMARCA","MEJORAMIENTO DE LA MOVILIDAD DE LA VÍA QUE COMUNICA A LOS MUNICIPIOS DE ZIPAQUIRA Y TOCANCIPA","TRANSPORTE","6.788.620.869,00",{"$f":"J167","v":"6.788.620.869,00"},0,44152,2020,"107 del 2020","02/02/2021\t","OK","04/03/2021\t","04/03/2021\t","16/04/2021\t","OK","02/07/2021\t","CONTRATADO EN EJECUCIÓN",0.60589999999999999,0.86439999999999995]
[166,"ENTIDAD APORTANTE RECURSOS","ZIPAQUIRA","YESID CASTAÑO / JEIMY FORERO",null,2020000050015,"MEJORAMIENTO DE LA VÍA ZIPAQUIRÁ - SAN JORGE - TABIO DEPARTAMENTO DE CUNDINAMARCA","MEJORAMIENTO DE LA MOVILIDAD DE LA VÍA QUE COMUNICA A LOS MUNICIPIOS DE ZIPAQUIRA Y TABIO","TRANSPORTE",7458735075,{"$f":"J168","v":7458735075},0,44152,2020,"107 del 2020","15/07/2021\t","OK",44415,"22/10/2021\t","01/09/2021\t","OK","20/02/2022\t","CONTRATADO EN EJECUCIÓN",0.23319999999999999,0]
[167,"CUNDINAMARCA","SECRETARIA DE CIENCIA, TECNOLOGIA E INNOVACIÓN","ALEXANDER RIVEROS Y YAHIR ARCINIEGAS","LUIS MANUEL GONZALEZ",2020000100695,"DESARROLLO, TRANSFERENCIA DE TECNOLOGÍA Y CONOCIMIENTO PARA LA INNOVACIÓN QUE FORTALEZCAN CAPACIDADES COMUNITARIAS EN LA COMPRENSIÓN Y/O MITIGACIÓN DE LOS PROBLEMAS DE VIOLENCIAS BASADAS EN GÉNERO, DERIVADAS DE LA EMERGENCIA POR COVID 19, EN CUNDINAMARCA",null,"CTEL",3100000000,3000000000,100000000,44183,2020,"103 DE 2020","20/05/2021\t","OK","30/06/2021\t","17/06/2021\t",44483,"OK","16/09/2021\t","CONTRATADO EN EJECUCIÓN",0.59240000000000004,0.90910000000000002]
[168,"CUNDINAMARCA","SECRETARIA DE CIENCIA, TECNOLOGIA E INNOVACIÓN","ALEXANDER RIVEROS Y YAHIR ARCINIEGAS","LUIS MANUEL GONZALEZ",2020000100650,"FORTALECIMIENTO DE CAPACIDADES DE CTEI PARALA INNOVACION EDUCATIVA EN LOS NIVELES DE BÁSICA Y\nMEDIA, MEDIANTE USO DE TICS EN INSTITUCIONES EDUCATIVAS OFICIALES DE LOS MUNICIPIOS NO\nCERTIFICADOS DEL DEPARTAMENTO DE CUNDINAMARCA",null,"CTEL",10804663122,9999728696,804934426,44183,2020,"103 DE 2020","27/05/2021\t","OK","30/06/2021\t","30/06/2021\t","12/08/2021\t","OK","20/10/2021\t","CONTRATADO EN EJECUCIÓN",0.22939999999999999,0.123]
[169,"CUNDINAMARCA","SECRETARIA DE CIENCIA, TECNOLOGIA E INNOVACIÓN","ALEXANDER RIVEROS Y YAHIR ARCINIEGAS","LUIS MANUEL GONZALEZ",2020000100696,"FORTALECIMIENTO DE CAPACIDADES DE CTEI PARA LA REACTIVACIÓN ECONÓMICA Y LA TRANSFORMACIÓN\nPRODUCTIVA EN CUNDINAMARCA",null,"CTEL",7370634083,6974290175,396343908,44183,2020,"103 DE 2020","27/05/2021\t","OK","02/08/2021\t","17/06/2021\t","17/08/2021\t","OK\n","27/08/2021\t","CONTRATADO EN EJECUCIÓN",0.5978,0.85089999999999999]
[170,"CUNDINAMARCA","SECRETARIA DE CIENCIA, TECNOLOGIA E INNOVACIÓN","ALEXANDER RIVEROS Y YAHIR ARCINIEGAS","LUIS MANUEL GONZALEZ",2020000100649,"FORTALECIMIENTO DE CAPACIDADES DE CTEI PARA EL RELACIONAMIENTO ESCUELA - CONTEXTO RURAL MEDIANTE LA APROPIACIÓN Y USO DE LAS TIC EN EL MUNICIPIO DE SIBATÉ, DEPARTAMENTO DE CUNDINAMARCA",null,"CTEL",4292464018,2645464018,1647000000,44183,2020,"103 DE 2020","20/05/2021\t","OK","30/06/2021\t","30/06/2021\t","27/09/2021\t","OK","13/10/2021\t","CONTRATADO EN EJECUCIÓN",0.81559999999999999,0.77559999999999996]
[171,"ENTIDAD APORTANTE RECURSOS","FUNDACION UNIVERSIDAD DEL VALLE","YAHIR ARCINIEGAS","JOSE MARIA LEITON",2020000050044,"FORTALECIMIENTO DE LAS COMPETENCIAS COMUNICATIVAS EN INGLÉS DE LOS ESTUDIANTES DE LOS ESTABLECIMIENTOS EDUCATIVOS OFICIALES DEL DEPARTAMENTO CUNDINAMARCA","Fortalecer las competencias comunicativas en inglés de los niños, niñas adolescentes y jóvenes que asisten a los Establecimientos Educativos Oficiales en la entidad territorial.","EDUCACIÓN",15011999229,14954799229,57200000,44195,2020,"110 DE 2020","26/03/2021\t","OK","20/04/2021\t","20/04/2021\t","22/04/2021\t","OK","14/05/2021\t","CONTRATADO EN EJECUCIÓN",0.85870000000000002,0.70279999999999998]
[172,"ENTIDAD APORTANTE RECURSOS","UNAD","YAHIR ARCINIEGAS","LUIS MANUEL GONZALEZ",2020000100433,"INVESTIGACIÓN DE LOS COMPUESTOS VOLÁTILES ORGÁNICOS E INDUCIDOS PARA EL MANEJO DE MOSCAS PLAGAS EN GULUPA Y GRANADILLA EN EL DEPARTAMENTO DE  CUNDINAMARCA",null,"CTEL",3412874201,1999985660,{"$f":"J174-K174","v":1412888541},44159,2020,"100 DE 2020","24/05/2021\t","OK","28/07/2021\t","24/05/2021\t","11/10/2021\t","OK","13/10/2021\t","CONTRATADO EN EJECUCIÓN",0.49330000000000002,0.54410000000000003]
[173,"ENTIDAD APORTANTE RECURSOS","UNIVERSIDAD INDUSTRIAL DE SANTANDER","YAHIR ARCINIEGAS","LUIS MANUEL GONZALEZ",2020000100415,"DESARROLLO DE UN SISTEMA ÓPTICO  COMPUTACIONAL PARA ESTIMAR EL CONTENIDO DE CARBONO ORGÁNICO DE SUELOS AGRÍCOLAS A TRAVÉS DE IMÁGENES ESPECTRALES E INTELIGENCIA ARTIFICIAL EN CULTIVOS DE CÍTRICOS DE   SANTANDER",null,"CTEL",2184125885.29,1972224989.29,211900896,44160,2020,"100 DE 2020","20/04/2021\t","OK","20/05/2021\t","20/05/2021\t","21/05/2021\t","OK","21/05/2021\t","CONTRATADO EN EJECUCIÓN",0.67330000000000001,0.56989999999999996]
[174,"ENTIDAD APORTANTE RECURSOS","UNIVERSIDAD INDUSTRIAL DE SANTANDER","YAHIR ARCINIEGAS","LUIS MANUEL GONZALEZ",2020000100375,"CONFORMACIÓN DE UNA PLATAFORMA PARA ESTUDIOS CELULARES AVANZADOS IN VIVO EN TIEMPO REAL PARA EL ANÁLISIS DE LA RESPUESTA INMUNOMETABÓLICA ANTE LA REEXPRESIÓN DE INTERFERÓN TIPO I KAPPA EN ESFEROIDES DE CÉLULAS TUMORALES DE CUELLO UTERINO EN  SANTANDER",null,"CTEL",3123997801,1998887911,1125109890,44159,2020,"100 DE 2020","20/04/2021\t","OK","21/05/2021\t","24/11/2020\t","21/05/2021\t","OK","21/05/2021\t","CONTRATADO EN EJECUCIÓN",0.75390000000000001,0.65580000000000005]
[175,"ENTIDAD APORTANTE RECURSOS","UNIVERSIDAD INDUSTRIAL DE SANTANDER","YAHIR ARCINIEGAS","LUIS MANUEL GONZALEZ",2020000100351,"DESARROLLO DE UN PROTOTIPO SELECTIVO Y SENSIBLE PARA MONITOREAR CONTENIDO DE CADMIO IN SITU EN DIVERSAS MATRICES ASOCIADAS A LA PRODUCCIÓN DE GRANOS DE CACAO EN EL DEPARTAMENTO DE  SANTANDER",null,"CTEL",2585800000,2000000000,585800000,44159,2020,"100 DE 2020","20/04/2021\t","OK","20/05/2021\t","01/03/2021\t","01/09/2021\t","OK","03/08/2021\t","CONTRATADO EN EJECUCIÓN",1,0.82499999999999996]
[176,"ENTIDAD APORTANTE RECURSOS","INSTITUTO SUPERIOR DE EDUCACION RURAL DE PAMPLONA","YAHIR ARCINIEGAS","LUIS MANUEL GONZALEZ",2020000100343,"IMPLEMENTACIÓN LABORATORIO DE CALIDAD FISICOQUÍMICA DE ALIMENTOS PARA EL FORTALECIMIENTO COMPETITIVO Y SOSTENIBLE DE LASCADENAS AGROALIMENTARIAS DEL DEPARTAMENTO DE  NORTE DE SANTANDER",null,"CTEL",1097306327,999999999,97306328,44159,2020,"100 DE 2020","SIN DATO","OK","07/01/2022\t","05/04/2021\t","07/01/2022\t","OK","SIN DATO","CONTRATADO EN EJECUCIÓN",0,0.2505]
[177,"ENTIDAD APORTANTE RECURSOS","UNIVERSIDAD NACIONAL DE COLOMBIA","YAHIR ARCINIEGAS","LUIS MANUEL GONZALEZ",2020000100342,"ESTUDIO DE POTENCIALES INSECTICIDAS EN MATRICES POLIMÉRICAS PARA EL CONTROL DE PLAGAS DE GRANOS ALMACENADOS BASADOS EN ACEITES ESENCIALES PROVENIENTES DE LA BIODIVERSIDADFLORÍSTICA DEL DEPARTAMENTO DE  CUNDINAMARCA",null,"CTEL",2748237104,2000000000,748237104,44159,2020,"100 DE 2020","23/04/2021\t","OK","09/06/2021\t","08/06/2021\t","29/11/2021\t","OK","26/11/2021\t","CONTRATADO EN EJECUCIÓN",0.2661,0.52190000000000003]
[178,"ENTIDAD APORTANTE RECURSOS","UNIVERSIDAD MILITAR NUEVA GRANADA","YAHIR ARCINIEGAS","LUIS MANUEL GONZALEZ",2020000100728,"GENERACIÓN Y TRANSFERENCIA DE CONOCIMIENTOS Y TECNOLOGÍAS PARA ELEVAR CAPACIDADES DE CTEL DE PEQUEÑOS PRODUCTORES DE TOMATE PARA AFRONTAR PROBLEMAS DERIVADOS DEL COVID-19 ASOCIADAS A LA SEG. ALIMENTARIA EN LAS SAB. CENTRO Y ORIENTE  CUNDINAMARCA",null,"CTEL",4162541452,2123613452,2038928000,44183,2020,"103 DE 2020","17/03/2021\t","OK","16/06/2021\t","16/02/2021\t","21/07/2021\t","OK","28/08/2021\t","CONTRATADO EN EJECUCIÓN",0.74939999999999996,0.75739999999999996]
[179,"ENTIDAD APORTANTE RECURSOS","UNIVERSIDAD NACIONAL DE COLOMBIA","YAHIR ARCINIEGAS","LUIS MANUEL GONZALEZ",2020000100339,"DESARROLLO DE NUEVOS MÉTODOS NO DESTRUCTIVOS PARA MONITOREO IN SITU DE PROBABILIDAD DE OCURRENCIA DE FALLA EN TUBERÍAS EN EL SECTOR DE HIDROCARBUROS EN LOS DEPARTAMENTOS DE  BOGOTÁ BOYACÁ SANTANDER",null,"CTEL",2412084140,1999876300,412207840,44159,2020,"100 DE 2020",44308,"OK","24/11/2020\t","24/11/2020\t","01/10/2021\t","OK","04/06/2021\t","CONTRATADO EN EJECUCIÓN",0.58550000000000002,0.60229999999999995]
[180,"ENTIDAD APORTANTE RECURSOS","UNIVERSIDAD MILITAR NUEVA GRANADA","YAHIR ARCINIEGAS","LUIS MANUEL GONZALEZ",2020000100216,"INNOVACIÓN Y TRANSFERENCIA TECNOLÓGICA DE UMNGBIO A PRODUCTORES DE FLORES PARA EL CONTROL BIOLÓGICO DE TETRANYCHUS URTICAE (ACARI: TETRANYCHIIDAE) EN CULTIVOS DE INVERNADERO CON EL ÁCARO BENÉFICO NEOSEIULUS CALIFORNICUS (ACARI: PHYTOSEIIDAE)  CUNDINAMARCA",null,"CTEL",2431580000,1241580000,1190000000,44159,2020,"100 DE 2020","17/03/2021\t","OK","09/06/2021\t","16/02/2021\t","11/06/2021\t","OK","17/07/2021\t","CONTRATADO EN EJECUCIÓN",0.70620000000000005,0.81789999999999996]
[181,"CUNDINAMARCA","SECRETARIA DE COMPETITIVIDAD","DIEGO TORRES/VALENTINA PORTILLO","FABIAN CUESTA",2019000050026,"DESARROLLO DE UN PROGRAMA PRODUCTIVO, AMIGABLE CON EL MEDIO AMBIENTE DEL SECTOR GANADERO EN EL DEPARTAMENTO DE CUNDINAMARCA CUNDINAMARCA","Insuficientes recursos de producción de carne y leche de los pequeños y medianos productores ganaderos en el departamento de Cundinamarca.","AGRICULTURA ",11567711442,8302543371,3265168071,44187,2020,"109 DE 2020","31/05/2021\t","OK","30/06/2021\t","17/06/2021\t","SIN DATO","OK","21/09/2021\t","CONTRATADO EN EJECUCIÓN",0.63480000000000003,0.72170000000000001]
[182,"ENTIDAD APORTANTE RECURSOS","UNIVERSIDAD NACIONAL DE COLOMBIA","YAHIR ARCINIEGAS","LUIS MANUEL GONZALEZ",2020000100169,"INVESTIGACIÓN DESARROLLO, INNOVACIÓN Y TRANSFERENCIA DE CONOCIMIENTO PARA EL PROCESAMIENTO DE LA SEMILLA DE SACHA INCHI EN PRODUCTOS DE VALOR AGREGADO, COMO ESTRATEGIA PARA MEJORAR LA PRODUCTIVIDAD DEL SECTOR AGROINDUSTRIAL DE LA REGIÓN  CUNDINAMARCA",null,"CTEL",2757697312,1997700000.0999999,759997311.9000001,44078,2020,"97 DE 2020","10/02/2021\t","OK","31/05/2021\t","04/09/2020\t","04/06/2021\t","OK","15/06/2021\t","CONTRATADO EN EJECUCIÓN",0.55410000000000004,0.48799999999999999]
[183,"ENTIDAD APORTANTE RECURSOS","UPTC","YAHIR ARCINIEGAS","LUIS MANUEL GONZALEZ",2020000100114,"FORTALECIMIENTO DEL ECOSISTEMA DE INVESTIGACIÓN CIENTÍFICA PARA CTEI EN LA UNIVERSIDAD PEDAGÓGICA Y TECNOLÓGICA DE COLOMBIA UPTC, I-SPACIO  SOGAMOSO",null,"CTEL",2310634882.4499998,1967031046.1500001,343603836.29999971,44078,2020,"97 DE 2020",43881,"OK","10/06/2021\t","25/11/2020\t","10/06/2021\t","OK","10/06/2021\t","CONTRATADO EN EJECUCIÓN",0.70069999999999999,0.43690000000000001]
[184,"ENTIDAD APORTANTE RECURSOS","UNIVERSIDAD DE ANTIOQUIA","YAHIR ARCINIEGAS","LUIS MANUEL GONZALEZ",2020000100079,"FORTALECIMIENTO DE LA INFRAESTRUCTURA TECNOLÓGICA Y EQUIPAMIENTO DEL AMBIENTE DE FORMACIÓN INDUSTRIAL PARA EL AUMENTO DE LAS CAPACIDADES INSTITUCIONALES EN CTEI DE LA ETITC  BOGOTÁ",null,"CTEL",1090608306,998808306,91800000,44078,2020,"97 DE 2020","14/04/2021\t","OK","29/09/2021\t","29/09/2021\t","05/10/2021\t","OK","10/10/2021\t","CONTRATADO EN EJECUCIÓN",0.97319999999999995,0.93869999999999998]
[185,"ENTIDAD APORTANTE RECURSOS","UNIVERSIDAD NACIONAL DE COLOMBIA","YAHIR ARCINIEGAS","LUIS MANUEL GONZALEZ",2020000100075,"APROVECHAMIENTO DE LA BIODIVERSIDAD EN AGRAZ Y PAPA PARA EL DESARROLLO DE CULTIVOS PROMISORIOS EN EL DEPARTAMENTO DE   SANTANDER",null,"CTEL",3177259696,2000000000,1177259696,44078,2020,"97 DE 2020","09/02/2021\t","OK","11/10/2021\t","11/06/2021\t","15/10/2021\t","OK","23/11/2021\t","CONTRATADO EN EJECUCIÓN",0.32379999999999998,0.30380000000000001]
[186,"ENTIDAD APORTANTE RECURSOS","UNIVERSIDAD NACIONAL DE COLOMBIA","YAHIR ARCINIEGAS","LUIS MANUEL GONZALEZ",2020000100019,"FORTALECIMIENTO DE CAPACIDADES DE INVESTIGACIÓN Y DESARROLLO TECNOLÓGICO DE LA UNIVERSIDAD COLEGIO MAYOR DE CUNDINAMARCA A PARTIR DE TECNOLOGÍAS INDUSTRIA 4.0 PARA EL DISEÑO Y CONSTRUCCIÓN EN   BOGOTÁ",null,"CTEL",2077571214,1930000000,147571214,44078,2020,"97 DE 2020","23/12/2020\t","OK","07/11/2021\t","03/05/2021\t","SIN DATO","OK","20/12/2021\t","CONTRATADO EN EJECUCIÓN",9.6500000000000002E-2,6.6699999999999995E-2]
[187,"ENTIDAD APORTANTE RECURSOS","UNIVERSIDAD INDUSTRIAL DE SANTANDER","YAHIR ARCINIEGAS","LUIS MANUEL GONZALEZ",2020000100017,"FORTALECIMIENTO DE LA CAPACIDAD INSTITUCIONAL DE INVESTIGACIÓN DE LA UNIVERSIDAD INDUSTRIAL DESANTANDER  NACIONAL",null,"CTEL",2808520000,2000000000,808520000,44078,2020,null,"22/09/2021\t","OK","08/12/2021\t","04/01/2021\t","09/12/2021\t","OK","09/12/2021\t","CONTRATADO EN EJECUCIÓN",0.18029999999999999,0]
[188,"ENTIDAD APORTANTE RECURSOS","UNIVERSIDAD MILITAR NUEVA GRANADA","YAHIR ARCINIEGAS","LUIS MANUEL GONZALEZ",2020000100103,"FORTALECIMIENTO DE CAPACIDADES INSTALADAS DE CIENCIA Y TECNOLOGÍA DEL LABORATORIO DE DIAGNÓSTICO EN EL CAMPUS DE LA UNIV MILITAR NUEVA GRANADA, PARA ATENDER PROBLEMÁTICAS ASOCIADAS CON AGENTES BIOLÓGICOS DE ALTO RIESGO PARA LA SALUD HUMANA,  CUNDINAMARCA",null,"CTEL",5715742977,4168513565,1547229412,43966,2020,"93 DE 2020","31/07/2020\t","OK","29/10/2020\t","24/06/2020\t","01/10/2021\t","OK","23/06/2021\t","CONTRATADO EN EJECUCIÓN",0.2145,0.58389999999999997]
[189,"ENTIDAD APORTANTE RECURSOS","INSTITUTO UNIVERSITARIO DE LA PAZ – UNIPAZ","YAHIR ARCINIEGAS","LUIS MANUEL GONZALEZ",2020000100042,"FORTALECIMIENTO DE LOS PROCESOS ACADÉMICOS EN LOS PROGRAMAS OFRECIDOS POR EL INSTITUTO UNIVERSITARIO DE LA PAZ, UNIPAZ,   BARRANCABERMEJA",null,"CTEL",1178749590,996109590,182640000,43998,2020,"94 DE 2020","14/09/2020\t","OK","13/11/2020\t","17/09/2020\t","01/12/2020\t","OK","01/12/2020\t","TERMINADO",1,0.98870000000000002]
[190,"ENTIDAD APORTANTE RECURSOS","INSTITUTO UNIVERSITARIO DE LA PAZ – UNIPAZ","YAHIR ARCINIEGAS","LUIS MANUEL GONZALEZ",2020000100016,"ADECUACIÓN , DOTACIÓN E IMPLEMENTACIÓN DE UN LABORATORIO DE FABRICACIÓN DIGITAL PARA PROMOVER EL DESARROLLO DE LA CIENCIA, LAINNOVACIÓN Y EL EMPRENDIMIENTO EN LA UNIVERSIDAD FRANCISCO DE PAULA SANTANDER.  CÚCUTA",null,"CTEL",2921057589.04,1946843702.04,974213887,43950,2020,"92 DE 2020","16/10/2020\t","OK","09/11/2020\t","05/06/2020\t","22/10/2020\t","OK","01/10/2021\t","TERMINADO",1,1.002]
[191,"ENTIDAD APORTANTE RECURSOS","UNIVERSIDAD TECNOLOGICA DE SANTANDER","YAHIR ARCINIEGAS","LUIS MANUEL GONZALEZ",2020000100004,"FORTALECIMIENTO Y ADECUACIÓN DE EQUIPOS E INFRAESTRUCTURA DEL LABORATORIO DE FÍSICA DEL DEPARTAMENTO DE CIENCIAS BÁSICAS, PARA EL MEJORAMIENTO DE LAS CAPACIDADES INSTITUCIONALES Y LA INVESTIGACIÓN EN LAS UNIDADES TECNOLÓGICAS DE SANTANDER -  BUCARAMANGA",null,"CTEL",1511504755,980000000,531504755,43950,2020,"92 DE 2020","25/01/2021\t","OK","14/04/2021\t","14/04/2021\t","16/12/2021\t","OK","16/12/2021\t","CONTRATADO EN EJECUCIÓN",0.1719,0.15579999999999999]
[192,"CUNDINAMARCA","SECRETARIA DE EDUCACIÓN","YAHIR ARCINIEGAS","GENNY PADILLA",2020000050037,"DOTACIÓN DEL MOBILIARIO ESCOLAR PARA LAS INSTITUCIONES EDUCATIVAS DE LOS MUNICIPIOS NO CERTIFICADOS DEL DEPARTAMENTO DE CUNDINAMARCA","Limitadas condiciones para la formación y el desarrollo de competencias escolares básicas de los niños, niñas, adolescentes y jóvenes de los municipios no certificados del departamento de Cundinamarca","EDUCACIÓN",10093038848,10093038848,0,44195,2020,"110 DE 2020","16/06/2021\t","OK","18/06/2021\t","14/05/2021\t","12/07/2021\t","OK","12/07/2021\t","CERRADO",1,0.84530000000000005]
[193,"ENTIDAD APORTANTE RECURSOS","UNIVERSIDAD DEL NORTE","YAHIR ARCINIEGAS","LUIS MANUEL GONZALEZ",2020000100287,"FORMACIÓN DE CAPITAL HUMANO DE ALTO NIVEL UNIVERSIDAD DEL NORTE 2DO CORTE NACIONAL",null,"CTEL",6920233499,6750000000,{"$f":"J195-K195","v":170233499},44330,2021,"004 DE 2021","17/06/2021\t","OK","16/07/2021\t","15/06/2021\t","23/07/2021\t","OK","27/07/2021\t","CONTRATADO EN EJECUCIÓN",0.32800000000000001,0.39610000000000001]
[194,"ENTIDAD APORTANTE RECURSOS","UNIVERSIDAD DEL VALLE","YAHIR ARCINIEGAS","LUIS MANUEL GONZALEZ",2020000100345,"FORMACIÓN DE CAPITAL HUMANO DE ALTO NIVEL SEGUNDO CORTE UNIVERSIDAD DEL VALLE NACIONAL",null,"CTEL",5913070114,5335769261,577300853,44348,2021,"05 DE 2021","28/06/2021\t","OK","27/07/2021\t","09/07/2021\t","19/08/2021\t","OK","03/08/2021\t","CONTRATADO EN EJECUCIÓN",0.33339999999999997,0.3705]
[195,"ENTIDAD APORTANTE RECURSOS","UNIVERSIDAD NACIONAL DE COLOMBIA","YAHIR ARCINIEGAS","LUIS MANUEL GONZALEZ",2021000100003,"FORMACIÓN DE CAPITAL HUMANO DE ALTO NIVEL UNIVERSIDAD  NACIONAL DE COLOMBIA CORTE II NACIONL",null,"CTEL",18418143500,17635937500,782206000,44330,2021,"04 DE 2021","30/07/2021\t","OK","09/08/2021\t","18/06/2021\t","30/08/2021\t","OK","30/11/2021\t","CONTRATADO EN EJECUCIÓN",0.31130000000000002,0.37090000000000001]
[196,"ENTIDAD APORTANTE RECURSOS","UNIVERSIDAD DE LA SABANA","YAHIR ARCINIEGAS","LUIS MANUEL GONZALEZ",2021000100004,"FORMACIÓN DE CAPITAL HUMANO DE ALTO NIVEL UNIVERSIDAD DE LA SABANA CORE 2 NACIONAL",null,"CTEL",1519950000,1309600000,210350000,44348,2021,"05 DE 2021","08/07/2021\t","OK","23/08/2021\t","24/06/2021\t","07/09/2021\t","OK","27/09/2021\t","CONTRATADO EN EJECUCIÓN",0.39560000000000001,0.69899999999999995]
[197,"ENTIDAD APORTANTE RECURSOS","UNIVERSIDAD ANTONIO NARIÑO","YAHIR ARCINIEGAS","LUIS MANUEL GONZALEZ",2021000100014,"FORMACIÓN DE CAPITAL HUMANO DE ALTO NIVEL UNIVERSIDAD ANTONIO NARIÑO CORE 2 NACIONAL",null,"CTEL",4526652200,4250000000,276652200,44348,2021,"06 DE 2021","12/07/2021\t","OK","08/09/2021\t","07/07/2021\t","29/09/2021\t","OK","29/09/2021\t","CONTRATADO EN EJECUCIÓN",5.1400000000000001E-2,0.22939999999999999]
[198,"ENTIDAD APORTANTE RECURSOS","UNIVERSIDAD EAN","YAHIR ARCINIEGAS","LUIS MANUEL GONZALEZ",2021000100025,"FORMACIÓN DE CAPITAL HUMANO DE ALTO NIVEL UNIVERSIDAD EAN NACIONAL COHORTE II NACIONAL",null,"CTEL",2044506416,1750000000,294506416,44368,2021,"06 DE 2021","25/06/2021\t","OK","07/10/2021\t","01/07/2021\t","01/07/2021\t","ok","08/10/2021\t","CONTRATADO EN EJECUCIÓN",0.44629999999999997,0.43369999999999997]
[199,"ENTIDAD APORTANTE RECURSOS","UNIVERSIDAD MILITAR NUEVA GRANADA","YAHIR ARCINIEGAS","LUIS MANUEL GONZALEZ",2021000100026,"FORMACIÓN DE CAPITAL HUMANO DE ALTO NIVEL UNIVERSIDAD MILITAR NUEVA GRANADA SEGUNDO CORTE NACIONAL",null,"CTEL",751632481,650602304,101030177,44348,2021,"05 DE 2021","16/07/2021\t","OK","20/10/2021\t","14/07/2021\t","22/11/2021\t","ok","22/12/2021\t","CONTRATADO EN EJECUCIÓN",0.32,0.32]
[200,"ENTIDAD APORTANTE RECURSOS","PONIFICA UNIVERSIDAD JAVERIANA","YAHIR ARCINIEGAS","LUIS MANUEL GONZALEZ",2021000100027,"FORMACIÓN DE CAPITAL HUMANO DE ALTO NIVEL PONTIFICIA UNIVERSIDAD JAVERIANA SEDE BOGOTÁ CORTE II NACIONAL",null,"CTEL",8577491761,7246312500,1331179261,44348,2021,"05 DE 2021","12/10/2021\t","OK","11/10/2021\t","21/06/2021\t","SIN DATO","ok","30/07/2021\t","CONTRATADO EN EJECUCIÓN",0.39850000000000002,0.37759999999999999]
[201,"ENTIDAD APORTANTE RECURSOS","UNIVERSIDAD DE CALDAS","YAHIR ARCINIEGAS","LUIS MANUEL GONZALEZ",2021000100028,"FORMACIÓN DE CAPITAL HUMANO DE ALTO NIVEL CORTE 2 UNIVERSIDAD DE CALDAS - NACIONAL",null,"CTEL",6358000000,6000000000,358000000,44348,2021,"05 DE 2021","25/08/2021\t","OK","05/10/2021\t","01/06/2021\t","08/10/2021\t","OK","08/10/2021\t","CONTRATADO EN EJECUCIÓN",0.41839999999999999,0.31759999999999999]
[202,"CUNDINAMARCA","SECRETARIA DE EDUCACIÓN","YAHIR ARCINIEGAS","GENNY PADILLA",2021004250258,"FORTALECIMIENTO A LA ESTRATEGIA DE ALIMENTACIÓN ESCOLAR PARA EL AÑO 2021 EN LOS MUNICIPIOS DEL DEPARTAMENTO DE CUNDINAMARCA",null,"EDUCACIÓN",16289941201,16289941201,0,44432,2021,"248 DE 2021","10/09/2021\t","OK","13/09/2021\t","24/08/2021\t","22/10/2021\t","OK","22/10/2021\t","PARA CIERRE",1,0.66559999999999997]
[203,"CUNDINAMARCA","SECRETARIA DE HABITAT Y VIVIENDA","ALEXANDER RIVEROS/JEIMY FORERO","BEATRIZ GAMEZ",2018000050050,"MEJORAMIENTO VIVIENDA RURAL MEDIANTE CONSTRUCCIÓN DE COCINAS HABITACIONES Y PISOS EN LOS MUNICIPIOS DE CUNDINAMARCA",null,"AGRICULTURA ",5616585397,5616585397,{"$f":"J205-K205","v":0},44525,2021,"03 DE 2021",null,"OK",null,null,null,null,null,"CONTRATADO EN EJECUCIÓN",0,0]
[204,"CUNDINAMARCA","SECRETARIA DE COMPETITIVIDAD","ALEXANDER RIVEROS/JEIMY FORERO","FABIAN CUESTA",2020000050035,"FORTALECIMIENTO DE LOS SISTEMAS PRODUCTIVOS A TRAVÉS DE LA REACTIVACIÓN DEL SECTOR AGRÍCOLA EN EL DEPARTAMENTO DE CUNDINAMARCA",null,"AGRICULTURA ",9997098068,9997098068,0,44529,2021,"454 DE 2021",null,"OK",null,null,null,null,null,"CONTRATADO SIN ACTA DE INICIO",0,0]
["205","CUNDINAMARCA","SECRETARIA DE MINAS, ENERGIA Y GAS","DIEGO TORRES / LIYUGETH ALFONSO","YAHIR",2021004250686,"CONSTRUCCIÓN DEL CENTRO DE FORMACIÓN E INNOVACIÓN MINERO ENERGÉTICO DE CUNDINAMARCA",null,"GOBIERNO TERRITORIAL","$ 13.770.893.382,00","$ 6.928.967.103,00",6841926279,44561,"2021","546 DE 2021",null,null,null,null,null,null,null,"CONTRATADO EN EJECUCIÓN",3.7000000000000002E-3,3.5999999999999999E-3]
[206,"CUNDINAMARCA","UNIDAD ADMINISTRATIVA DE GESTIÓN DEL RIESGO.","DIEGO TORRES/VALENTINA PORTILLO","GINNA HERRERA",2021004250690,"FORTALECIMIENTO DEL SISTEMA AUTOMOTOR PARA LA GESTIÓN DEL RIESGO DE DESASTRES DEL DEPARTAMENTO DE CUNDINAMARCA",null,"GOBIERNO TERRITORIAL",7299514100,7299514100,0,44547,2021,"496 DE 2021",null,null,null,null,null,null,null,"CONTRATADO EN EJECUCIÓN",0.99939999999999996,0.14069999999999999]
[207,"CUNDINAMARCA","SECRETARIA DE COMPETITIVIDAD","ALEXANDER RIVEROS/JEIMY FORERO","FABIAN CUESTA",2020000050038,"OPTIMIZACIÓN DE LOS SISTEMAS GANADEROS BOVINOS DE CARNE LECHE Y DOBLE PROPÓSITO A PARTIR DE LA IMPLEMENTACIÓN DE MEJORAMIENTO GENÉTICO PRODUCTIVO Y ENTREGA DE MAQUINARIA Y EQUIPOS EN MUNICIPIOS DEL DEPARTAMENTO DE CUNDINAMARCA",null,"AGRICULTURA ",9732446243,9732446243,0,44561,2021,"547 DE 2021",null,null,null,null,null,null,null,"CONTRATADO SIN ACTA DE INICIO",0,"0,00%"]
[208,"CUNDINAMARCA","SECRETARIA DE CIENCIA, TECNOLOGIA E INNOVACIÓN","YAHIR ARCINIEGAS","LUIS MANUEL GONZALEZ",2021000100327,"DESARROLLO DE UN SISTEMA DE PRODUCCIÓN LECHERO PARA LA OBTENCIÓN DE LECHES INOCUAS DE ALTA CALIDAD Y CON UN PERFIL LIPÍDICO SALUDABLE EN EL DEPARTAMENTO DE CUNDINAMARCA",null,"CTEL",3833042862,3044082702,788960160,44617,2022,"15 DE 2022",null,null,null,null,null,null,null,"CONTRATADO SIN ACTA DE INICIO",0,"0,00%"]
[209,"CUNDINAMARCA","SECRETARIA DE CIENCIA, TECNOLOGIA E INNOVACIÓN","YAHIR ARCINIEGAS","LUIS MANUEL GONZALEZ",2021000100208,"FORTALECIMIENTO DE LOS NIVELES DE APROPIACIÓN SOCIAL DEL CONOCIMIENTO DE LA CTEI EN COMUNIDADES DE LAS PROVINCIAS DE ALMEIDAS Y UBATÉ DEL DEPARTAMENTO DE CUNDINAMARCA",null,"CTEL",2191964751,1839764876,352199875,44615,2022,"15 DE 2021",null,null,null,null,null,null,null,"CONTRATADO EN EJECUCIÓN",0.1928,0.24129999999999999]
[210,"CUNDINAMARCA","SECRETARIA DE CIENCIA, TECNOLOGIA E INNOVACIÓN","YAHIR ARCINIEGAS","LUIS MANUEL GONZALEZ",2021000100243,"DESARROLLO PARTICIPATIVO DE UNA PLATAFORMA TECNOLÓGICA DE TELEDETECCIÓN PARA LA GESTIÓN SOSTENIBLE DE SUELOS EN AGROECOSISTEMAS DEL DEPARTAMENTO DE CUNDINAMARCA",null,"CTEL",3042693625,2332094728,710598897,44617,2021,"15 DE 2021",null,null,null,null,null,null,null,"CONTRATADO EN EJECUCIÓN",0.13320000000000001,0.19189999999999999]
[211,"CUNDINAMARCA","SECRETARIA DE MINAS, ENERGIA Y GAS","DIEGO TORRES / LIYUGETH ALFONSO","YAHIR",2021000050019,"AMPLIACIÓN DE LA COBERTURA DEL SERVICIO DE GAS COMBUTIBLE POR REDES A TRAVES DE LA FINANCIACIÓN DEL CARGO POR CONEXIÓN Y LA RED INTERNA PARA USUARIOS DE BARRIOS PERIFÉRICOS VEREDAS Y CENTROS POBLADOS DE LOS MUNICIPIOS DE CUNDINAMARCA",null,"MINAS Y ENERGÍA",10613927436,6059727436,4554200000,"2022-05-19",2022,"07 DE 2021",null,null,null,null,null,null,null,"CONTRATADO EN EJECUCIÓN",7.4700000000000003E-2,4.8099999999999997E-2]
[212,"CUNDINAMARCA","SECRETARIA DE EDUCACIÓN","YAHIR ARCINIEGAS","GENNY PADILLA",2022000050007,"FORTALECIMIENTO A LA ESTRATEGIA DE ALIMENTACIÓN ESCOLAR EN LOS MUNICIPIOS NO CERTIFICADOS DEL DEPARTAMENTO DE CUNDINAMARCA PARA LA VIGENCIA 2022 CUNDINAMARCA\t",null,"EDUCACIÓN",42966037310,42966037310,0,"2022-05-19",2022,"248 DE 2021","10/09/2021\t","OK","13/09/2021\t","24/08/2021\t","22/10/2021\t","OK","22/10/2021\t","CONTRATADO EN EJECUCIÓN",0.95489999999999997,0.54149999999999998]
[213,"CUNDINAMARCA","SECRETARIA DE CIENCIA, TECNOLOGIA E INNOVACIÓN","YAHIR ARCINIEGAS","LUIS MANUEL GONZALEZ",2021000100467,"FORTALECIMIENTO DE LAS CAPACIDADES INSTITUCIONALES PARA EL DESARROLLO Y GESTIÓN DEL ECOSISTEMA TERRITORIAL DE CTEI EN TODAS LAS PROVINCIAS DEL DEPARTAMENTO DE CUNDINAMARCA\n",null,"CTEL",2801037429,2299692877,501344552,"2022-04-13",2022,"18 DE 2022",null,null,null,null,null,null,null,"CONTRATADO EN EJECUCIÓN","0,00%","0,00%"]
[214,"CUNDINAMARCA","SECRETARIA DE CIENCIA, TECNOLOGIA E INNOVACIÓN","YAHIR ARCINIEGAS","LUIS MANUEL GONZALEZ",2021000100276,"DESARROLLO DE UN MODELO DE PROMOCIÓN TURÍSTICA SOSTENIBLE DESDE LA TECNOLOGÍA 4.0 EN LOS MUNICIPIOS DE LA PALMA Y YACOPI EN EL DEPARTAMENTO DE CUNDINAMARCA\n",null,"CTEL",2608055295,2401327735,206727560,"2022-03-17",2022,"16 DE 2022",null,null,null,null,null,null,null,"CONTRATADO EN EJECUCIÓN",0.11020000000000001,0.24229999999999999]
[215,"CUNDINAMARCA","SECRETARIA DE CIENCIA, TECNOLOGIA E INNOVACIÓN","YAHIR ARCINIEGAS","LUIS MANUEL GONZALEZ",2021000100523,"DESARROLLO DE MICROREDES Y ALMACENAMIENTO (ESS) PRESTADORES DE SERVICIOS COMPLEMENTARIOS PARA INCREMENTAR LA COBERTURA EFICIENCIA Y CONFIABILIDAD DEL SERVICIO EN EL DEPARTAMENTO DE CUNDINAMARCA\n",null,"CTEL",3942973233,3296088001,646885232,"2022-05-04",2022,"20 DE 2022",null,null,null,null,null,null,null,"CONTRATADO EN EJECUCIÓN",3.61E-2,"0,00%"]
[216,"CUNDINAMARCA","SECRETARIA DE EDUCACIÓN","YAHIR ARCINIEGAS","GENNY PADILLA",2022004250011,"FORTALECIMIENTO A LA ESTRATEGIA DE SUBSIDIO DE TRANSPORTE ESCOLAR EN MUNICIPIOS NO CERTIFICADOS DEL DEPARTAMENTO DE CUNDINAMARCA PARA LA VIGENCIA 2022 CUNDINAMARCA",null,"EDUCACIÓN",24666685502,24666685502,{"$f":"J218-K218","v":0},44722,2022,"184 DE 2022",null,null,null,null,null,null,null,"CONTRATADO EN EJECUCIÓN",0.95120000000000005,0.98699999999999999]
[217,"ENTIDAD APORTANTE RECURSOS","EMTEL","ALEXANDER RIVEROS/JEIMY FORERO","FABIAN CUESTA",2022004250006,"IMPLEMENTACIÓN DE UNA ESTRATEGIA DE REACTIVACIÓN ECONÓMICA PARA EL PROGRESO Y LA COMPETITIVIDAD DE MICRONEGOCIOS Y UNIDADES PRODUCTIVAS EN EL DEPARTAMENTO DE CUNDINAMARCA",null,"COMERCIO, INDUSTRIA Y TURISMO",16921563805,16921563805,0,44529,2021,"454 DE 2021",null,"OK",null,null,null,null,null,"CONTRATADO EN EJECUCIÓN",0.1726,0.39389999999999997]
[218,"CUNDINAMARCA","SECRETARIA DE AMBIENTE",null,null,2022004250025,"FORTALECIMIENTO DE LA PRODUCCIÓN DE MATERIAL VEGETAL ARBUSTIVO Y ARBÓREO PARA LA RECUPERACIÓN DE LA COBERTURA ARBÓREA EN EL DEPARTAMENTO DE CUNDINAMARCA",null,"AMBIENTE Y DESARROLLO SOSTENIBLE",3387966925,2857824455,{"$f":"J220-K220","v":530142470},44907,2022,"474 DE 2022",null,null,null,null,null,null,null,"SIN CONTRATAR",0,0]
[219,"CUNDINAMARCA","ICCU - GESPROY GB","ALEXANDER RIVEROS/JEIMY FORERO","GIOVANY QUEVEDO",2022004250032,"MEJORAMIENTO DE LA VÍA QUE COMUNICA A LOS MUNICIPIOS DE SAN CAYETANO Y COGUA TRAMO VEREDA CARDONAL VEREDA MORTIÑO DEL MUNICIPIO DE SAN CAYETANO DEPARTAMENTO DE CUNDINAMARCA",null,"TRANSPORTE",9976205175,9976205175,0,44907,2022,"474 DE 2022",null,null,null,null,null,null,null,"SIN CONTRATAR",0,0]
[220,"CUNDINAMARCA",null,null,null,2022004250031,"CONSTRUCCIÓN DE OBRAS PARA MITIGAR LOS RIESGOS QUE SE PRESENTAN EN LA ZONAS ALEDAÑAS A LA URBANIZACIÓN SASIPA DEL MUNICIPIO DE SILVANIA CUNDINAMARCA",null,"GOBIERNO TERRITORIAL",3673954111,3673954111,0,44922,2022,null,null,null,null,null,null,null,null,"SIN CONTRATAR",0,0]
[221,"CUNDINAMARCA",null,null,null,2022004250036,"CONSTRUCCIÓN DE OBRAS DE MITIGACIÓN Y ESTABILIZACIÓN EN CENTRO POBLADO DE CUATRO CAMINOS DEL MUNICIPIO DE PAIME DEPARTAMENTO DE CUNDINAMARCA",null,"GOBIERNO TERRITORIAL",3745004883.4099998,3745004883.4099998,0,44922,2022,null,null,null,null,null,null,null,null,"SIN CONTRATAR",0,0]
[222,"CUNDINAMARCA","FUNDACION UNIVERSIDAD DEL VALLE",null,null,2022004250028,"FORTALECIMIENTO EMPRESARIAL PARA EL PROGRESO Y LA COMPETITIVIDAD DE LOS MICRONEGOCIOS Y UNIDADES PRODUCTIVAS EN EL DEPARTAMENTO DE CUNDINAMARCA",null,"COMERCIO INDUSTRIA Y TURISMO",16598832013,16598832013,0,44923,2022,null,null,null,null,null,null,null,null,"CONTRATADO SIN ACTA DE INICIO",0,0]
[223,"CUNDINAMARCA","SECRETARIA DE AMBIENTE",null,null,20223201010038,null,null,"AMBIENTE Y DESARROLLO SOSTENIBLE"," $ 2.238.923.844 "," $ -   ",{"$f":"J225-K225","v":{"$error":"#VALUE!"}},"20/01/2023",{"$f":"RIGHT(Tabla2[[#This Row],[FECHA DE APROBACIÓN OCAD]],4)","v":"2023"}]
[null,null,null,null,null,null,null,null,null,null,null,0,null,{"$f":"RIGHT(Tabla2[[#This Row],[FECHA DE APROBACIÓN OCAD]],4)","v":""}]
[null,null,null,null,null,null,null,null,null,null,null,0,null,{"$f":"RIGHT(Tabla2[[#This Row],[FECHA DE APROBACIÓN OCAD]],4)","v":""}]
[null,null,null,null,null,null,null,null,null,null,null,0,null,{"$f":"RIGHT(Tabla2[[#This Row],[FECHA DE APROBACIÓN OCAD]],4)","v":""}]
[null,null,null,null,null,null,null,null,null,null,null,0,null,{"$f":"RIGHT(Tabla2[[#This Row],[FECHA DE APROBACIÓN OCAD]],4)","v":""}]
[null,null,null,null,null,null,null,null,null,null,null,0,null,{"$f":"RIGHT(Tabla2[[#This Row],[FECHA DE APROBACIÓN OCAD]],4)","v":""}]
[null,null,null,null,null,null,null,null,null,null,null,0,null,{"$f":"RIGHT(Tabla2[[#This Row],[FECHA DE APROBACIÓN OCAD]],4)","v":""}]
[]
[]
[]
[null,"Fuente: Dirección de Gestión de la Inversión - Secretaría de Planeación"]
[null,"Corte: Marzo 15 de 2023"]