{"text_format":"1","workbook":"xlsx","n_sheets":7,"sheets":["Mapa SGR","Tablas","Vencimiento días","Riesgo de liberación","Control de avances","Hoja1","Proyectos en Ejecución"],"not_rendered":{"charts":4,"images":3,"macros":1,"external_links":1,"defined_names":3,"comments":0,"pivot_tables":6},"unopened":[],"bounds":{"document_bytes":16777216,"sheet_cells":100000,"rows_first":2000,"rows_last":500,"rows_between":2000,"halvings":0,"cell_chars":16384,"cell_head_chars":4096},"cells_cut":0,"cells_raw":0,"read":"whole","date_system":"1900"}

{"sheet":"Mapa SGR","index":0,"n_rows":60,"n_cols":15,"rows_kept":60,"cut":false,"hidden":true,"merged":[[1,7,1,14],[1,6,2,6],[1,5,2,5],[1,4,2,4],[1,3,2,3],[1,1,2,2],[5,1,5,2],[4,1,4,2],[21,1,21,2],[57,1,57,2],[3,1,3,2]]}
[]
[null,"DESCRIPCIÓN",null,"CANTIDAD","VALOR SGR","VALOR OTRAS FUENTES","VALOR TOTAL","ESTADOS"]
[null,null,null,null,null,null,null,"NO HA MIGRADO A GESPROY","SIN CONTRATAR","CONTRATADO SIN ACTA DE INICIO","CONTRATADO EN EJECUCIÓN","TERMINADO","PARA CIERRE","CERRADO","DESAPROBADO"]
[null,"TOTAL PROYECTOS APROBADOS",null,{"$f":"MAX(Tabla2[N°])","v":225},{"$f":"SUM('Proyectos en Ejecución'!I7:I228)","v":1435250758848.3201},{"$f":"G4-E4","v":3757723742026.2402},{"$f":"SUM('Proyectos en Ejecución'!H7:H228)","v":5192974500874.5605},{"$f":"COUNTIFS('Proyectos en Ejecución'!$U$7:$U$277, H$3)","v":0},{"$f":"COUNTIFS('Proyectos en Ejecución'!$U$7:$U$277, I$3)","v":2},{"$f":"COUNTIFS('Proyectos en Ejecución'!$U$7:$U$277, J$3)","v":1},{"$f":"COUNTIFS('Proyectos en Ejecución'!$U$7:$U$277, K$3)","v":84},{"$f":"COUNTIFS('Proyectos en Ejecución'!$U$7:$U$277, L$3)","v":13},{"$f":"COUNTIFS('Proyectos en Ejecución'!$U$7:$U$277, M$3)","v":12},{"$f":"COUNTIFS('Proyectos en Ejecución'!$U$7:$U$277, N$3)","v":106},{"$f":"COUNTIFS('Proyectos en Ejecución'!$U$7:$U$277, O$3)","v":6}]
[null,"TOTAL PROYECTOS EJECUCIÓN",null,{"$f":"SUM(H4:M4)","v":112},{"$f":"GETPIVOTDATA(\"Suma de VALOR SGR\",Hoja1!$A$4)","v":775006557572.7301},{"$f":"G5-E5","v":126849431325.84998},{"$f":"GETPIVOTDATA(\"Suma de VALOR PROYECTO\",Hoja1!$A$4)","v":901855988898.58008},{"$f":"COUNTIFS('Proyectos en Ejecución'!$U$7:$U$277, H$3)","v":0},{"$f":"COUNTIFS('Proyectos en Ejecución'!$U$7:$U$277, I$3)","v":2},{"$f":"COUNTIFS('Proyectos en Ejecución'!$U$7:$U$277, J$3)","v":1},{"$f":"COUNTIFS('Proyectos en Ejecución'!$U$7:$U$277, K$3)","v":84},{"$f":"COUNTIFS('Proyectos en Ejecución'!$U$7:$U$277, L$3)","v":13},{"$f":"COUNTIFS('Proyectos en Ejecución'!$U$7:$U$277, M$3)","v":12},0,0]
[null,"TOTAL PROYECTOS GOBERNACIÓN DESIGNADA COMO EJECUTORA",null,{"$f":"GETPIVOTDATA(\"Cuenta de EJECUTOR INTERNO\",Tablas!$L$4)","v":53},{"$f":"GETPIVOTDATA(\"Suma de VALOR SGR\",Tablas!$L$4)","v":479400281753.54999},{"$f":"G6-E6","v":56852685229.039978},{"$f":"GETPIVOTDATA(\"Suma de VALOR PROYECTO\",Tablas!$F$4)","v":536252966982.58997},{"$f":"SUM(H7:H21)","v":0},{"$f":"SUM(I7:I21)","v":2},1,39,6,7,53,4]
[null,"GOBERNACIÓN DE CUNDINAMARCA","SECRETARIA DE GOBIERNO",{"$f":"GETPIVOTDATA(\"Cuenta de EJECUTOR INTERNO\",Tablas!$L$4,\"EJECUTOR INTERNO\",\"SECRETARIA DE GOBIERNO\")","v":1},{"$f":"GETPIVOTDATA(\"Suma de VALOR SGR\",Tablas!$L$4,\"EJECUTOR INTERNO\",\"SECRETARIA DE GOBIERNO\")","v":8500000000},760000000,{"$f":"GETPIVOTDATA(\"Suma de VALOR PROYECTO\",Tablas!$L$4,\"EJECUTOR INTERNO\",\"SECRETARIA DE GOBIERNO\")","v":9260000000},{"$f":"COUNTIFS('Proyectos en Ejecución'!$C$7:$C$277, $C7, 'Proyectos en Ejecución'!$U$7:$U$277, H$3)","v":0},{"$f":"COUNTIFS('Proyectos en Ejecución'!$C$7:$C$277, $C7, 'Proyectos en Ejecución'!$U$7:$U$277, I$3)","v":0},{"$f":"COUNTIFS('Proyectos en Ejecución'!$C$7:$C$277, $C7, 'Proyectos en Ejecución'!$U$7:$U$277, J$3)","v":0},{"$f":"COUNTIFS('Proyectos en Ejecución'!$C$7:$C$277, $C7, 'Proyectos en Ejecución'!$U$7:$U$277, K$3)","v":0},{"$f":"COUNTIFS('Proyectos en Ejecución'!$C$7:$C$277, $C7, 'Proyectos en Ejecución'!$U$7:$U$277, L$3)","v":0},{"$f":"COUNTIFS('Proyectos en Ejecución'!$C$7:$C$277, $C7, 'Proyectos en Ejecución'!$U$7:$U$277, M$3)","v":1},{"$f":"COUNTIFS('Proyectos en Ejecución'!$C$7:$C$277, $C7, 'Proyectos en Ejecución'!$U$7:$U$277, N$3)","v":3},{"$f":"COUNTIFS('Proyectos en Ejecución'!$C$7:$C$277, $C7, 'Proyectos en Ejecución'!$U$7:$U$277, O$3)","v":0}]
[null,"GOBERNACIÓN DE CUNDINAMARCA","SECRETARIA GENERAL",{"$f":"GETPIVOTDATA(\"Cuenta de EJECUTOR INTERNO\",Tablas!$L$4,\"EJECUTOR INTERNO\",\"SECRETARIA GENERAL\")","v":{"$error":"#REF!"}},{"$f":"GETPIVOTDATA(\"Suma de VALOR SGR\",Tablas!$L$4,\"EJECUTOR INTERNO\",\"SECRETARIA GENERAL\")","v":{"$error":"#REF!"}},{"$error":"#REF!"},{"$f":"GETPIVOTDATA(\"Suma de VALOR PROYECTO\",Tablas!$L$4,\"EJECUTOR INTERNO\",\"SECRETARIA DE PLANEACIÓN\")","v":6791102421.6400003},{"$f":"COUNTIFS('Proyectos en Ejecución'!$C$7:$C$277, $C8, 'Proyectos en Ejecución'!$U$7:$U$277, H$3)","v":0},{"$f":"COUNTIFS('Proyectos en Ejecución'!$C$7:$C$277, $C8, 'Proyectos en Ejecución'!$U$7:$U$277, I$3)","v":0},{"$f":"COUNTIFS('Proyectos en Ejecución'!$C$7:$C$277, $C8, 'Proyectos en Ejecución'!$U$7:$U$277, J$3)","v":0},{"$f":"COUNTIFS('Proyectos en Ejecución'!$C$7:$C$277, $C8, 'Proyectos en Ejecución'!$U$7:$U$277, K$3)","v":0},{"$f":"COUNTIFS('Proyectos en Ejecución'!$C$7:$C$277, $C8, 'Proyectos en Ejecución'!$U$7:$U$277, L$3)","v":0},{"$f":"COUNTIFS('Proyectos en Ejecución'!$C$7:$C$277, $C8, 'Proyectos en Ejecución'!$U$7:$U$277, M$3)","v":0},{"$f":"COUNTIFS('Proyectos en Ejecución'!$C$7:$C$277, $C8, 'Proyectos en Ejecución'!$U$7:$U$277, N$3)","v":1},{"$f":"COUNTIFS('Proyectos en Ejecución'!$C$7:$C$277, $C8, 'Proyectos en Ejecución'!$U$7:$U$277, O$3)","v":0}]
{"$rows_left_out":53}
{"sheet":"Tablas","index":1,"n_rows":17,"n_cols":21,"rows_kept":17,"cut":false,"hidden":true,"merged":[]}
["EJECUTOR (Dpto / Entidad)","CUNDINAMARCA",null,null,null,"EJECUTOR (Dpto / Entidad)","(Varios elementos)",null,null,null,null,"EJECUTOR (Dpto / Entidad)","CUNDINAMARCA",null,null,null,null,"EJECUTOR (Dpto / Entidad)","CUNDINAMARCA"]
[null,null,null,null,null,"ESTADO","(Varios elementos)",null,null,null,null,"ESTADO","(Varios elementos)",null,null,null,null,"ESTADO","(Varios elementos)"]
["Etiquetas de fila","Cuenta de ESTADO"]
["CONTRATADO EN EJECUCIÓN",38,null,null,null,"Etiquetas de fila","Cuenta de SECTOR","Suma de VALOR PROYECTO","Suma de VALOR SGR",null,null,"Etiquetas de fila","Cuenta de EJECUTOR INTERNO","Suma de VALOR PROYECTO","Suma de VALOR SGR",null,null,"Etiquetas de fila","Promedio de \tAVANCE FÍSICO","Promedio de \tAVANCE FINANCIERO","Cuenta de EJECUTOR INTERNO"]
["PARA CIERRE",7,null,null,null,"EDUCACIÓN",5,188177731805,188177731805,null,null,"SECRETARIA DE GOBIERNO",1,9260000000,8500000000,null,null,"SECRETARIA DE CIENCIA, TECNOLOGIA E INNOVACIÓN",0.71987037037037049,0.75098888888888904,27]
["TERMINADO",6,null,null,null,"CTEL",27,194210559816.78,157570339540.23001,null,null,"SECRETARIA DE AGRICULTURA",1,6523880054,4220000000,null,null,"SECRETARIA DE EDUCACIÓN",0.79147999999999996,0.52888000000000002,5]
["SIN CONTRATAR",2,null,null,null,"AGRICULTURA ",7,53446293854.169998,47237215508.68,null,null,"SUPERVISIÓN / INTERVENTORÍA -EPC",1,4999900475,4999900475,null,null,"SECRETARIA DE HABITAT Y VIVIENDA",0.83705000000000007,0.7504249999999999,4]
["Total general",53,null,null,null,"AMBIENTE Y DESARROLLO SOSTENIBLE",4,41211785924,38442719610,null,null,"SECRETARIA DE PLANEACIÓN",1,6791102421.6400003,6725380621.6400003,null,null,"SECRETARIA DE COMPETITIVIDAD",0.479825,0.46884999999999999,4]
{"$rows_left_out":10}
{"sheet":"Vencimiento días","index":2,"n_rows":129,"n_cols":14,"rows_kept":129,"cut":false,"hidden":true,"merged":[]}
["EJECUTOR (Dpto / Entidad)","EJECUTOR INTERNO","ENCARGADO DE LA ENTIDAD ","ENLACE EMTIDAD EJECUTORA","BPIN ","PROYECTO","SECTOR","VALOR","ESTADO","FECHA ","FECHA DE TERMINACIÓN2","HOY","VENCIMIENTO N° DÍAS ","Columna1"]
["CUNDINAMARCA","SECRETARIA GENERAL","YAHIR ARCINIEGAS","JIMENA TAFUR",2012000050010,"ESTUDIOS Y DISEÑOS PARA LA RECUPERACIÓN Y ADECUACION DEL PATRIMONIO HISTORICO CULTURAL PALACIO DE SAN FRANCISCO EN BOGOTA D.C. DEPARTAMENTO DE CUNDINAMARCA ","CULTURA ",1000000000,"TERMINADO",43465,{"$f":"VLOOKUP(Tabla22[[#This Row],[BPIN ]],[1]Base1!F$3:Z$223,21,0)","v":43465},{"$f":"+TODAY()","v":45224},{"$f":"Tabla22[[#This Row],[FECHA DE TERMINACIÓN2]]-Tabla22[[#This Row],[HOY]]","v":-1759},{"$f":"Tabla22[[#This Row],[FECHA ]]-Tabla22[[#This Row],[FECHA DE TERMINACIÓN2]]","v":0}]
["CUNDINAMARCA","SECRETARIA DE COMPETITIVIDAD","ALEXANDER RIVEROS/JEIMY FORERO","FABIAN CUESTA",2012000050030,"DESARROLLO CREACION Y FORTALECIMIENTO DE NUEVE (9) CENTROS DE EMPREDIMIENTO Y FORTALECIMIENTO EMPRESARIAL EN EL DEPARTAMENTO DE CUNDINAMARCA ","COMERCIO, INDUSTRIA Y TURISMO ",1752501814,"PARA CIERRE",42369,{"$f":"VLOOKUP(Tabla22[[#This Row],[BPIN ]],[1]Base1!F$3:Z$223,21,0)","v":42369},45224,{"$f":"Tabla22[[#This Row],[FECHA ]]-Tabla22[[#This Row],[HOY]]","v":-2855},{"$f":"Tabla22[[#This Row],[FECHA ]]-Tabla22[[#This Row],[FECHA DE TERMINACIÓN2]]","v":0}]
["CUNDINAMARCA","SECRETARIA DE CIENCIA, TECNOLOGIA E INNOVACIÓN","ALEXANDER RIVEROS Y YAHIR ARCINIEGAS","LUIS MANUEL GONZALEZ",2012000100010,"FORTALECIMIENTO DE LAS REGIONES COLOMBIANAS EN SUS CAPACIDADES DE CTI - CUNDINAMARCA","CTEL",8721806744,"CONTRATADO EN EJECUCIÓN",44926,{"$f":"VLOOKUP(Tabla22[[#This Row],[BPIN ]],[1]Base1!F$3:Z$223,21,0)","v":44926},45224,{"$f":"Tabla22[[#This Row],[FECHA ]]-Tabla22[[#This Row],[HOY]]","v":-298},{"$f":"Tabla22[[#This Row],[FECHA ]]-Tabla22[[#This Row],[FECHA DE TERMINACIÓN2]]","v":0}]
["CUNDINAMARCA","SECRETARIA DE CIENCIA, TECNOLOGIA E INNOVACIÓN","ALEXANDER RIVEROS Y YAHIR ARCINIEGAS","LUIS MANUEL GONZALEZ",2012000100144,"INVESTIGACIÓN INVESTIGACION, DESARROLLO Y TRANSFERENCIA TECNOLOGICA EN EL SECTOR AGROPECUARIO Y AGROINDUSTRIAL CON EL FIN DE MEJORAR L TODO EL DEPARTAMENTO, CUNDINAMARCA, CENTRO ORIENTE","CTEL",50514736439,"CONTRATADO EN EJECUCIÓN",45716,{"$f":"VLOOKUP(Tabla22[[#This Row],[BPIN ]],[1]Base1!F$3:Z$223,21,0)","v":45716},45224,{"$f":"Tabla22[[#This Row],[FECHA ]]-Tabla22[[#This Row],[HOY]]","v":492},{"$f":"Tabla22[[#This Row],[FECHA ]]-Tabla22[[#This Row],[FECHA DE TERMINACIÓN2]]","v":0}]
["CUNDINAMARCA","SECRETARIA DE MINAS, ENERGIA Y GAS","DIEGO TORRES","ALVARO CHACON",2013000050026,"CONSTRUCCIÓN REDES ELECTRICAS EN LA ZONA RURAL DE LOS MUNICIPIOS DE PARATEBUENO Y GUTIERREZ EN EL DEPARTAMENTO DE CUNDINAMARCA","MINAS Y ENERGÍA",1068319227,"TERMINADO",42369,{"$f":"VLOOKUP(Tabla22[[#This Row],[BPIN ]],[1]Base1!F$3:Z$223,21,0)","v":42369},45224,{"$f":"Tabla22[[#This Row],[FECHA ]]-Tabla22[[#This Row],[HOY]]","v":-2855},{"$f":"Tabla22[[#This Row],[FECHA ]]-Tabla22[[#This Row],[FECHA DE TERMINACIÓN2]]","v":0}]
["ENTIDAD APORTANTE RECURSOS","BANCO AGRARIO DE COLOMBIA","DIEGO TORRES / JEIMY FORERO",null,2013000050044,"CONSTRUCCIÓN CUNDINAMARCA VISR 2013 TODO EL DEPARTAMENTO, CUNDINAMARCA, CENTRO ORIENTE","AGRICULTURA ",60041780218,"CONTRATADO EN EJECUCIÓN",45260,{"$f":"VLOOKUP(Tabla22[[#This Row],[BPIN ]],[1]Base1!F$3:Z$223,21,0)","v":45260},45224,{"$f":"Tabla22[[#This Row],[FECHA ]]-Tabla22[[#This Row],[HOY]]","v":36},{"$f":"Tabla22[[#This Row],[FECHA ]]-Tabla22[[#This Row],[FECHA DE TERMINACIÓN2]]","v":0}]
["CUNDINAMARCA","SECRETARIA DE CIENCIA, TECNOLOGIA E INNOVACIÓN","ALEXANDER RIVEROS Y YAHIR ARCINIEGAS","LUIS MANUEL GONZALEZ",2013000100129,"INCREMENTO EN LAS ESTRATEGIAS SUSTENTABLES EN EL USO DEL RECURSO DE ENERGA ELECTRICA PARA LA POBLACION VULNERABLE EN EL DPTO. DE CUNDINAMARCA","CTEL",5170002961,"CONTRATADO EN EJECUCIÓN",44865,{"$f":"VLOOKUP(Tabla22[[#This Row],[BPIN ]],[1]Base1!F$3:Z$223,21,0)","v":44865},45224,{"$f":"Tabla22[[#This Row],[FECHA ]]-Tabla22[[#This Row],[HOY]]","v":-359},{"$f":"Tabla22[[#This Row],[FECHA ]]-Tabla22[[#This Row],[FECHA DE TERMINACIÓN2]]","v":0}]
{"$rows_left_out":122}
{"sheet":"Riesgo de liberación","index":3,"n_rows":7,"n_cols":18,"rows_kept":7,"cut":false,"hidden":true,"merged":[]}
[]
["N°","EJECUTOR (Dpto / Entidad)","EJECUTOR INTERNO","ENCARGADO DE LA ENTIDAD ","ENLACE EMTIDAD EJECUTORA","BPIN ","PROYECTO","SECTOR","VALOR PROYECTO","VALOR SGR","OTRAS FUENTES","FECHA DE APROBACIÓN OCAD","ACUERDO DE APROBACIÓN","ESTADO","FECHA LIMITE","DÍAS TRANSCURRIDOS DESDE EL ACUERDO DE APROBACIÓN  ","Columna1","DÍAS HABILES PARA REALIZAR ACTO DE APERTURA"]
[]
[220,"CUNDINAMARCA","UNIDAD ADMINISTRATIVA DE GESTIÓN DEL RIESGO.",null,null,2022004250031,{"$f":"VLOOKUP(F4,'Proyectos en Ejecución'!$D$7:$W$242,2,0)","v":"CONSTRUCCIÓN DE OBRAS PARA MITIGAR LOS RIESGOS QUE SE PRESENTAN EN LA ZONAS ALEDAÑAS A LA URBANIZACIÓN SASIPA DEL MUNICIPIO DE SILVANIA CUNDINAMARCA"},{"$f":"VLOOKUP(F4,'Proyectos en Ejecución'!$D$7:$W$242,4,0)","v":"GOBIERNO TERRITORIAL"},{"$f":"VLOOKUP(F4,'Proyectos en Ejecución'!$D$7:$W$242,5,0)","v":3673954111},{"$f":"VLOOKUP(F4,'Proyectos en Ejecución'!$D$7:$W$242,6,0)","v":3673954111},{"$f":"I4-J4","v":0},{"$f":"VLOOKUP(F4,'Proyectos en Ejecución'!$D$7:$W$242,8,0)","v":44922},{"$f":"VLOOKUP(F4,'Proyectos en Ejecución'!$D$7:$W$242,10,0)","v":"DECRETO No 513 DE 2022"},{"$f":"VLOOKUP(F4,'Proyectos en Ejecución'!$D$7:$W$242,18,0)","v":"SIN CONTRATAR"},{"$f":"IF(L4=0,\"-\",EDATE(L4,6))","v":45104},{"$f":"IF(L4=0,\"-\",_xlfn.DAYS(TODAY(),L4))","v":302},{"$f":"IF(O4=\"-\",\"-\",_xlfn.DAYS(TODAY(),O4))","v":120},{"$f":"-Q4","v":-120}]
[223,"CUNDINAMARCA","SECRETARIA DE AMBIENTE",null,null,20223201010038,{"$f":"VLOOKUP(F5,'Proyectos en Ejecución'!$D$7:$W$242,2,0)","v":"IMPLEMENTACION DE UN PROCESO DE RESTAURACIÓN ECOLÓGICA COMO MEDIDA DE CONSERVACIÓN DE ÁREAS AMBIENTALES ESTRATÉGICAS EN LA PROVINCIA DE GUALIVA CUNDINAMARCA"},{"$f":"VLOOKUP(F5,'Proyectos en Ejecución'!$D$7:$W$242,4,0)","v":"AMBIENTE Y DESARROLLO SOSTENIBLE"},{"$f":"VLOOKUP(F5,'Proyectos en Ejecución'!$D$7:$W$242,5,0)","v":2238923844},{"$f":"VLOOKUP(F5,'Proyectos en Ejecución'!$D$7:$W$242,6,0)","v":" $ 2.238.923.844 "},0,{"$f":"VLOOKUP(F5,'Proyectos en Ejecución'!$D$7:$W$242,8,0)","v":"20/01/2023"},{"$f":"VLOOKUP(F5,'Proyectos en Ejecución'!$D$7:$W$242,10,0)","v":"DE 2023"},{"$f":"VLOOKUP(F5,'Proyectos en Ejecución'!$D$7:$W$242,18,0)","v":"SIN CONTRATAR"},45127,278,97,-97]
[]
[null,null,null,null,null,null,null,null,{"$f":"SUM(I3:I5)","v":5912877955},{"$f":"SUM(J3:J5)","v":3673954111}]

{"sheet":"Control de avances","index":4,"n_rows":1651,"n_cols":33,"rows_kept":1651,"cut":false,"hidden":true,"merged":[[216,19,216,21],[217,19,217,21],[0,0,0,14],[0,18,0,19],[0,21,0,22],[214,19,214,21],[215,19,215,21]]}
[" SISTEMAS GENERAL DEL REGALÍAS-BASE DE PROYECTOS APROBADOS",null,null,null,null,null,null,null,null,null,null,null,null,null,null,null,null,null,"\tAVANCE FÍSICO Y FINANCIERO",null,null,"ESTADO"]
["N°","EJECUTOR (Dpto / Entidad)","EJECUTOR INTERNO","ENCARGADO DE LA ENTIDAD ","ENLACE ENTIDAD EJECUTORA","BPIN","PROYECTO","SECTOR","VALOR PROYECTO","VALOR SGR","OTRAS FUENTES","FECHA DE APROBACIÓN OCAD","ESTADO","\tAVANCE FÍSICO","\tAVANCE FINANCIERO",null,null,null,"presento avance en el mes vigente ",null,null,"presento avance en el mes vigente ",null,null,null,null,"ESTADO"]
[1,"CUNDINAMARCA","SECRETARIA DE AMBIENTE","ALEXANDER RIVEROS /  LIYUGETH ALFONSO","HERNAN CAMILO",2012000050005,"ESTUDIOS Y DISEÑOS DE DETALLE EMBALSE CALANDAIMA MUNICIPIO DE EL COLEGIO DEPARTAMENTO DE CUNDINAMARCA","AMBIENTE Y DESARROLLO SOSTENIBLE",4000000000,1000000000,{"$f":"I3-J3","v":3000000000},41271,"CERRADO",1,1,null,null,null,"lleva 1 mes sin reportar avance",null,null,"lleva 3 mes sin reportar avance",null,null,null,null,44972,44607,{"$f":"IF(AA3=0,0,_xlfn.DAYS(AA3,TODAY()))","v":-252},{"$f":"IF(AB3=0,0,_xlfn.DAYS(AB3,TODAY()))","v":-617},{"$f":"IF(Z3=0,0,_xlfn.DAYS(Z3,TODAY()))","v":0}]
[2,"DESENTRALIZADOS","ICCU - GESPROY GB","ALEXANDER RIVEROS / JEIMY FORERO","GIOVANY QUEVEDO",2012000050006,"CONSTRUCCIÓN CUBIERTA COLISEO DEL CENTRO AGROTECNOLOGICO DE EXPOSICIONES Y COMERCIALIZACION DE LA REGION DEL SUMAPAZ EN EL MUNICIPIO DE FUSAGASUGA - CUNDINAMARCA","TRANSPORTE",6352617736,3581530801,2771086935,41271,"CERRADO",1,0.99539999999999995,null,null,null,"lleva 3 mes sin reportar avance",null,null,"lleva 6 mes sin reportar avance",null,null,null,null,44972,44607,{"$f":"IF(AA4=0,0,_xlfn.DAYS(AA4,TODAY()))","v":-252},{"$f":"IF(AB4=0,0,_xlfn.DAYS(AB4,TODAY()))","v":-617},{"$f":"IF(Z4=0,0,_xlfn.DAYS(Z4,TODAY()))","v":0}]
[3,"CUNDINAMARCA","SECRETARIA DE AGRICULTURA","DIEGO TORRES/ LIYUGETH ALFONSO","RAINER ABUETA",2012000050007,"FORTALECIMIENTO DE LAS CADENAS HORTIFRUTICOLA Y AROMATICAS EN CUNDINAMARCA","AGRICULTURA ",2490400000,1300000000,1190400000,41271,"CERRADO",1,1,null,null,null,"lleva 4 mes sin reportar avance",null,null,"lleva 9 mes sin reportar avance",null,null,null,null,44607,44607,{"$f":"IF(AA5=0,0,_xlfn.DAYS(AA5,TODAY()))","v":-617},-617,{"$f":"IF(Z5=0,0,_xlfn.DAYS(Z5,TODAY()))","v":0}]
[4,"CUNDINAMARCA","SECRETARIA DE AGRICULTURA","DIEGO TORRES/ LIYUGETH ALFONSO","RAINER ABUETA",2012000050009,"FORTALECIMIENTO DE LA PRODUCTIVIDAD Y COMPETITIVIDAD DEL SECTOR CACAOTERO EN EL DEPARTAMENTO DE CUNDINAMARCA ","AGRICULTURA ",2334689275,1200000000,1134689275,41271,"CERRADO",1,0.96340000000000003,null,null,null,"lleva 6 mes sin reportar avance",null,null,"lleva 1 año sin reportar avance",null,null,null,null,44607,44607,{"$f":"IF(AA6=0,0,_xlfn.DAYS(AA6,TODAY()))","v":-617},-617,0]
[5,"CUNDINAMARCA","SECRETARIA GENERAL","DAYANA FERNANDEZ/ VALENTINA PORTILLO","JIMENA TAFUR",2012000050010,"ESTUDIOS Y DISEÑOS PARA LA RECUPERACIÓN Y ADECUACION DEL PATRIMONIO HISTORICO CULTURAL PALACIO DE SAN FRANCISCO EN BOGOTA D.C. DEPARTAMENTO DE CUNDINAMARCA ","CULTURA ",1000000000,1000000000,0,41271,"CERRADO",1,0.95140000000000002,null,null,null,null,null,null,null,null,null,null,45034,45187,45034,-37,-190,-190]
[6,"CUNDINAMARCA","SECRETARIA DE EDUCACIÓN","ALEXANDER RIVEROS / JEIMY FORERO","GENNY PADILLA",2012000050011,"FORTALECIMIENTO DE LA PERMANENCIA DE LOS ESTUDIANTES EN LOS MUNICIPIOS DEL DEPARTAMENTO DE CUNDINAMARCA DEPARTAMENTO DE CUNDINAMARCA\n","EDUCACIÓN",6000000000,6000000000,0,41187,"CERRADO",1,0.58189999999999997,null,null,null,null,null,null,null,null,null,null,null,44607,44607,-617,-617,0]
{"$rows_left_out":1644}
{"sheet":"Hoja1","index":5,"n_rows":52,"n_cols":10,"rows_kept":52,"cut":false,"hidden":true,"merged":[]}
["EJECUTOR (Dpto / Entidad)","(Todas)"]
["ESTADO","(Varios elementos)",null,null,null,null,"EJECUTOR (Dpto / Entidad)","DESENTRALIZADOS"]
[]
["Etiquetas de fila","Suma de VALOR PROYECTO","Suma de VALOR SGR",null,null,null,"Etiquetas de fila","Cuenta de BPIM","Suma de VALOR PROYECTO","Suma de VALOR SGR"]
["AGROSAVIA",4583970033,3282745260,null,null,null,"ICCU - GESPROY GB",45,305040081219.72998,269371839280]
["BANCO AGRARIO DE COLOMBIA",60041780218,15888838218,null,null,null,"IDECUT",1,1972606058,1972606058]
["CAR",18000000000,18000000000,null,null,null,"Total general",46,307012687277.72998,271344445338]
["CONNECT BOGOTA REGIÓN",3438832990.73,3028251016.23]
{"$rows_left_out":45}
{"sheet":"Proyectos en Ejecución","index":6,"n_rows":239,"n_cols":23,"rows_kept":239,"cut":false,"hidden":false,"merged":[[0,0,4,22]]}
[" SISTEMAS GENERAL DEL REGALÍAS-BASE DE PROYECTOS APROBADOS"]
[]
[]
[]
[]
["N°","EJECUTOR (Dpto / Entidad)","EJECUTOR INTERNO","BPIN","PROYECTO","FUENTE DE FINANCIACIÓN","SECTOR","VALOR PROYECTO","VALOR SGR","OTRAS FUENTES","FECHA DE APROBACIÓN OCAD","AÑO DE APROBACIÓN","ACUERDO DE APROBACIÓN","Cumplimiento de requisitos previos al inicio de la ejecución","Proyecto fue aprobado en SUIFP SGR pero no ha migrado a Gesproy","CDP","Proyecto fue migrado a Gesproy pero no tiene asignación de recursos en SPGR.","Proyecto con asignación de recursos en SPGR y sin apertura del primer proceso de contratación","Proyecto con asignación de recursos y sin apertura del primer proceso de contratación y sin identificación de alcance,  hitos y programación","Proyecto con apertura del primer proceso de contratación y sin suscripción del primer contrato.","ESTADO","\tAVANCE FÍSICO","\tAVANCE FINANCIERO"]
[1,"CUNDINAMARCA","SECRETARIA DE AMBIENTE",2012000050005,"ESTUDIOS Y DISEÑOS DE DETALLE EMBALSE CALANDAIMA MUNICIPIO DE EL COLEGIO DEPARTAMENTO DE CUNDINAMARCA","(2012) Fondo de desarrollo regional $1.000.000.000\n(2012) Propios $3.000.000.000","AMBIENTE Y DESARROLLO SOSTENIBLE",4000000000,1000000000,{"$f":"H7-I7","v":3000000000},41271,2012,"004 DE 2012","04/04/2013\t","OK","15/04/2013\t","25/01/2013\t","30/08/2013\t","OK","12/07/2013\t","CERRADO",1,1]
[2,"DESENTRALIZADOS","ICCU - GESPROY GB",2012000050006,"CONSTRUCCIÓN CUBIERTA COLISEO DEL CENTRO AGROTECNOLOGICO DE EXPOSICIONES Y COMERCIALIZACION DE LA REGION DEL SUMAPAZ EN EL MUNICIPIO DE FUSAGASUGA - CUNDINAMARCA","(2012) Fondo de desarrollo refional $3.581.531\n(2012) Propios $656.000.000\n(2015) Propios $1.000.000","TRANSPORTE",6352617736,3581530801,2771086935,41271,2012,"004 DE 2012","S.D 31/05/2013","OK","217-24/04/2013",41299,41639,"OK",41808,"CERRADO",1,0.99539999999999995]
{"$rows_left_out":231}