{"text_format":"1","workbook":"xlsx","n_sheets":7,"sheets":["Mapa SGR","Tablas","Vencimiento días","Riesgo de liberación","Control de avances","Hoja1","Proyectos en Ejecución"],"not_rendered":{"charts":4,"images":3,"macros":1,"external_links":1,"defined_names":3,"comments":0,"pivot_tables":6},"unopened":[],"bounds":{"document_bytes":16777216,"sheet_cells":100000,"rows_first":2000,"rows_last":500,"rows_between":2000,"halvings":0,"cell_chars":16384,"cell_head_chars":4096},"cells_cut":0,"cells_raw":0,"read":"whole","date_system":"1900"}

{"sheet":"Mapa SGR","index":0,"n_rows":60,"n_cols":15,"rows_kept":60,"cut":false,"hidden":true,"merged":[[1,7,1,14],[1,6,2,6],[1,5,2,5],[1,4,2,4],[1,3,2,3],[1,1,2,2],[5,1,5,2],[4,1,4,2],[21,1,21,2],[57,1,57,2],[3,1,3,2]]}
[]
[null,"DESCRIPCIÓN",null,"CANTIDAD","VALOR SGR","VALOR OTRAS FUENTES","VALOR TOTAL","ESTADOS"]
[null,null,null,null,null,null,null,"NO HA MIGRADO A GESPROY","SIN CONTRATAR","CONTRATADO SIN ACTA DE INICIO","CONTRATADO EN EJECUCIÓN","TERMINADO","PARA CIERRE","CERRADO","DESAPROBADO"]
[null,"TOTAL PROYECTOS APROBADOS",null,{"$f":"MAX(Tabla2[N°])","v":225},{"$f":"SUM('Proyectos en Ejecución'!I7:I228)","v":1435250758848.3201},{"$f":"G4-E4","v":3757723742026.2402},{"$f":"SUM('Proyectos en Ejecución'!H7:H228)","v":5192974500874.5605},{"$f":"COUNTIFS('Proyectos en Ejecución'!$U$7:$U$277, H$3)","v":0},{"$f":"COUNTIFS('Proyectos en Ejecución'!$U$7:$U$277, I$3)","v":2},{"$f":"COUNTIFS('Proyectos en Ejecución'!$U$7:$U$277, J$3)","v":1},{"$f":"COUNTIFS('Proyectos en Ejecución'!$U$7:$U$277, K$3)","v":84},{"$f":"COUNTIFS('Proyectos en Ejecución'!$U$7:$U$277, L$3)","v":13},{"$f":"COUNTIFS('Proyectos en Ejecución'!$U$7:$U$277, M$3)","v":12},{"$f":"COUNTIFS('Proyectos en Ejecución'!$U$7:$U$277, N$3)","v":106},{"$f":"COUNTIFS('Proyectos en Ejecución'!$U$7:$U$277, O$3)","v":6}]
[null,"TOTAL PROYECTOS EJECUCIÓN",null,{"$f":"SUM(H4:M4)","v":112},{"$f":"GETPIVOTDATA(\"Suma de VALOR SGR\",Hoja1!$A$4)","v":775006557572.7301},{"$f":"G5-E5","v":126849431325.84998},{"$f":"GETPIVOTDATA(\"Suma de VALOR PROYECTO\",Hoja1!$A$4)","v":901855988898.58008},{"$f":"COUNTIFS('Proyectos en Ejecución'!$U$7:$U$277, H$3)","v":0},{"$f":"COUNTIFS('Proyectos en Ejecución'!$U$7:$U$277, I$3)","v":2},{"$f":"COUNTIFS('Proyectos en Ejecución'!$U$7:$U$277, J$3)","v":1},{"$f":"COUNTIFS('Proyectos en Ejecución'!$U$7:$U$277, K$3)","v":84},{"$f":"COUNTIFS('Proyectos en Ejecución'!$U$7:$U$277, L$3)","v":13},{"$f":"COUNTIFS('Proyectos en Ejecución'!$U$7:$U$277, M$3)","v":12},0,0]
[null,"TOTAL PROYECTOS GOBERNACIÓN DESIGNADA COMO EJECUTORA",null,{"$f":"GETPIVOTDATA(\"Cuenta de EJECUTOR INTERNO\",Tablas!$L$4)","v":53},{"$f":"GETPIVOTDATA(\"Suma de VALOR SGR\",Tablas!$L$4)","v":479400281753.54999},{"$f":"G6-E6","v":56852685229.039978},{"$f":"GETPIVOTDATA(\"Suma de VALOR PROYECTO\",Tablas!$F$4)","v":536252966982.58997},{"$f":"SUM(H7:H21)","v":0},{"$f":"SUM(I7:I21)","v":2},1,39,6,7,53,4]
[null,"GOBERNACIÓN DE CUNDINAMARCA","SECRETARIA DE GOBIERNO",{"$f":"GETPIVOTDATA(\"Cuenta de EJECUTOR INTERNO\",Tablas!$L$4,\"EJECUTOR INTERNO\",\"SECRETARIA DE GOBIERNO\")","v":1},{"$f":"GETPIVOTDATA(\"Suma de VALOR SGR\",Tablas!$L$4,\"EJECUTOR INTERNO\",\"SECRETARIA DE GOBIERNO\")","v":8500000000},760000000,{"$f":"GETPIVOTDATA(\"Suma de VALOR PROYECTO\",Tablas!$L$4,\"EJECUTOR INTERNO\",\"SECRETARIA DE GOBIERNO\")","v":9260000000},{"$f":"COUNTIFS('Proyectos en Ejecución'!$C$7:$C$277, $C7, 'Proyectos en Ejecución'!$U$7:$U$277, H$3)","v":0},{"$f":"COUNTIFS('Proyectos en Ejecución'!$C$7:$C$277, $C7, 'Proyectos en Ejecución'!$U$7:$U$277, I$3)","v":0},{"$f":"COUNTIFS('Proyectos en Ejecución'!$C$7:$C$277, $C7, 'Proyectos en Ejecución'!$U$7:$U$277, J$3)","v":0},{"$f":"COUNTIFS('Proyectos en Ejecución'!$C$7:$C$277, $C7, 'Proyectos en Ejecución'!$U$7:$U$277, K$3)","v":0},{"$f":"COUNTIFS('Proyectos en Ejecución'!$C$7:$C$277, $C7, 'Proyectos en Ejecución'!$U$7:$U$277, L$3)","v":0},{"$f":"COUNTIFS('Proyectos en Ejecución'!$C$7:$C$277, $C7, 'Proyectos en Ejecución'!$U$7:$U$277, M$3)","v":1},{"$f":"COUNTIFS('Proyectos en Ejecución'!$C$7:$C$277, $C7, 'Proyectos en Ejecución'!$U$7:$U$277, N$3)","v":3},{"$f":"COUNTIFS('Proyectos en Ejecución'!$C$7:$C$277, $C7, 'Proyectos en Ejecución'!$U$7:$U$277, O$3)","v":0}]
[null,"GOBERNACIÓN DE CUNDINAMARCA","SECRETARIA GENERAL",{"$f":"GETPIVOTDATA(\"Cuenta de EJECUTOR INTERNO\",Tablas!$L$4,\"EJECUTOR INTERNO\",\"SECRETARIA GENERAL\")","v":{"$error":"#REF!"}},{"$f":"GETPIVOTDATA(\"Suma de VALOR SGR\",Tablas!$L$4,\"EJECUTOR INTERNO\",\"SECRETARIA GENERAL\")","v":{"$error":"#REF!"}},{"$error":"#REF!"},{"$f":"GETPIVOTDATA(\"Suma de VALOR PROYECTO\",Tablas!$L$4,\"EJECUTOR INTERNO\",\"SECRETARIA DE PLANEACIÓN\")","v":6791102421.6400003},{"$f":"COUNTIFS('Proyectos en Ejecución'!$C$7:$C$277, $C8, 'Proyectos en Ejecución'!$U$7:$U$277, H$3)","v":0},{"$f":"COUNTIFS('Proyectos en Ejecución'!$C$7:$C$277, $C8, 'Proyectos en Ejecución'!$U$7:$U$277, I$3)","v":0},{"$f":"COUNTIFS('Proyectos en Ejecución'!$C$7:$C$277, $C8, 'Proyectos en Ejecución'!$U$7:$U$277, J$3)","v":0},{"$f":"COUNTIFS('Proyectos en Ejecución'!$C$7:$C$277, $C8, 'Proyectos en Ejecución'!$U$7:$U$277, K$3)","v":0},{"$f":"COUNTIFS('Proyectos en Ejecución'!$C$7:$C$277, $C8, 'Proyectos en Ejecución'!$U$7:$U$277, L$3)","v":0},{"$f":"COUNTIFS('Proyectos en Ejecución'!$C$7:$C$277, $C8, 'Proyectos en Ejecución'!$U$7:$U$277, M$3)","v":0},{"$f":"COUNTIFS('Proyectos en Ejecución'!$C$7:$C$277, $C8, 'Proyectos en Ejecución'!$U$7:$U$277, N$3)","v":1},{"$f":"COUNTIFS('Proyectos en Ejecución'!$C$7:$C$277, $C8, 'Proyectos en Ejecución'!$U$7:$U$277, O$3)","v":0}]
[null,"GOBERNACIÓN DE CUNDINAMARCA","SECRETARIA DE PLANEACIÓN",{"$f":"GETPIVOTDATA(\"Cuenta de EJECUTOR INTERNO\",Tablas!$L$4,\"EJECUTOR INTERNO\",\"SECRETARIA DE PLANEACIÓN\")","v":1},{"$f":"GETPIVOTDATA(\"Suma de VALOR SGR\",Tablas!$L$4,\"EJECUTOR INTERNO\",\"SECRETARIA DE PLANEACIÓN\")","v":6725380621.6400003},{"$error":"#REF!"},{"$f":"GETPIVOTDATA(\"Suma de VALOR PROYECTO\",Tablas!$L$4,\"EJECUTOR INTERNO\",\"SECRETARIA GENERAL\")","v":{"$error":"#REF!"}},{"$f":"COUNTIFS('Proyectos en Ejecución'!$C$7:$C$277, $C9, 'Proyectos en Ejecución'!$U$7:$U$277, H$3)","v":0},{"$f":"COUNTIFS('Proyectos en Ejecución'!$C$7:$C$277, $C9, 'Proyectos en Ejecución'!$U$7:$U$277, I$3)","v":0},{"$f":"COUNTIFS('Proyectos en Ejecución'!$C$7:$C$277, $C9, 'Proyectos en Ejecución'!$U$7:$U$277, J$3)","v":0},{"$f":"COUNTIFS('Proyectos en Ejecución'!$C$7:$C$277, $C9, 'Proyectos en Ejecución'!$U$7:$U$277, K$3)","v":1},{"$f":"COUNTIFS('Proyectos en Ejecución'!$C$7:$C$277, $C9, 'Proyectos en Ejecución'!$U$7:$U$277, L$3)","v":0},{"$f":"COUNTIFS('Proyectos en Ejecución'!$C$7:$C$277, $C9, 'Proyectos en Ejecución'!$U$7:$U$277, M$3)","v":0},{"$f":"COUNTIFS('Proyectos en Ejecución'!$C$7:$C$277, $C9, 'Proyectos en Ejecución'!$U$7:$U$277, N$3)","v":0},{"$f":"COUNTIFS('Proyectos en Ejecución'!$C$7:$C$277, $C9, 'Proyectos en Ejecución'!$U$7:$U$277, O$3)","v":0}]
[null,"GOBERNACIÓN DE CUNDINAMARCA","SECRETARIA DE SALUD",3,475967821059.50995,-56535906122.279968,419431914937.22998,{"$f":"COUNTIFS('Proyectos en Ejecución'!$C$7:$C$277, $C10, 'Proyectos en Ejecución'!$U$7:$U$277, H$3)","v":0},{"$f":"COUNTIFS('Proyectos en Ejecución'!$C$7:$C$277, $C10, 'Proyectos en Ejecución'!$U$7:$U$277, I$3)","v":0},{"$f":"COUNTIFS('Proyectos en Ejecución'!$C$7:$C$277, $C10, 'Proyectos en Ejecución'!$U$7:$U$277, J$3)","v":0},{"$f":"COUNTIFS('Proyectos en Ejecución'!$C$7:$C$277, $C10, 'Proyectos en Ejecución'!$U$7:$U$277, K$3)","v":0},{"$f":"COUNTIFS('Proyectos en Ejecución'!$C$7:$C$277, $C10, 'Proyectos en Ejecución'!$U$7:$U$277, L$3)","v":0},{"$f":"COUNTIFS('Proyectos en Ejecución'!$C$7:$C$277, $C10, 'Proyectos en Ejecución'!$U$7:$U$277, M$3)","v":0},{"$f":"COUNTIFS('Proyectos en Ejecución'!$C$7:$C$277, $C10, 'Proyectos en Ejecución'!$U$7:$U$277, N$3)","v":3},{"$f":"COUNTIFS('Proyectos en Ejecución'!$C$7:$C$277, $C10, 'Proyectos en Ejecución'!$U$7:$U$277, O$3)","v":0}]
[null,"GOBERNACIÓN DE CUNDINAMARCA","UNIDAD ADMINISTRATIVA DE GESTIÓN DEL RIESGO.",{"$f":"GETPIVOTDATA(\"Cuenta de EJECUTOR INTERNO\",Tablas!$L$4,\"EJECUTOR INTERNO\",\"UNIDAD ADMINISTRATIVA DE GESTIÓN DEL RIESGO.\")","v":3},{"$f":"GETPIVOTDATA(\"Suma de VALOR SGR\",Tablas!$L$4,\"EJECUTOR INTERNO\",\"UNIDAD ADMINISTRATIVA DE GESTIÓN DEL RIESGO.\")","v":14058376084},0,{"$f":"GETPIVOTDATA(\"Suma de VALOR PROYECTO\",Tablas!$L$4,\"EJECUTOR INTERNO\",\"UNIDAD ADMINISTRATIVA DE GESTIÓN DEL RIESGO.\")","v":14058376084},{"$f":"COUNTIFS('Proyectos en Ejecución'!$C$7:$C$277, $C11, 'Proyectos en Ejecución'!$U$7:$U$277, H$3)","v":0},{"$f":"COUNTIFS('Proyectos en Ejecución'!$C$7:$C$277, $C11, 'Proyectos en Ejecución'!$U$7:$U$277, I$3)","v":1},{"$f":"COUNTIFS('Proyectos en Ejecución'!$C$7:$C$277, $C11, 'Proyectos en Ejecución'!$U$7:$U$277, J$3)","v":1},{"$f":"COUNTIFS('Proyectos en Ejecución'!$C$7:$C$277, $C11, 'Proyectos en Ejecución'!$U$7:$U$277, K$3)","v":1},{"$f":"COUNTIFS('Proyectos en Ejecución'!$C$7:$C$277, $C11, 'Proyectos en Ejecución'!$U$7:$U$277, L$3)","v":0},{"$f":"COUNTIFS('Proyectos en Ejecución'!$C$7:$C$277, $C11, 'Proyectos en Ejecución'!$U$7:$U$277, M$3)","v":1},{"$f":"COUNTIFS('Proyectos en Ejecución'!$C$7:$C$277, $C11, 'Proyectos en Ejecución'!$U$7:$U$277, N$3)","v":0},{"$f":"COUNTIFS('Proyectos en Ejecución'!$C$7:$C$277, $C11, 'Proyectos en Ejecución'!$U$7:$U$277, O$3)","v":2}]
[null,"GOBERNACIÓN DE CUNDINAMARCA","SECRETARIA DE AMBIENTE",{"$f":"GETPIVOTDATA(\"Cuenta de EJECUTOR INTERNO\",Tablas!$L$4,\"EJECUTOR INTERNO\",\"SECRETARIA DE AMBIENTE\")","v":2},{"$f":"GETPIVOTDATA(\"Suma de VALOR SGR\",Tablas!$L$4,\"EJECUTOR INTERNO\",\"SECRETARIA DE AMBIENTE\")","v":2857824455},2769066314,{"$f":"GETPIVOTDATA(\"Suma de VALOR PROYECTO\",Tablas!$L$4,\"EJECUTOR INTERNO\",\"SECRETARIA DE AMBIENTE\")","v":5626890769},{"$f":"COUNTIFS('Proyectos en Ejecución'!$C$7:$C$277, $C12, 'Proyectos en Ejecución'!$U$7:$U$277, H$3)","v":0},{"$f":"COUNTIFS('Proyectos en Ejecución'!$C$7:$C$277, $C12, 'Proyectos en Ejecución'!$U$7:$U$277, I$3)","v":1},{"$f":"COUNTIFS('Proyectos en Ejecución'!$C$7:$C$277, $C12, 'Proyectos en Ejecución'!$U$7:$U$277, J$3)","v":0},{"$f":"COUNTIFS('Proyectos en Ejecución'!$C$7:$C$277, $C12, 'Proyectos en Ejecución'!$U$7:$U$277, K$3)","v":1},{"$f":"COUNTIFS('Proyectos en Ejecución'!$C$7:$C$277, $C12, 'Proyectos en Ejecución'!$U$7:$U$277, L$3)","v":0},{"$f":"COUNTIFS('Proyectos en Ejecución'!$C$7:$C$277, $C12, 'Proyectos en Ejecución'!$U$7:$U$277, M$3)","v":0},{"$f":"COUNTIFS('Proyectos en Ejecución'!$C$7:$C$277, $C12, 'Proyectos en Ejecución'!$U$7:$U$277, N$3)","v":2},{"$f":"COUNTIFS('Proyectos en Ejecución'!$C$7:$C$277, $C12, 'Proyectos en Ejecución'!$U$7:$U$277, O$3)","v":0}]
[null,"GOBERNACIÓN DE CUNDINAMARCA","SECRETARIA DE AGRICULTURA",{"$f":"GETPIVOTDATA(\"Cuenta de EJECUTOR INTERNO\",Tablas!$L$4,\"EJECUTOR INTERNO\",\"SECRETARIA DE AGRICULTURA\")","v":1},{"$f":"GETPIVOTDATA(\"Suma de VALOR SGR\",Tablas!$L$4,\"EJECUTOR INTERNO\",\"SECRETARIA DE AGRICULTURA\")","v":4220000000},2303880054,{"$f":"GETPIVOTDATA(\"Suma de VALOR PROYECTO\",Tablas!$L$4,\"EJECUTOR INTERNO\",\"SECRETARIA DE AGRICULTURA\")","v":6523880054},{"$f":"COUNTIFS('Proyectos en Ejecución'!$C$7:$C$277, $C13, 'Proyectos en Ejecución'!$U$7:$U$277, H$3)","v":0},{"$f":"COUNTIFS('Proyectos en Ejecución'!$C$7:$C$277, $C13, 'Proyectos en Ejecución'!$U$7:$U$277, I$3)","v":0},{"$f":"COUNTIFS('Proyectos en Ejecución'!$C$7:$C$277, $C13, 'Proyectos en Ejecución'!$U$7:$U$277, J$3)","v":0},{"$f":"COUNTIFS('Proyectos en Ejecución'!$C$7:$C$277, $C13, 'Proyectos en Ejecución'!$U$7:$U$277, K$3)","v":0},{"$f":"COUNTIFS('Proyectos en Ejecución'!$C$7:$C$277, $C13, 'Proyectos en Ejecución'!$U$7:$U$277, L$3)","v":1},{"$f":"COUNTIFS('Proyectos en Ejecución'!$C$7:$C$277, $C13, 'Proyectos en Ejecución'!$U$7:$U$277, M$3)","v":0},{"$f":"COUNTIFS('Proyectos en Ejecución'!$C$7:$C$277, $C13, 'Proyectos en Ejecución'!$U$7:$U$277, N$3)","v":15},{"$f":"COUNTIFS('Proyectos en Ejecución'!$C$7:$C$277, $C13, 'Proyectos en Ejecución'!$U$7:$U$277, O$3)","v":0}]
[null,"GOBERNACIÓN DE CUNDINAMARCA","SECRETARIA DE EDUCACIÓN",{"$f":"GETPIVOTDATA(\"Cuenta de EJECUTOR INTERNO\",Tablas!$L$4,\"EJECUTOR INTERNO\",\"SECRETARIA DE EDUCACIÓN\")","v":5},{"$f":"GETPIVOTDATA(\"Suma de VALOR PROYECTO\",Tablas!$L$4,\"EJECUTOR INTERNO\",\"SECRETARIA DE EDUCACIÓN\")","v":188177731805},0,{"$f":"GETPIVOTDATA(\"Suma de VALOR PROYECTO\",Tablas!$L$4,\"EJECUTOR INTERNO\",\"SECRETARIA DE EDUCACIÓN\")","v":188177731805},{"$f":"COUNTIFS('Proyectos en Ejecución'!$C$7:$C$277, $C14, 'Proyectos en Ejecución'!$U$7:$U$277, H$3)","v":0},{"$f":"COUNTIFS('Proyectos en Ejecución'!$C$7:$C$277, $C14, 'Proyectos en Ejecución'!$U$7:$U$277, I$3)","v":0},{"$f":"COUNTIFS('Proyectos en Ejecución'!$C$7:$C$277, $C14, 'Proyectos en Ejecución'!$U$7:$U$277, J$3)","v":0},{"$f":"COUNTIFS('Proyectos en Ejecución'!$C$7:$C$277, $C14, 'Proyectos en Ejecución'!$U$7:$U$277, K$3)","v":3},{"$f":"COUNTIFS('Proyectos en Ejecución'!$C$7:$C$277, $C14, 'Proyectos en Ejecución'!$U$7:$U$277, L$3)","v":1},{"$f":"COUNTIFS('Proyectos en Ejecución'!$C$7:$C$277, $C14, 'Proyectos en Ejecución'!$U$7:$U$277, M$3)","v":1},{"$f":"COUNTIFS('Proyectos en Ejecución'!$C$7:$C$277, $C14, 'Proyectos en Ejecución'!$U$7:$U$277, N$3)","v":13},{"$f":"COUNTIFS('Proyectos en Ejecución'!$C$7:$C$277, $C14, 'Proyectos en Ejecución'!$U$7:$U$277, O$3)","v":0}]
[null,"GOBERNACIÓN DE CUNDINAMARCA","SECRETARIA DE COMPETITIVIDAD",{"$f":"GETPIVOTDATA(\"Cuenta de EJECUTOR INTERNO\",Tablas!$L$4,\"EJECUTOR INTERNO\",\"SECRETARIA DE COMPETITIVIDAD\")","v":4},{"$f":"GETPIVOTDATA(\"Suma de VALOR PROYECTO\",Tablas!$L$4,\"EJECUTOR INTERNO\",\"SECRETARIA DE COMPETITIVIDAD\")","v":33049757567},0,{"$f":"GETPIVOTDATA(\"Suma de VALOR PROYECTO\",Tablas!$L$4,\"EJECUTOR INTERNO\",\"SECRETARIA DE COMPETITIVIDAD\")","v":33049757567},{"$f":"COUNTIFS('Proyectos en Ejecución'!$C$7:$C$277, $C15, 'Proyectos en Ejecución'!$U$7:$U$277, H$3)","v":0},{"$f":"COUNTIFS('Proyectos en Ejecución'!$C$7:$C$277, $C15, 'Proyectos en Ejecución'!$U$7:$U$277, I$3)","v":0},{"$f":"COUNTIFS('Proyectos en Ejecución'!$C$7:$C$277, $C15, 'Proyectos en Ejecución'!$U$7:$U$277, J$3)","v":0},{"$f":"COUNTIFS('Proyectos en Ejecución'!$C$7:$C$277, $C15, 'Proyectos en Ejecución'!$U$7:$U$277, K$3)","v":3},{"$f":"COUNTIFS('Proyectos en Ejecución'!$C$7:$C$277, $C15, 'Proyectos en Ejecución'!$U$7:$U$277, L$3)","v":0},{"$f":"COUNTIFS('Proyectos en Ejecución'!$C$7:$C$277, $C15, 'Proyectos en Ejecución'!$U$7:$U$277, M$3)","v":1},{"$f":"COUNTIFS('Proyectos en Ejecución'!$C$7:$C$277, $C15, 'Proyectos en Ejecución'!$U$7:$U$277, N$3)","v":0},{"$f":"COUNTIFS('Proyectos en Ejecución'!$C$7:$C$277, $C15, 'Proyectos en Ejecución'!$U$7:$U$277, O$3)","v":0}]
[null,"GOBERNACIÓN DE CUNDINAMARCA","SECRETARIA DE HABITAT Y VIVIENDA",{"$f":"GETPIVOTDATA(\"Cuenta de EJECUTOR INTERNO\",Tablas!$L$4,\"EJECUTOR INTERNO\",\"SECRETARIA DE HABITAT Y VIVIENDA\")","v":4},{"$f":"GETPIVOTDATA(\"Suma de VALOR PROYECTO\",Tablas!$L$4,\"EJECUTOR INTERNO\",\"SECRETARIA DE HABITAT Y VIVIENDA\")","v":17979476172.169998},0,{"$f":"GETPIVOTDATA(\"Suma de VALOR PROYECTO\",Tablas!$L$4,\"EJECUTOR INTERNO\",\"SECRETARIA DE HABITAT Y VIVIENDA\")","v":17979476172.169998},{"$f":"COUNTIFS('Proyectos en Ejecución'!$C$7:$C$277, $C16, 'Proyectos en Ejecución'!$U$7:$U$277, H$3)","v":0},{"$f":"COUNTIFS('Proyectos en Ejecución'!$C$7:$C$277, $C16, 'Proyectos en Ejecución'!$U$7:$U$277, I$3)","v":0},{"$f":"COUNTIFS('Proyectos en Ejecución'!$C$7:$C$277, $C16, 'Proyectos en Ejecución'!$U$7:$U$277, J$3)","v":0},{"$f":"COUNTIFS('Proyectos en Ejecución'!$C$7:$C$277, $C16, 'Proyectos en Ejecución'!$U$7:$U$277, K$3)","v":2},{"$f":"COUNTIFS('Proyectos en Ejecución'!$C$7:$C$277, $C16, 'Proyectos en Ejecución'!$U$7:$U$277, L$3)","v":1},{"$f":"COUNTIFS('Proyectos en Ejecución'!$C$7:$C$277, $C16, 'Proyectos en Ejecución'!$U$7:$U$277, M$3)","v":1},{"$f":"COUNTIFS('Proyectos en Ejecución'!$C$7:$C$277, $C16, 'Proyectos en Ejecución'!$U$7:$U$277, N$3)","v":1},{"$f":"COUNTIFS('Proyectos en Ejecución'!$C$7:$C$277, $C16, 'Proyectos en Ejecución'!$U$7:$U$277, O$3)","v":0}]
[null,"GOBERNACIÓN DE CUNDINAMARCA","SECRETARIA DE MINAS, ENERGIA Y GAS",{"$f":"GETPIVOTDATA(\"Cuenta de EJECUTOR INTERNO\",Tablas!$L$4,\"EJECUTOR INTERNO\",\"SECRETARIA DE MINAS, ENERGIA Y GAS\")","v":3},{"$f":"GETPIVOTDATA(\"Suma de VALOR SGR\",Tablas!$L$4,\"EJECUTOR INTERNO\",\"SECRETARIA DE MINAS, ENERGIA Y GAS\")","v":12711103496},10364201040,{"$f":"GETPIVOTDATA(\"Suma de VALOR PROYECTO\",Tablas!$L$4,\"EJECUTOR INTERNO\",\"SECRETARIA DE MINAS, ENERGIA Y GAS\")","v":23075304536},{"$f":"COUNTIFS('Proyectos en Ejecución'!$C$7:$C$277, $C17, 'Proyectos en Ejecución'!$U$7:$U$277, H$3)","v":0},{"$f":"COUNTIFS('Proyectos en Ejecución'!$C$7:$C$277, $C17, 'Proyectos en Ejecución'!$U$7:$U$277, I$3)","v":0},{"$f":"COUNTIFS('Proyectos en Ejecución'!$C$7:$C$277, $C17, 'Proyectos en Ejecución'!$U$7:$U$277, J$3)","v":0},{"$f":"COUNTIFS('Proyectos en Ejecución'!$C$7:$C$277, $C17, 'Proyectos en Ejecución'!$U$7:$U$277, K$3)","v":2},{"$f":"COUNTIFS('Proyectos en Ejecución'!$C$7:$C$277, $C17, 'Proyectos en Ejecución'!$U$7:$U$277, L$3)","v":0},{"$f":"COUNTIFS('Proyectos en Ejecución'!$C$7:$C$277, $C17, 'Proyectos en Ejecución'!$U$7:$U$277, M$3)","v":1},{"$f":"COUNTIFS('Proyectos en Ejecución'!$C$7:$C$277, $C17, 'Proyectos en Ejecución'!$U$7:$U$277, N$3)","v":5},{"$f":"COUNTIFS('Proyectos en Ejecución'!$C$7:$C$277, $C17, 'Proyectos en Ejecución'!$U$7:$U$277, O$3)","v":1}]
[null,"GOBERNACIÓN DE CUNDINAMARCA","SECRETARIA DE CIENCIA, TECNOLOGIA E INNOVACIÓN",{"$f":"GETPIVOTDATA(\"Cuenta de EJECUTOR INTERNO\",Tablas!$L$4,\"EJECUTOR INTERNO\",\"SECRETARIA DE CIENCIA, TECNOLOGIA E INNOVACIÓN\")","v":27},{"$f":"GETPIVOTDATA(\"Suma de VALOR SGR\",Tablas!$L$4,\"EJECUTOR INTERNO\",\"SECRETARIA DE CIENCIA, TECNOLOGIA E INNOVACIÓN\")","v":157570339540.22998},{"$f":"G18-E20","v":161710572534.78},{"$f":"GETPIVOTDATA(\"Suma de VALOR PROYECTO\",Tablas!$L$4,\"EJECUTOR INTERNO\",\"SECRETARIA DE CIENCIA, TECNOLOGIA E INNOVACIÓN\")","v":194210559816.78},{"$f":"COUNTIFS('Proyectos en Ejecución'!$C$7:$C$277, $C18, 'Proyectos en Ejecución'!$U$7:$U$277, H$3)","v":0},{"$f":"COUNTIFS('Proyectos en Ejecución'!$C$7:$C$277, $C18, 'Proyectos en Ejecución'!$U$7:$U$277, I$3)","v":0},{"$f":"COUNTIFS('Proyectos en Ejecución'!$C$7:$C$277, $C18, 'Proyectos en Ejecución'!$U$7:$U$277, J$3)","v":0},{"$f":"COUNTIFS('Proyectos en Ejecución'!$C$7:$C$277, $C18, 'Proyectos en Ejecución'!$U$7:$U$277, K$3)","v":23},{"$f":"COUNTIFS('Proyectos en Ejecución'!$C$7:$C$277, $C18, 'Proyectos en Ejecución'!$U$7:$U$277, L$3)","v":3},{"$f":"COUNTIFS('Proyectos en Ejecución'!$C$7:$C$277, $C18, 'Proyectos en Ejecución'!$U$7:$U$277, M$3)","v":1},{"$f":"COUNTIFS('Proyectos en Ejecución'!$C$7:$C$277, $C18, 'Proyectos en Ejecución'!$U$7:$U$277, N$3)","v":10},{"$f":"COUNTIFS('Proyectos en Ejecución'!$C$7:$C$277, $C18, 'Proyectos en Ejecución'!$U$7:$U$277, O$3)","v":1}]
[null,"GOBERNACIÓN DE CUNDINAMARCA","SECRETARIA DE PLANEACIÓN",{"$f":"GETPIVOTDATA(\"Cuenta de EJECUTOR INTERNO\",Tablas!$L$4,\"EJECUTOR INTERNO\",\"SECRETARIA DE PLANEACIÓN\")","v":1},{"$f":"GETPIVOTDATA(\"Suma de VALOR SGR\",Tablas!$L$4,\"EJECUTOR INTERNO\",\"SECRETARIA DE PLANEACIÓN\")","v":6725380621.6400003},{"$f":"G19-E20","v":-25708884860.360001},{"$f":"GETPIVOTDATA(\"Suma de VALOR PROYECTO\",Tablas!$L$4,\"EJECUTOR INTERNO\",\"SECRETARIA DE PLANEACIÓN\")","v":6791102421.6400003},{"$f":"COUNTIFS('Proyectos en Ejecución'!$C$7:$C$277, $C19, 'Proyectos en Ejecución'!$U$7:$U$277, H$3)","v":0},{"$f":"COUNTIFS('Proyectos en Ejecución'!$C$7:$C$277, $C19, 'Proyectos en Ejecución'!$U$7:$U$277, I$3)","v":0},{"$f":"COUNTIFS('Proyectos en Ejecución'!$C$7:$C$277, $C19, 'Proyectos en Ejecución'!$U$7:$U$277, J$3)","v":0},{"$f":"COUNTIFS('Proyectos en Ejecución'!$C$7:$C$277, $C19, 'Proyectos en Ejecución'!$U$7:$U$277, K$3)","v":1},{"$f":"COUNTIFS('Proyectos en Ejecución'!$C$7:$C$277, $C19, 'Proyectos en Ejecución'!$U$7:$U$277, L$3)","v":0},{"$f":"COUNTIFS('Proyectos en Ejecución'!$C$7:$C$277, $C19, 'Proyectos en Ejecución'!$U$7:$U$277, M$3)","v":0},{"$f":"COUNTIFS('Proyectos en Ejecución'!$C$7:$C$277, $C19, 'Proyectos en Ejecución'!$U$7:$U$277, N$3)","v":0},{"$f":"COUNTIFS('Proyectos en Ejecución'!$C$7:$C$277, $C19, 'Proyectos en Ejecución'!$U$7:$U$277, O$3)","v":0}]
[null," SUPERVISIÓN DE INTERVENTORÍA","SECRETARIA DE PLANEACIÓN",{"$f":"GETPIVOTDATA(\"Cuenta de EJECUTOR INTERNO\",Tablas!$L$4,\"EJECUTOR INTERNO\",\"SUPERVISIÓN / INTERVENTORÍA RAPE - SECRETARIA DE PLANEACIÓN\")","v":1},{"$f":"GETPIVOTDATA(\"Suma de VALOR SGR\",Tablas!$L$4,\"EJECUTOR INTERNO\",\"SUPERVISIÓN / INTERVENTORÍA RAPE - SECRETARIA DE PLANEACIÓN\")","v":32499987282},{"$f":"G20-E21","v":27500086807},{"$f":"GETPIVOTDATA(\"Suma de VALOR PROYECTO\",Tablas!$L$4,\"EJECUTOR INTERNO\",\"SUPERVISIÓN / INTERVENTORÍA RAPE - SECRETARIA DE PLANEACIÓN\")","v":32499987282},{"$f":"COUNTIFS('Proyectos en Ejecución'!$C$7:$C$277, $C20, 'Proyectos en Ejecución'!$U$7:$U$277, H$3)","v":0},{"$f":"COUNTIFS('Proyectos en Ejecución'!$C$7:$C$277, $C20, 'Proyectos en Ejecución'!$U$7:$U$277, I$3)","v":0},{"$f":"COUNTIFS('Proyectos en Ejecución'!$C$7:$C$277, $C20, 'Proyectos en Ejecución'!$U$7:$U$277, J$3)","v":0},1,{"$f":"COUNTIFS('Proyectos en Ejecución'!$C$7:$C$277, $C20, 'Proyectos en Ejecución'!$U$7:$U$277, L$3)","v":0},{"$f":"COUNTIFS('Proyectos en Ejecución'!$C$7:$C$277, $C20, 'Proyectos en Ejecución'!$U$7:$U$277, M$3)","v":0},{"$f":"COUNTIFS('Proyectos en Ejecución'!$C$7:$C$277, $C20, 'Proyectos en Ejecución'!$U$7:$U$277, N$3)","v":0},{"$f":"COUNTIFS('Proyectos en Ejecución'!$C$7:$C$277, $C20, 'Proyectos en Ejecución'!$U$7:$U$277, O$3)","v":0}]
[null," SUPERVISIÓN DE INTERVENTORÍA","EMPRESAS PUBLICAS DE CUNDINAMARCA -EPC",{"$f":"GETPIVOTDATA(\"Cuenta de EJECUTOR INTERNO\",Tablas!$L$4,\"EJECUTOR INTERNO\",\"SUPERVISIÓN / INTERVENTORÍA -EPC\")","v":1},{"$f":"GETPIVOTDATA(\"Suma de VALOR SGR\",Tablas!$L$4,\"EJECUTOR INTERNO\",\"SUPERVISIÓN / INTERVENTORÍA -EPC\")","v":4999900475},{"$f":"G21-E21","v":0},{"$f":"GETPIVOTDATA(\"Suma de VALOR PROYECTO\",Tablas!$L$4,\"EJECUTOR INTERNO\",\"SUPERVISIÓN / INTERVENTORÍA -EPC\")","v":4999900475},{"$f":"COUNTIFS('Proyectos en Ejecución'!$C$7:$C$277, $C21, 'Proyectos en Ejecución'!$U$7:$U$277, \"ENTIDAD DESIGNADA PARA LA SUPERVISIÓN DEL PROYECTO O PARA CONTRATAR LA INTERVENTORÍA-EMPRESAS PUBLICAS DE CUNDINAMARCA -EPC\")","v":0},{"$f":"COUNTIFS('Proyectos en Ejecución'!$C$7:$C$277, $C21, 'Proyectos en Ejecución'!$U$7:$U$277, \"ENTIDAD DESIGNADA PARA LA SUPERVISIÓN DEL PROYECTO O PARA CONTRATAR LA INTERVENTORÍA-EMPRESAS PUBLICAS DE CUNDINAMARCA -EPC\")","v":0},{"$f":"COUNTIFS('Proyectos en Ejecución'!$C$7:$C$277, $C21, 'Proyectos en Ejecución'!$U$7:$U$277, \"ENTIDAD DESIGNADA PARA LA SUPERVISIÓN DEL PROYECTO O PARA CONTRATAR LA INTERVENTORÍA-EMPRESAS PUBLICAS DE CUNDINAMARCA -EPC\")","v":0},1,{"$f":"COUNTIFS('Proyectos en Ejecución'!$C$7:$C$277, $C21, 'Proyectos en Ejecución'!$U$7:$U$277, \"ENTIDAD DESIGNADA PARA LA SUPERVISIÓN DEL PROYECTO O PARA CONTRATAR LA INTERVENTORÍA-EMPRESAS PUBLICAS DE CUNDINAMARCA -EPC\")","v":0},{"$f":"COUNTIFS('Proyectos en Ejecución'!$C$7:$C$277, $C21, 'Proyectos en Ejecución'!$U$7:$U$277, M$3)","v":0},{"$f":"COUNTIFS('Proyectos en Ejecución'!$C$7:$C$277, $C21, 'Proyectos en Ejecución'!$U$7:$U$277, N$3)","v":0},{"$f":"COUNTIFS('Proyectos en Ejecución'!$C$7:$C$277, $C21, 'Proyectos en Ejecución'!$U$7:$U$277, O$3)","v":0}]
[null,"TOTAL PROYECTOS ENTIDADES APORTANTES DE RECURSOS",null,{"$f":"SUM(D23:D57)","v":52},{"$f":"SUM(E23:E57)","v":208788012905.57001},118739161232.38,327527174137.95001,{"$f":"SUM(H23:H57)","v":0},{"$f":"SUM(I23:I57)","v":0},0,44,3,3,4,1]
[null,"ENTIDAD APORTANTE DE RECURSOS","U JAVERIANA",1,6524500000,{"$f":"G23-E23","v":0},6524500000,{"$f":"COUNTIFS('Proyectos en Ejecución'!$C$7:$C$277, $C23, 'Proyectos en Ejecución'!$U$7:$U$277, H$3)","v":0},{"$f":"COUNTIFS('Proyectos en Ejecución'!$C$7:$C$277, $C23, 'Proyectos en Ejecución'!$U$7:$U$277, I$3)","v":0},{"$f":"COUNTIFS('Proyectos en Ejecución'!$C$7:$C$277, $C23, 'Proyectos en Ejecución'!$U$7:$U$277, J$3)","v":0},{"$f":"COUNTIFS('Proyectos en Ejecución'!$C$7:$C$277, $C23, 'Proyectos en Ejecución'!$U$7:$U$277, K$3)","v":1},{"$f":"COUNTIFS('Proyectos en Ejecución'!$C$7:$C$277, $C23, 'Proyectos en Ejecución'!$U$7:$U$277, L$3)","v":0},{"$f":"COUNTIFS('Proyectos en Ejecución'!$C$7:$C$277, $C23, 'Proyectos en Ejecución'!$U$7:$U$277, M$3)","v":0},{"$f":"COUNTIFS('Proyectos en Ejecución'!$C$7:$C$277, $C23, 'Proyectos en Ejecución'!$U$7:$U$277, N$3)","v":0},{"$f":"COUNTIFS('Proyectos en Ejecución'!$C$7:$C$277, $C23, 'Proyectos en Ejecución'!$U$7:$U$277, O$3)","v":0}]
[null,"ENTIDAD APORTANTE DE RECURSOS","U TECNOLOGICA DE PEREIRA",1,3950208215,409820000,4360028215,{"$f":"COUNTIFS('Proyectos en Ejecución'!$C$7:$C$277, $C24, 'Proyectos en Ejecución'!$U$7:$U$277, H$3)","v":0},{"$f":"COUNTIFS('Proyectos en Ejecución'!$C$7:$C$277, $C24, 'Proyectos en Ejecución'!$U$7:$U$277, I$3)","v":0},{"$f":"COUNTIFS('Proyectos en Ejecución'!$C$7:$C$277, $C24, 'Proyectos en Ejecución'!$U$7:$U$277, J$3)","v":0},{"$f":"COUNTIFS('Proyectos en Ejecución'!$C$7:$C$277, $C24, 'Proyectos en Ejecución'!$U$7:$U$277, K$3)","v":1},{"$f":"COUNTIFS('Proyectos en Ejecución'!$C$7:$C$277, $C24, 'Proyectos en Ejecución'!$U$7:$U$277, L$3)","v":0},{"$f":"COUNTIFS('Proyectos en Ejecución'!$C$7:$C$277, $C24, 'Proyectos en Ejecución'!$U$7:$U$277, M$3)","v":0},{"$f":"COUNTIFS('Proyectos en Ejecución'!$C$7:$C$277, $C24, 'Proyectos en Ejecución'!$U$7:$U$277, N$3)","v":0},{"$f":"COUNTIFS('Proyectos en Ejecución'!$C$7:$C$277, $C24, 'Proyectos en Ejecución'!$U$7:$U$277, O$3)","v":0}]
[null,"ENTIDAD APORTANTE DE RECURSOS","CAR",1,18000000000,0,18000000000,{"$f":"COUNTIFS('Proyectos en Ejecución'!$C$7:$C$277, $C25, 'Proyectos en Ejecución'!$U$7:$U$277, H$3)","v":0},{"$f":"COUNTIFS('Proyectos en Ejecución'!$C$7:$C$277, $C25, 'Proyectos en Ejecución'!$U$7:$U$277, I$3)","v":0},{"$f":"COUNTIFS('Proyectos en Ejecución'!$C$7:$C$277, $C25, 'Proyectos en Ejecución'!$U$7:$U$277, J$3)","v":0},{"$f":"COUNTIFS('Proyectos en Ejecución'!$C$7:$C$277, $C25, 'Proyectos en Ejecución'!$U$7:$U$277, K$3)","v":1},{"$f":"COUNTIFS('Proyectos en Ejecución'!$C$7:$C$277, $C25, 'Proyectos en Ejecución'!$U$7:$U$277, L$3)","v":0},{"$f":"COUNTIFS('Proyectos en Ejecución'!$C$7:$C$277, $C25, 'Proyectos en Ejecución'!$U$7:$U$277, M$3)","v":0},{"$f":"COUNTIFS('Proyectos en Ejecución'!$C$7:$C$277, $C25, 'Proyectos en Ejecución'!$U$7:$U$277, N$3)","v":0},{"$f":"COUNTIFS('Proyectos en Ejecución'!$C$7:$C$277, $C25, 'Proyectos en Ejecución'!$U$7:$U$277, O$3)","v":1}]
[null,"ENTIDAD APORTANTE DE RECURSOS","UNAD",1,1999985660,1412888541,3412874201,{"$f":"COUNTIFS('Proyectos en Ejecución'!$C$7:$C$277, $C26, 'Proyectos en Ejecución'!$U$7:$U$277, H$3)","v":0},{"$f":"COUNTIFS('Proyectos en Ejecución'!$C$7:$C$277, $C26, 'Proyectos en Ejecución'!$U$7:$U$277, I$3)","v":0},{"$f":"COUNTIFS('Proyectos en Ejecución'!$C$7:$C$277, $C26, 'Proyectos en Ejecución'!$U$7:$U$277, J$3)","v":0},{"$f":"COUNTIFS('Proyectos en Ejecución'!$C$7:$C$277, $C26, 'Proyectos en Ejecución'!$U$7:$U$277, K$3)","v":1},{"$f":"COUNTIFS('Proyectos en Ejecución'!$C$7:$C$277, $C26, 'Proyectos en Ejecución'!$U$7:$U$277, L$3)","v":0},{"$f":"COUNTIFS('Proyectos en Ejecución'!$C$7:$C$277, $C26, 'Proyectos en Ejecución'!$U$7:$U$277, M$3)","v":0},{"$f":"COUNTIFS('Proyectos en Ejecución'!$C$7:$C$277, $C26, 'Proyectos en Ejecución'!$U$7:$U$277, N$3)","v":1},{"$f":"COUNTIFS('Proyectos en Ejecución'!$C$7:$C$277, $C26, 'Proyectos en Ejecución'!$U$7:$U$277, O$3)","v":0}]
[null,"ENTIDAD APORTANTE DE RECURSOS","FEDERACIÓN NACIONAL DE CAFETEROS",1,12848931736,934625588,13783557324,{"$f":"COUNTIFS('Proyectos en Ejecución'!$C$7:$C$277, $C27, 'Proyectos en Ejecución'!$U$7:$U$277, H$3)","v":0},{"$f":"COUNTIFS('Proyectos en Ejecución'!$C$7:$C$277, $C27, 'Proyectos en Ejecución'!$U$7:$U$277, I$3)","v":0},{"$f":"COUNTIFS('Proyectos en Ejecución'!$C$7:$C$277, $C27, 'Proyectos en Ejecución'!$U$7:$U$277, J$3)","v":0},{"$f":"COUNTIFS('Proyectos en Ejecución'!$C$7:$C$277, $C27, 'Proyectos en Ejecución'!$U$7:$U$277, K$3)","v":1},{"$f":"COUNTIFS('Proyectos en Ejecución'!$C$7:$C$277, $C27, 'Proyectos en Ejecución'!$U$7:$U$277, L$3)","v":0},{"$f":"COUNTIFS('Proyectos en Ejecución'!$C$7:$C$277, $C27, 'Proyectos en Ejecución'!$U$7:$U$277, M$3)","v":0},{"$f":"COUNTIFS('Proyectos en Ejecución'!$C$7:$C$277, $C27, 'Proyectos en Ejecución'!$U$7:$U$277, N$3)","v":0},{"$f":"COUNTIFS('Proyectos en Ejecución'!$C$7:$C$277, $C27, 'Proyectos en Ejecución'!$U$7:$U$277, O$3)","v":0}]
[null,"ENTIDAD APORTANTE DE RECURSOS","UNIVERSIDAD ANTONIO NARIÑO",1,4250000000,276652200,4526652200,{"$f":"COUNTIFS('Proyectos en Ejecución'!$C$7:$C$277, $C28, 'Proyectos en Ejecución'!$U$7:$U$277, H$3)","v":0},{"$f":"COUNTIFS('Proyectos en Ejecución'!$C$7:$C$277, $C28, 'Proyectos en Ejecución'!$U$7:$U$277, I$3)","v":0},{"$f":"COUNTIFS('Proyectos en Ejecución'!$C$7:$C$277, $C28, 'Proyectos en Ejecución'!$U$7:$U$277, J$3)","v":0},{"$f":"COUNTIFS('Proyectos en Ejecución'!$C$7:$C$277, $C28, 'Proyectos en Ejecución'!$U$7:$U$277, K$3)","v":1},{"$f":"COUNTIFS('Proyectos en Ejecución'!$C$7:$C$277, $C28, 'Proyectos en Ejecución'!$U$7:$U$277, L$3)","v":0},{"$f":"COUNTIFS('Proyectos en Ejecución'!$C$7:$C$277, $C28, 'Proyectos en Ejecución'!$U$7:$U$277, M$3)","v":0},{"$f":"COUNTIFS('Proyectos en Ejecución'!$C$7:$C$277, $C28, 'Proyectos en Ejecución'!$U$7:$U$277, N$3)","v":0},{"$f":"COUNTIFS('Proyectos en Ejecución'!$C$7:$C$277, $C28, 'Proyectos en Ejecución'!$U$7:$U$277, O$3)","v":0}]
[null,"ENTIDAD APORTANTE DE RECURSOS","IDECUT",1,1972606058,0,1972606058,{"$f":"COUNTIFS('Proyectos en Ejecución'!$C$7:$C$277, $C29, 'Proyectos en Ejecución'!$U$7:$U$277, H$3)","v":0},{"$f":"COUNTIFS('Proyectos en Ejecución'!$C$7:$C$277, $C29, 'Proyectos en Ejecución'!$U$7:$U$277, I$3)","v":0},{"$f":"COUNTIFS('Proyectos en Ejecución'!$C$7:$C$277, $C29, 'Proyectos en Ejecución'!$U$7:$U$277, J$3)","v":0},{"$f":"COUNTIFS('Proyectos en Ejecución'!$C$7:$C$277, $C29, 'Proyectos en Ejecución'!$U$7:$U$277, K$3)","v":0},{"$f":"COUNTIFS('Proyectos en Ejecución'!$C$7:$C$277, $C29, 'Proyectos en Ejecución'!$U$7:$U$277, L$3)","v":0},{"$f":"COUNTIFS('Proyectos en Ejecución'!$C$7:$C$277, $C29, 'Proyectos en Ejecución'!$U$7:$U$277, M$3)","v":0},{"$f":"COUNTIFS('Proyectos en Ejecución'!$C$7:$C$277, $C29, 'Proyectos en Ejecución'!$U$7:$U$277, N$3)","v":1},{"$f":"COUNTIFS('Proyectos en Ejecución'!$C$7:$C$277, $C29, 'Proyectos en Ejecución'!$U$7:$U$277, O$3)","v":0}]
[null,"ENTIDAD APORTANTE DE RECURSOS","EMTEL",1,8993872200.5599995,0,8993872200.5599995,{"$f":"COUNTIFS('Proyectos en Ejecución'!$C$7:$C$277, $C30, 'Proyectos en Ejecución'!$U$7:$U$277, H$3)","v":0},{"$f":"COUNTIFS('Proyectos en Ejecución'!$C$7:$C$277, $C30, 'Proyectos en Ejecución'!$U$7:$U$277, I$3)","v":0},{"$f":"COUNTIFS('Proyectos en Ejecución'!$C$7:$C$277, $C30, 'Proyectos en Ejecución'!$U$7:$U$277, J$3)","v":0},{"$f":"COUNTIFS('Proyectos en Ejecución'!$C$7:$C$277, $C30, 'Proyectos en Ejecución'!$U$7:$U$277, K$3)","v":1},{"$f":"COUNTIFS('Proyectos en Ejecución'!$C$7:$C$277, $C30, 'Proyectos en Ejecución'!$U$7:$U$277, L$3)","v":0},{"$f":"COUNTIFS('Proyectos en Ejecución'!$C$7:$C$277, $C30, 'Proyectos en Ejecución'!$U$7:$U$277, M$3)","v":0},{"$f":"COUNTIFS('Proyectos en Ejecución'!$C$7:$C$277, $C30, 'Proyectos en Ejecución'!$U$7:$U$277, N$3)","v":0},{"$f":"COUNTIFS('Proyectos en Ejecución'!$C$7:$C$277, $C30, 'Proyectos en Ejecución'!$U$7:$U$277, O$3)","v":0}]
[null,"ENTIDAD APORTANTE DE RECURSOS","UNIVERSIDAD DE ANTIOQUIA",1,998808306,91800000,1090608306,{"$f":"COUNTIFS('Proyectos en Ejecución'!$C$7:$C$277, $C31, 'Proyectos en Ejecución'!$U$7:$U$277, H$3)","v":0},{"$f":"COUNTIFS('Proyectos en Ejecución'!$C$7:$C$277, $C31, 'Proyectos en Ejecución'!$U$7:$U$277, I$3)","v":0},{"$f":"COUNTIFS('Proyectos en Ejecución'!$C$7:$C$277, $C31, 'Proyectos en Ejecución'!$U$7:$U$277, J$3)","v":0},{"$f":"COUNTIFS('Proyectos en Ejecución'!$C$7:$C$277, $C31, 'Proyectos en Ejecución'!$U$7:$U$277, K$3)","v":0},{"$f":"COUNTIFS('Proyectos en Ejecución'!$C$7:$C$277, $C31, 'Proyectos en Ejecución'!$U$7:$U$277, L$3)","v":1},{"$f":"COUNTIFS('Proyectos en Ejecución'!$C$7:$C$277, $C31, 'Proyectos en Ejecución'!$U$7:$U$277, M$3)","v":0},{"$f":"COUNTIFS('Proyectos en Ejecución'!$C$7:$C$277, $C31, 'Proyectos en Ejecución'!$U$7:$U$277, N$3)","v":0},{"$f":"COUNTIFS('Proyectos en Ejecución'!$C$7:$C$277, $C31, 'Proyectos en Ejecución'!$U$7:$U$277, O$3)","v":0}]
[null,"ENTIDAD APORTANTE DE RECURSOS","FUNDACION UNIVERSIDAD DEL VALLE",1,10411761978,-10411761978,0,{"$f":"COUNTIFS('Proyectos en Ejecución'!$C$7:$C$277, $C32, 'Proyectos en Ejecución'!$U$7:$U$277, H$3)","v":0},{"$f":"COUNTIFS('Proyectos en Ejecución'!$C$7:$C$277, $C32, 'Proyectos en Ejecución'!$U$7:$U$277, I$3)","v":0},{"$f":"COUNTIFS('Proyectos en Ejecución'!$C$7:$C$277, $C32, 'Proyectos en Ejecución'!$U$7:$U$277, J$3)","v":0},{"$f":"COUNTIFS('Proyectos en Ejecución'!$C$7:$C$277, $C32, 'Proyectos en Ejecución'!$U$7:$U$277, K$3)","v":1},{"$f":"COUNTIFS('Proyectos en Ejecución'!$C$7:$C$277, $C32, 'Proyectos en Ejecución'!$U$7:$U$277, L$3)","v":1},{"$f":"COUNTIFS('Proyectos en Ejecución'!$C$7:$C$277, $C32, 'Proyectos en Ejecución'!$U$7:$U$277, M$3)","v":0},{"$f":"COUNTIFS('Proyectos en Ejecución'!$C$7:$C$277, $C32, 'Proyectos en Ejecución'!$U$7:$U$277, N$3)","v":0},{"$f":"COUNTIFS('Proyectos en Ejecución'!$C$7:$C$277, $C32, 'Proyectos en Ejecución'!$U$7:$U$277, O$3)","v":0}]
[null,"ENTIDAD APORTANTE DE RECURSOS","BANCO AGRARIO DE COLOMBIA",1,15888838218,44152942000,60041780218,{"$f":"COUNTIFS('Proyectos en Ejecución'!$C$7:$C$277, $C33, 'Proyectos en Ejecución'!$U$7:$U$277, H$3)","v":0},{"$f":"COUNTIFS('Proyectos en Ejecución'!$C$7:$C$277, $C33, 'Proyectos en Ejecución'!$U$7:$U$277, I$3)","v":0},{"$f":"COUNTIFS('Proyectos en Ejecución'!$C$7:$C$277, $C33, 'Proyectos en Ejecución'!$U$7:$U$277, J$3)","v":0},{"$f":"COUNTIFS('Proyectos en Ejecución'!$C$7:$C$277, $C33, 'Proyectos en Ejecución'!$U$7:$U$277, K$3)","v":1},{"$f":"COUNTIFS('Proyectos en Ejecución'!$C$7:$C$277, $C33, 'Proyectos en Ejecución'!$U$7:$U$277, L$3)","v":0},{"$f":"COUNTIFS('Proyectos en Ejecución'!$C$7:$C$277, $C33, 'Proyectos en Ejecución'!$U$7:$U$277, M$3)","v":0},{"$f":"COUNTIFS('Proyectos en Ejecución'!$C$7:$C$277, $C33, 'Proyectos en Ejecución'!$U$7:$U$277, N$3)","v":0},{"$f":"COUNTIFS('Proyectos en Ejecución'!$C$7:$C$277, $C33, 'Proyectos en Ejecución'!$U$7:$U$277, O$3)","v":0}]
[null,"ENTIDAD APORTANTE DE RECURSOS","INSTITUTO SUPERIOR DE EDUCACION RURAL DE PAMPLONA",1,999999999,97306328,1097306327,{"$f":"COUNTIFS('Proyectos en Ejecución'!$C$7:$C$277, $C34, 'Proyectos en Ejecución'!$U$7:$U$277, H$3)","v":0},{"$f":"COUNTIFS('Proyectos en Ejecución'!$C$7:$C$277, $C34, 'Proyectos en Ejecución'!$U$7:$U$277, I$3)","v":0},{"$f":"COUNTIFS('Proyectos en Ejecución'!$C$7:$C$277, $C34, 'Proyectos en Ejecución'!$U$7:$U$277, J$3)","v":0},{"$f":"COUNTIFS('Proyectos en Ejecución'!$C$7:$C$277, $C34, 'Proyectos en Ejecución'!$U$7:$U$277, K$3)","v":1},{"$f":"COUNTIFS('Proyectos en Ejecución'!$C$7:$C$277, $C34, 'Proyectos en Ejecución'!$U$7:$U$277, L$3)","v":0},{"$f":"COUNTIFS('Proyectos en Ejecución'!$C$7:$C$277, $C34, 'Proyectos en Ejecución'!$U$7:$U$277, M$3)","v":0},{"$f":"COUNTIFS('Proyectos en Ejecución'!$C$7:$C$277, $C34, 'Proyectos en Ejecución'!$U$7:$U$277, N$3)","v":0},{"$f":"COUNTIFS('Proyectos en Ejecución'!$C$7:$C$277, $C34, 'Proyectos en Ejecución'!$U$7:$U$277, O$3)","v":0}]
[null,"ENTIDAD APORTANTE DE RECURSOS","MUNICIPIO DE ZIPAQUIRA",1,467000000,433000000,900000000,{"$f":"COUNTIFS('Proyectos en Ejecución'!$C$7:$C$277, $C35, 'Proyectos en Ejecución'!$U$7:$U$277, H$3)","v":0},{"$f":"COUNTIFS('Proyectos en Ejecución'!$C$7:$C$277, $C35, 'Proyectos en Ejecución'!$U$7:$U$277, I$3)","v":0},{"$f":"COUNTIFS('Proyectos en Ejecución'!$C$7:$C$277, $C35, 'Proyectos en Ejecución'!$U$7:$U$277, J$3)","v":0},{"$f":"COUNTIFS('Proyectos en Ejecución'!$C$7:$C$277, $C35, 'Proyectos en Ejecución'!$U$7:$U$277, K$3)","v":1},{"$f":"COUNTIFS('Proyectos en Ejecución'!$C$7:$C$277, $C35, 'Proyectos en Ejecución'!$U$7:$U$277, L$3)","v":0},{"$f":"COUNTIFS('Proyectos en Ejecución'!$C$7:$C$277, $C35, 'Proyectos en Ejecución'!$U$7:$U$277, M$3)","v":0},{"$f":"COUNTIFS('Proyectos en Ejecución'!$C$7:$C$277, $C35, 'Proyectos en Ejecución'!$U$7:$U$277, N$3)","v":0},{"$f":"COUNTIFS('Proyectos en Ejecución'!$C$7:$C$277, $C35, 'Proyectos en Ejecución'!$U$7:$U$277, O$3)","v":0}]
[null,"ENTIDAD APORTANTE DE RECURSOS","MEDICINA LEGAL Y CIENCIAS FORENSES",1,904521100,0,904521100,{"$f":"COUNTIFS('Proyectos en Ejecución'!$C$7:$C$277, $C36, 'Proyectos en Ejecución'!$U$7:$U$277, H$3)","v":0},{"$f":"COUNTIFS('Proyectos en Ejecución'!$C$7:$C$277, $C36, 'Proyectos en Ejecución'!$U$7:$U$277, I$3)","v":0},{"$f":"COUNTIFS('Proyectos en Ejecución'!$C$7:$C$277, $C36, 'Proyectos en Ejecución'!$U$7:$U$277, J$3)","v":0},{"$f":"COUNTIFS('Proyectos en Ejecución'!$C$7:$C$277, $C36, 'Proyectos en Ejecución'!$U$7:$U$277, K$3)","v":0},{"$f":"COUNTIFS('Proyectos en Ejecución'!$C$7:$C$277, $C36, 'Proyectos en Ejecución'!$U$7:$U$277, L$3)","v":0},{"$f":"COUNTIFS('Proyectos en Ejecución'!$C$7:$C$277, $C36, 'Proyectos en Ejecución'!$U$7:$U$277, M$3)","v":0},{"$f":"COUNTIFS('Proyectos en Ejecución'!$C$7:$C$277, $C36, 'Proyectos en Ejecución'!$U$7:$U$277, N$3)","v":1},{"$f":"COUNTIFS('Proyectos en Ejecución'!$C$7:$C$277, $C36, 'Proyectos en Ejecución'!$U$7:$U$277, O$3)","v":0}]
[null,"ENTIDAD APORTANTE DE RECURSOS","U CATOLICA",1,299220000,44375000,343595000,{"$f":"COUNTIFS('Proyectos en Ejecución'!$C$7:$C$277, $C37, 'Proyectos en Ejecución'!$U$7:$U$277, H$3)","v":0},{"$f":"COUNTIFS('Proyectos en Ejecución'!$C$7:$C$277, $C37, 'Proyectos en Ejecución'!$U$7:$U$277, I$3)","v":0},{"$f":"COUNTIFS('Proyectos en Ejecución'!$C$7:$C$277, $C37, 'Proyectos en Ejecución'!$U$7:$U$277, J$3)","v":0},{"$f":"COUNTIFS('Proyectos en Ejecución'!$C$7:$C$277, $C37, 'Proyectos en Ejecución'!$U$7:$U$277, K$3)","v":1},{"$f":"COUNTIFS('Proyectos en Ejecución'!$C$7:$C$277, $C37, 'Proyectos en Ejecución'!$U$7:$U$277, L$3)","v":0},{"$f":"COUNTIFS('Proyectos en Ejecución'!$C$7:$C$277, $C37, 'Proyectos en Ejecución'!$U$7:$U$277, M$3)","v":0},{"$f":"COUNTIFS('Proyectos en Ejecución'!$C$7:$C$277, $C37, 'Proyectos en Ejecución'!$U$7:$U$277, N$3)","v":0},{"$f":"COUNTIFS('Proyectos en Ejecución'!$C$7:$C$277, $C37, 'Proyectos en Ejecución'!$U$7:$U$277, O$3)","v":0}]
[null,"ENTIDAD APORTANTE DE RECURSOS","UNIVERSIDAD DE CALDAS",1,6000000000,57580000000,63580000000,{"$f":"COUNTIFS('Proyectos en Ejecución'!$C$7:$C$277, $C38, 'Proyectos en Ejecución'!$U$7:$U$277, H$3)","v":0},{"$f":"COUNTIFS('Proyectos en Ejecución'!$C$7:$C$277, $C38, 'Proyectos en Ejecución'!$U$7:$U$277, I$3)","v":0},{"$f":"COUNTIFS('Proyectos en Ejecución'!$C$7:$C$277, $C38, 'Proyectos en Ejecución'!$U$7:$U$277, J$3)","v":0},{"$f":"COUNTIFS('Proyectos en Ejecución'!$C$7:$C$277, $C38, 'Proyectos en Ejecución'!$U$7:$U$277, K$3)","v":1},{"$f":"COUNTIFS('Proyectos en Ejecución'!$C$7:$C$277, $C38, 'Proyectos en Ejecución'!$U$7:$U$277, L$3)","v":0},{"$f":"COUNTIFS('Proyectos en Ejecución'!$C$7:$C$277, $C38, 'Proyectos en Ejecución'!$U$7:$U$277, M$3)","v":0},{"$f":"COUNTIFS('Proyectos en Ejecución'!$C$7:$C$277, $C38, 'Proyectos en Ejecución'!$U$7:$U$277, N$3)","v":0},{"$f":"COUNTIFS('Proyectos en Ejecución'!$C$7:$C$277, $C38, 'Proyectos en Ejecución'!$U$7:$U$277, O$3)","v":0}]
[null,"ENTIDAD APORTANTE DE RECURSOS","U DISTRITAL",1,1113595753,105073088,1218668841,{"$f":"COUNTIFS('Proyectos en Ejecución'!$C$7:$C$277, $C39, 'Proyectos en Ejecución'!$U$7:$U$277, H$3)","v":0},{"$f":"COUNTIFS('Proyectos en Ejecución'!$C$7:$C$277, $C39, 'Proyectos en Ejecución'!$U$7:$U$277, I$3)","v":0},{"$f":"COUNTIFS('Proyectos en Ejecución'!$C$7:$C$277, $C39, 'Proyectos en Ejecución'!$U$7:$U$277, J$3)","v":0},{"$f":"COUNTIFS('Proyectos en Ejecución'!$C$7:$C$277, $C39, 'Proyectos en Ejecución'!$U$7:$U$277, K$3)","v":1},{"$f":"COUNTIFS('Proyectos en Ejecución'!$C$7:$C$277, $C39, 'Proyectos en Ejecución'!$U$7:$U$277, L$3)","v":0},{"$f":"COUNTIFS('Proyectos en Ejecución'!$C$7:$C$277, $C39, 'Proyectos en Ejecución'!$U$7:$U$277, M$3)","v":0},{"$f":"COUNTIFS('Proyectos en Ejecución'!$C$7:$C$277, $C39, 'Proyectos en Ejecución'!$U$7:$U$277, N$3)","v":0},{"$f":"COUNTIFS('Proyectos en Ejecución'!$C$7:$C$277, $C39, 'Proyectos en Ejecución'!$U$7:$U$277, O$3)","v":0}]
[null,"ENTIDAD APORTANTE DE RECURSOS","UNIVERSIDAD DE CUNDINAMARCA",1,1997753509,26680160,2024433669,{"$f":"COUNTIFS('Proyectos en Ejecución'!$C$7:$C$277, $C40, 'Proyectos en Ejecución'!$U$7:$U$277, H$3)","v":0},{"$f":"COUNTIFS('Proyectos en Ejecución'!$C$7:$C$277, $C40, 'Proyectos en Ejecución'!$U$7:$U$277, I$3)","v":0},{"$f":"COUNTIFS('Proyectos en Ejecución'!$C$7:$C$277, $C40, 'Proyectos en Ejecución'!$U$7:$U$277, J$3)","v":0},{"$f":"COUNTIFS('Proyectos en Ejecución'!$C$7:$C$277, $C40, 'Proyectos en Ejecución'!$U$7:$U$277, K$3)","v":1},{"$f":"COUNTIFS('Proyectos en Ejecución'!$C$7:$C$277, $C40, 'Proyectos en Ejecución'!$U$7:$U$277, L$3)","v":0},{"$f":"COUNTIFS('Proyectos en Ejecución'!$C$7:$C$277, $C40, 'Proyectos en Ejecución'!$U$7:$U$277, M$3)","v":0},{"$f":"COUNTIFS('Proyectos en Ejecución'!$C$7:$C$277, $C40, 'Proyectos en Ejecución'!$U$7:$U$277, N$3)","v":0},{"$f":"COUNTIFS('Proyectos en Ejecución'!$C$7:$C$277, $C40, 'Proyectos en Ejecución'!$U$7:$U$277, O$3)","v":0}]
[null,"ENTIDAD APORTANTE DE RECURSOS","AGROSAVIA",1,3282745260,1301224773,4583970033,{"$f":"COUNTIFS('Proyectos en Ejecución'!$C$7:$C$277, $C41, 'Proyectos en Ejecución'!$U$7:$U$277, H$3)","v":0},{"$f":"COUNTIFS('Proyectos en Ejecución'!$C$7:$C$277, $C41, 'Proyectos en Ejecución'!$U$7:$U$277, I$3)","v":0},{"$f":"COUNTIFS('Proyectos en Ejecución'!$C$7:$C$277, $C41, 'Proyectos en Ejecución'!$U$7:$U$277, J$3)","v":0},{"$f":"COUNTIFS('Proyectos en Ejecución'!$C$7:$C$277, $C41, 'Proyectos en Ejecución'!$U$7:$U$277, K$3)","v":1},{"$f":"COUNTIFS('Proyectos en Ejecución'!$C$7:$C$277, $C41, 'Proyectos en Ejecución'!$U$7:$U$277, L$3)","v":0},{"$f":"COUNTIFS('Proyectos en Ejecución'!$C$7:$C$277, $C41, 'Proyectos en Ejecución'!$U$7:$U$277, M$3)","v":0},{"$f":"COUNTIFS('Proyectos en Ejecución'!$C$7:$C$277, $C41, 'Proyectos en Ejecución'!$U$7:$U$277, N$3)","v":0},{"$f":"COUNTIFS('Proyectos en Ejecución'!$C$7:$C$277, $C41, 'Proyectos en Ejecución'!$U$7:$U$277, O$3)","v":0}]
[null,"ENTIDAD APORTANTE DE RECURSOS","UNIVERSIDAD DE LA SABANA",1,1309600000,210350000,1519950000,{"$f":"COUNTIFS('Proyectos en Ejecución'!$C$7:$C$277, $C42, 'Proyectos en Ejecución'!$U$7:$U$277, H$3)","v":0},{"$f":"COUNTIFS('Proyectos en Ejecución'!$C$7:$C$277, $C42, 'Proyectos en Ejecución'!$U$7:$U$277, I$3)","v":0},{"$f":"COUNTIFS('Proyectos en Ejecución'!$C$7:$C$277, $C42, 'Proyectos en Ejecución'!$U$7:$U$277, J$3)","v":0},{"$f":"COUNTIFS('Proyectos en Ejecución'!$C$7:$C$277, $C42, 'Proyectos en Ejecución'!$U$7:$U$277, K$3)","v":1},{"$f":"COUNTIFS('Proyectos en Ejecución'!$C$7:$C$277, $C42, 'Proyectos en Ejecución'!$U$7:$U$277, L$3)","v":0},{"$f":"COUNTIFS('Proyectos en Ejecución'!$C$7:$C$277, $C42, 'Proyectos en Ejecución'!$U$7:$U$277, M$3)","v":0},{"$f":"COUNTIFS('Proyectos en Ejecución'!$C$7:$C$277, $C42, 'Proyectos en Ejecución'!$U$7:$U$277, N$3)","v":0},{"$f":"COUNTIFS('Proyectos en Ejecución'!$C$7:$C$277, $C42, 'Proyectos en Ejecución'!$U$7:$U$277, O$3)","v":0}]
[null,"ENTIDAD APORTANTE DE RECURSOS","MUNICIPIO DE UTICA",1,2123058880,223945988,2347004868,{"$f":"COUNTIFS('Proyectos en Ejecución'!$C$7:$C$277, $C43, 'Proyectos en Ejecución'!$U$7:$U$277, H$3)","v":0},{"$f":"COUNTIFS('Proyectos en Ejecución'!$C$7:$C$277, $C43, 'Proyectos en Ejecución'!$U$7:$U$277, I$3)","v":0},{"$f":"COUNTIFS('Proyectos en Ejecución'!$C$7:$C$277, $C43, 'Proyectos en Ejecución'!$U$7:$U$277, J$3)","v":0},{"$f":"COUNTIFS('Proyectos en Ejecución'!$C$7:$C$277, $C43, 'Proyectos en Ejecución'!$U$7:$U$277, K$3)","v":0},{"$f":"COUNTIFS('Proyectos en Ejecución'!$C$7:$C$277, $C43, 'Proyectos en Ejecución'!$U$7:$U$277, L$3)","v":1},{"$f":"COUNTIFS('Proyectos en Ejecución'!$C$7:$C$277, $C43, 'Proyectos en Ejecución'!$U$7:$U$277, M$3)","v":0},{"$f":"COUNTIFS('Proyectos en Ejecución'!$C$7:$C$277, $C43, 'Proyectos en Ejecución'!$U$7:$U$277, N$3)","v":0},{"$f":"COUNTIFS('Proyectos en Ejecución'!$C$7:$C$277, $C43, 'Proyectos en Ejecución'!$U$7:$U$277, O$3)","v":0}]
[null,"ENTIDAD APORTANTE DE RECURSOS","UNIVERSIDAD DEL NORTE",1,6750000000,170233499,6920233499,{"$f":"COUNTIFS('Proyectos en Ejecución'!$C$7:$C$277, $C44, 'Proyectos en Ejecución'!$U$7:$U$277, H$3)","v":0},{"$f":"COUNTIFS('Proyectos en Ejecución'!$C$7:$C$277, $C44, 'Proyectos en Ejecución'!$U$7:$U$277, I$3)","v":0},{"$f":"COUNTIFS('Proyectos en Ejecución'!$C$7:$C$277, $C44, 'Proyectos en Ejecución'!$U$7:$U$277, J$3)","v":0},{"$f":"COUNTIFS('Proyectos en Ejecución'!$C$7:$C$277, $C44, 'Proyectos en Ejecución'!$U$7:$U$277, K$3)","v":1},{"$f":"COUNTIFS('Proyectos en Ejecución'!$C$7:$C$277, $C44, 'Proyectos en Ejecución'!$U$7:$U$277, L$3)","v":0},{"$f":"COUNTIFS('Proyectos en Ejecución'!$C$7:$C$277, $C44, 'Proyectos en Ejecución'!$U$7:$U$277, M$3)","v":0},{"$f":"COUNTIFS('Proyectos en Ejecución'!$C$7:$C$277, $C44, 'Proyectos en Ejecución'!$U$7:$U$277, N$3)","v":0},{"$f":"COUNTIFS('Proyectos en Ejecución'!$C$7:$C$277, $C44, 'Proyectos en Ejecución'!$U$7:$U$277, O$3)","v":0}]
[null,"ENTIDAD APORTANTE DE RECURSOS","U DE LOS ANDES",1,2748000000,66671307,2814671307,{"$f":"COUNTIFS('Proyectos en Ejecución'!$C$7:$C$277, $C45, 'Proyectos en Ejecución'!$U$7:$U$277, H$3)","v":0},{"$f":"COUNTIFS('Proyectos en Ejecución'!$C$7:$C$277, $C45, 'Proyectos en Ejecución'!$U$7:$U$277, I$3)","v":0},{"$f":"COUNTIFS('Proyectos en Ejecución'!$C$7:$C$277, $C45, 'Proyectos en Ejecución'!$U$7:$U$277, J$3)","v":0},{"$f":"COUNTIFS('Proyectos en Ejecución'!$C$7:$C$277, $C45, 'Proyectos en Ejecución'!$U$7:$U$277, K$3)","v":1},{"$f":"COUNTIFS('Proyectos en Ejecución'!$C$7:$C$277, $C45, 'Proyectos en Ejecución'!$U$7:$U$277, L$3)","v":0},{"$f":"COUNTIFS('Proyectos en Ejecución'!$C$7:$C$277, $C45, 'Proyectos en Ejecución'!$U$7:$U$277, M$3)","v":0},{"$f":"COUNTIFS('Proyectos en Ejecución'!$C$7:$C$277, $C45, 'Proyectos en Ejecución'!$U$7:$U$277, N$3)","v":0},{"$f":"COUNTIFS('Proyectos en Ejecución'!$C$7:$C$277, $C45, 'Proyectos en Ejecución'!$U$7:$U$277, O$3)","v":0}]
[null,"ENTIDAD APORTANTE DE RECURSOS","UNIVERSIDAD DEL VALLE",1,5335769261,577300853,5913070114,{"$f":"COUNTIFS('Proyectos en Ejecución'!$C$7:$C$277, $C46, 'Proyectos en Ejecución'!$U$7:$U$277, H$3)","v":0},{"$f":"COUNTIFS('Proyectos en Ejecución'!$C$7:$C$277, $C46, 'Proyectos en Ejecución'!$U$7:$U$277, I$3)","v":0},{"$f":"COUNTIFS('Proyectos en Ejecución'!$C$7:$C$277, $C46, 'Proyectos en Ejecución'!$U$7:$U$277, J$3)","v":0},{"$f":"COUNTIFS('Proyectos en Ejecución'!$C$7:$C$277, $C46, 'Proyectos en Ejecución'!$U$7:$U$277, K$3)","v":1},{"$f":"COUNTIFS('Proyectos en Ejecución'!$C$7:$C$277, $C46, 'Proyectos en Ejecución'!$U$7:$U$277, L$3)","v":0},{"$f":"COUNTIFS('Proyectos en Ejecución'!$C$7:$C$277, $C46, 'Proyectos en Ejecución'!$U$7:$U$277, M$3)","v":0},{"$f":"COUNTIFS('Proyectos en Ejecución'!$C$7:$C$277, $C46, 'Proyectos en Ejecución'!$U$7:$U$277, N$3)","v":0},{"$f":"COUNTIFS('Proyectos en Ejecución'!$C$7:$C$277, $C46, 'Proyectos en Ejecución'!$U$7:$U$277, O$3)","v":0}]
[null,"ENTIDAD APORTANTE DE RECURSOS","CONNECT BOGOTA REGIÓN",1,2972617683,337231070,3309848753,{"$f":"COUNTIFS('Proyectos en Ejecución'!$C$7:$C$277, $C47, 'Proyectos en Ejecución'!$U$7:$U$277, H$3)","v":0},{"$f":"COUNTIFS('Proyectos en Ejecución'!$C$7:$C$277, $C47, 'Proyectos en Ejecución'!$U$7:$U$277, I$3)","v":0},{"$f":"COUNTIFS('Proyectos en Ejecución'!$C$7:$C$277, $C47, 'Proyectos en Ejecución'!$U$7:$U$277, J$3)","v":0},{"$f":"COUNTIFS('Proyectos en Ejecución'!$C$7:$C$277, $C47, 'Proyectos en Ejecución'!$U$7:$U$277, K$3)","v":1},{"$f":"COUNTIFS('Proyectos en Ejecución'!$C$7:$C$277, $C47, 'Proyectos en Ejecución'!$U$7:$U$277, L$3)","v":0},{"$f":"COUNTIFS('Proyectos en Ejecución'!$C$7:$C$277, $C47, 'Proyectos en Ejecución'!$U$7:$U$277, M$3)","v":0},{"$f":"COUNTIFS('Proyectos en Ejecución'!$C$7:$C$277, $C47, 'Proyectos en Ejecución'!$U$7:$U$277, N$3)","v":0},{"$f":"COUNTIFS('Proyectos en Ejecución'!$C$7:$C$277, $C47, 'Proyectos en Ejecución'!$U$7:$U$277, O$3)","v":0}]
[null,"ENTIDAD APORTANTE DE RECURSOS","UNIVERSIDAD EAN",1,1750000000,294506416,2044506416,{"$f":"COUNTIFS('Proyectos en Ejecución'!$C$7:$C$277, $C48, 'Proyectos en Ejecución'!$U$7:$U$277, H$3)","v":0},{"$f":"COUNTIFS('Proyectos en Ejecución'!$C$7:$C$277, $C48, 'Proyectos en Ejecución'!$U$7:$U$277, I$3)","v":0},{"$f":"COUNTIFS('Proyectos en Ejecución'!$C$7:$C$277, $C48, 'Proyectos en Ejecución'!$U$7:$U$277, J$3)","v":0},{"$f":"COUNTIFS('Proyectos en Ejecución'!$C$7:$C$277, $C48, 'Proyectos en Ejecución'!$U$7:$U$277, K$3)","v":1},{"$f":"COUNTIFS('Proyectos en Ejecución'!$C$7:$C$277, $C48, 'Proyectos en Ejecución'!$U$7:$U$277, L$3)","v":0},{"$f":"COUNTIFS('Proyectos en Ejecución'!$C$7:$C$277, $C48, 'Proyectos en Ejecución'!$U$7:$U$277, M$3)","v":0},{"$f":"COUNTIFS('Proyectos en Ejecución'!$C$7:$C$277, $C48, 'Proyectos en Ejecución'!$U$7:$U$277, N$3)","v":0},{"$f":"COUNTIFS('Proyectos en Ejecución'!$C$7:$C$277, $C48, 'Proyectos en Ejecución'!$U$7:$U$277, O$3)","v":0}]
[null,"ENTIDAD APORTANTE DE RECURSOS","U EAN",1,1250000000,44375000,1294375000,{"$f":"COUNTIFS('Proyectos en Ejecución'!$C$7:$C$277, $C49, 'Proyectos en Ejecución'!$U$7:$U$277, H$3)","v":0},{"$f":"COUNTIFS('Proyectos en Ejecución'!$C$7:$C$277, $C49, 'Proyectos en Ejecución'!$U$7:$U$277, I$3)","v":0},{"$f":"COUNTIFS('Proyectos en Ejecución'!$C$7:$C$277, $C49, 'Proyectos en Ejecución'!$U$7:$U$277, J$3)","v":0},{"$f":"COUNTIFS('Proyectos en Ejecución'!$C$7:$C$277, $C49, 'Proyectos en Ejecución'!$U$7:$U$277, K$3)","v":1},{"$f":"COUNTIFS('Proyectos en Ejecución'!$C$7:$C$277, $C49, 'Proyectos en Ejecución'!$U$7:$U$277, L$3)","v":0},{"$f":"COUNTIFS('Proyectos en Ejecución'!$C$7:$C$277, $C49, 'Proyectos en Ejecución'!$U$7:$U$277, M$3)","v":0},{"$f":"COUNTIFS('Proyectos en Ejecución'!$C$7:$C$277, $C49, 'Proyectos en Ejecución'!$U$7:$U$277, N$3)","v":0},{"$f":"COUNTIFS('Proyectos en Ejecución'!$C$7:$C$277, $C49, 'Proyectos en Ejecución'!$U$7:$U$277, O$3)","v":0}]
[null,"ENTIDAD APORTANTE DE RECURSOS","UNIVERSIDAD TECNOLOGICA DE SANTANDER",1,980000000,36752702,1016752702,{"$f":"COUNTIFS('Proyectos en Ejecución'!$C$7:$C$277, $C50, 'Proyectos en Ejecución'!$U$7:$U$277, H$3)","v":0},{"$f":"COUNTIFS('Proyectos en Ejecución'!$C$7:$C$277, $C50, 'Proyectos en Ejecución'!$U$7:$U$277, I$3)","v":0},{"$f":"COUNTIFS('Proyectos en Ejecución'!$C$7:$C$277, $C50, 'Proyectos en Ejecución'!$U$7:$U$277, J$3)","v":0},{"$f":"COUNTIFS('Proyectos en Ejecución'!$C$7:$C$277, $C50, 'Proyectos en Ejecución'!$U$7:$U$277, K$3)","v":1},{"$f":"COUNTIFS('Proyectos en Ejecución'!$C$7:$C$277, $C50, 'Proyectos en Ejecución'!$U$7:$U$277, L$3)","v":0},{"$f":"COUNTIFS('Proyectos en Ejecución'!$C$7:$C$277, $C50, 'Proyectos en Ejecución'!$U$7:$U$277, M$3)","v":0},{"$f":"COUNTIFS('Proyectos en Ejecución'!$C$7:$C$277, $C50, 'Proyectos en Ejecución'!$U$7:$U$277, N$3)","v":0},{"$f":"COUNTIFS('Proyectos en Ejecución'!$C$7:$C$277, $C50, 'Proyectos en Ejecución'!$U$7:$U$277, O$3)","v":0}]
[null,"ENTIDAD APORTANTE DE RECURSOS","PONIFICA UNIVERSIDAD JAVERIANA",1,7246312500,1331179261,8577491761,{"$f":"COUNTIFS('Proyectos en Ejecución'!$C$7:$C$277, $C51, 'Proyectos en Ejecución'!$U$7:$U$277, H$3)","v":0},{"$f":"COUNTIFS('Proyectos en Ejecución'!$C$7:$C$277, $C51, 'Proyectos en Ejecución'!$U$7:$U$277, I$3)","v":0},{"$f":"COUNTIFS('Proyectos en Ejecución'!$C$7:$C$277, $C51, 'Proyectos en Ejecución'!$U$7:$U$277, J$3)","v":0},{"$f":"COUNTIFS('Proyectos en Ejecución'!$C$7:$C$277, $C51, 'Proyectos en Ejecución'!$U$7:$U$277, K$3)","v":1},{"$f":"COUNTIFS('Proyectos en Ejecución'!$C$7:$C$277, $C51, 'Proyectos en Ejecución'!$U$7:$U$277, L$3)","v":0},{"$f":"COUNTIFS('Proyectos en Ejecución'!$C$7:$C$277, $C51, 'Proyectos en Ejecución'!$U$7:$U$277, M$3)","v":0},{"$f":"COUNTIFS('Proyectos en Ejecución'!$C$7:$C$277, $C51, 'Proyectos en Ejecución'!$U$7:$U$277, N$3)","v":0},{"$f":"COUNTIFS('Proyectos en Ejecución'!$C$7:$C$277, $C51, 'Proyectos en Ejecución'!$U$7:$U$277, O$3)","v":0}]
[null,"ENTIDAD APORTANTE DE RECURSOS","UPTC",1,196703104,2113931778,2310634882,{"$f":"COUNTIFS('Proyectos en Ejecución'!$C$7:$C$277, $C52, 'Proyectos en Ejecución'!$U$7:$U$277, H$3)","v":0},{"$f":"COUNTIFS('Proyectos en Ejecución'!$C$7:$C$277, $C52, 'Proyectos en Ejecución'!$U$7:$U$277, I$3)","v":0},{"$f":"COUNTIFS('Proyectos en Ejecución'!$C$7:$C$277, $C52, 'Proyectos en Ejecución'!$U$7:$U$277, J$3)","v":0},{"$f":"COUNTIFS('Proyectos en Ejecución'!$C$7:$C$277, $C52, 'Proyectos en Ejecución'!$U$7:$U$277, K$3)","v":1},{"$f":"COUNTIFS('Proyectos en Ejecución'!$C$7:$C$277, $C52, 'Proyectos en Ejecución'!$U$7:$U$277, L$3)","v":0},{"$f":"COUNTIFS('Proyectos en Ejecución'!$C$7:$C$277, $C52, 'Proyectos en Ejecución'!$U$7:$U$277, M$3)","v":0},{"$f":"COUNTIFS('Proyectos en Ejecución'!$C$7:$C$277, $C52, 'Proyectos en Ejecución'!$U$7:$U$277, N$3)","v":0},{"$f":"COUNTIFS('Proyectos en Ejecución'!$C$7:$C$277, $C52, 'Proyectos en Ejecución'!$U$7:$U$277, O$3)","v":0}]
[null,"ENTIDAD APORTANTE DE RECURSOS","INSTITUTO UNIVERSITARIO DE LA PAZ – UNIPAZ",2,2942953292,1156853887,4099807179,{"$f":"COUNTIFS('Proyectos en Ejecución'!$C$7:$C$277, $C53, 'Proyectos en Ejecución'!$U$7:$U$277, H$3)","v":0},{"$f":"COUNTIFS('Proyectos en Ejecución'!$C$7:$C$277, $C53, 'Proyectos en Ejecución'!$U$7:$U$277, I$3)","v":0},{"$f":"COUNTIFS('Proyectos en Ejecución'!$C$7:$C$277, $C53, 'Proyectos en Ejecución'!$U$7:$U$277, J$3)","v":0},{"$f":"COUNTIFS('Proyectos en Ejecución'!$C$7:$C$277, $C53, 'Proyectos en Ejecución'!$U$7:$U$277, K$3)","v":0},{"$f":"COUNTIFS('Proyectos en Ejecución'!$C$7:$C$277, $C53, 'Proyectos en Ejecución'!$U$7:$U$277, L$3)","v":0},{"$f":"COUNTIFS('Proyectos en Ejecución'!$C$7:$C$277, $C53, 'Proyectos en Ejecución'!$U$7:$U$277, M$3)","v":1},{"$f":"COUNTIFS('Proyectos en Ejecución'!$C$7:$C$277, $C53, 'Proyectos en Ejecución'!$U$7:$U$277, N$3)","v":1},{"$f":"COUNTIFS('Proyectos en Ejecución'!$C$7:$C$277, $C53, 'Proyectos en Ejecución'!$U$7:$U$277, O$3)","v":0}]
[null,"ENTIDAD APORTANTE DE RECURSOS","ZIPAQUIRA",2,7458735075,0,7458735075,{"$f":"COUNTIFS('Proyectos en Ejecución'!$C$7:$C$277, $C54, 'Proyectos en Ejecución'!$U$7:$U$277, H$3)","v":0},{"$f":"COUNTIFS('Proyectos en Ejecución'!$C$7:$C$277, $C54, 'Proyectos en Ejecución'!$U$7:$U$277, I$3)","v":0},{"$f":"COUNTIFS('Proyectos en Ejecución'!$C$7:$C$277, $C54, 'Proyectos en Ejecución'!$U$7:$U$277, J$3)","v":0},{"$f":"COUNTIFS('Proyectos en Ejecución'!$C$7:$C$277, $C54, 'Proyectos en Ejecución'!$U$7:$U$277, K$3)","v":2},{"$f":"COUNTIFS('Proyectos en Ejecución'!$C$7:$C$277, $C54, 'Proyectos en Ejecución'!$U$7:$U$277, L$3)","v":0},{"$f":"COUNTIFS('Proyectos en Ejecución'!$C$7:$C$277, $C54, 'Proyectos en Ejecución'!$U$7:$U$277, M$3)","v":0},{"$f":"COUNTIFS('Proyectos en Ejecución'!$C$7:$C$277, $C54, 'Proyectos en Ejecución'!$U$7:$U$277, N$3)","v":0},{"$f":"COUNTIFS('Proyectos en Ejecución'!$C$7:$C$277, $C54, 'Proyectos en Ejecución'!$U$7:$U$277, O$3)","v":0}]
[null,"ENTIDAD APORTANTE DE RECURSOS","UNIVERSIDAD INDUSTRIAL DE SANTANDER",4,6427957937.8999996,4274485748.3900013,10702443686.290001,{"$f":"COUNTIFS('Proyectos en Ejecución'!$C$7:$C$277, $C55, 'Proyectos en Ejecución'!$U$7:$U$277, H$3)","v":0},{"$f":"COUNTIFS('Proyectos en Ejecución'!$C$7:$C$277, $C55, 'Proyectos en Ejecución'!$U$7:$U$277, I$3)","v":0},{"$f":"COUNTIFS('Proyectos en Ejecución'!$C$7:$C$277, $C55, 'Proyectos en Ejecución'!$U$7:$U$277, J$3)","v":0},{"$f":"COUNTIFS('Proyectos en Ejecución'!$C$7:$C$277, $C55, 'Proyectos en Ejecución'!$U$7:$U$277, K$3)","v":4},{"$f":"COUNTIFS('Proyectos en Ejecución'!$C$7:$C$277, $C55, 'Proyectos en Ejecución'!$U$7:$U$277, L$3)","v":0},{"$f":"COUNTIFS('Proyectos en Ejecución'!$C$7:$C$277, $C55, 'Proyectos en Ejecución'!$U$7:$U$277, M$3)","v":0},{"$f":"COUNTIFS('Proyectos en Ejecución'!$C$7:$C$277, $C55, 'Proyectos en Ejecución'!$U$7:$U$277, N$3)","v":0},{"$f":"COUNTIFS('Proyectos en Ejecución'!$C$7:$C$277, $C55, 'Proyectos en Ejecución'!$U$7:$U$277, O$3)","v":0}]
[null,"ENTIDAD APORTANTE DE RECURSOS","UNIVERSIDAD MILITAR NUEVA GRANADA",5,8434309321,4368562589,12802871910,{"$f":"COUNTIFS('Proyectos en Ejecución'!$C$7:$C$277, $C56, 'Proyectos en Ejecución'!$U$7:$U$277, H$3)","v":0},{"$f":"COUNTIFS('Proyectos en Ejecución'!$C$7:$C$277, $C56, 'Proyectos en Ejecución'!$U$7:$U$277, I$3)","v":0},{"$f":"COUNTIFS('Proyectos en Ejecución'!$C$7:$C$277, $C56, 'Proyectos en Ejecución'!$U$7:$U$277, J$3)","v":0},{"$f":"COUNTIFS('Proyectos en Ejecución'!$C$7:$C$277, $C56, 'Proyectos en Ejecución'!$U$7:$U$277, K$3)","v":5},{"$f":"COUNTIFS('Proyectos en Ejecución'!$C$7:$C$277, $C56, 'Proyectos en Ejecución'!$U$7:$U$277, L$3)","v":0},{"$f":"COUNTIFS('Proyectos en Ejecución'!$C$7:$C$277, $C56, 'Proyectos en Ejecución'!$U$7:$U$277, M$3)","v":0},{"$f":"COUNTIFS('Proyectos en Ejecución'!$C$7:$C$277, $C56, 'Proyectos en Ejecución'!$U$7:$U$277, N$3)","v":0},{"$f":"COUNTIFS('Proyectos en Ejecución'!$C$7:$C$277, $C56, 'Proyectos en Ejecución'!$U$7:$U$277, O$3)","v":0}]
[null,"ENTIDAD APORTANTE DE RECURSOS","UNIVERSIDAD NACIONAL DE COLOMBIA",9,49957647859.110001,7078155433.9899979,57035803293.099998,{"$f":"COUNTIFS('Proyectos en Ejecución'!$C$7:$C$277, $C57, 'Proyectos en Ejecución'!$U$7:$U$277, H$3)","v":0},{"$f":"COUNTIFS('Proyectos en Ejecución'!$C$7:$C$277, $C57, 'Proyectos en Ejecución'!$U$7:$U$277, I$3)","v":0},{"$f":"COUNTIFS('Proyectos en Ejecución'!$C$7:$C$277, $C57, 'Proyectos en Ejecución'!$U$7:$U$277, J$3)","v":0},{"$f":"COUNTIFS('Proyectos en Ejecución'!$C$7:$C$277, $C57, 'Proyectos en Ejecución'!$U$7:$U$277, K$3)","v":7},{"$f":"COUNTIFS('Proyectos en Ejecución'!$C$7:$C$277, $C57, 'Proyectos en Ejecución'!$U$7:$U$277, L$3)","v":0},{"$f":"COUNTIFS('Proyectos en Ejecución'!$C$7:$C$277, $C57, 'Proyectos en Ejecución'!$U$7:$U$277, M$3)","v":2},{"$f":"COUNTIFS('Proyectos en Ejecución'!$C$7:$C$277, $C57, 'Proyectos en Ejecución'!$U$7:$U$277, N$3)","v":0},{"$f":"COUNTIFS('Proyectos en Ejecución'!$C$7:$C$277, $C57, 'Proyectos en Ejecución'!$U$7:$U$277, O$3)","v":0}]
[null,"TOTAL PROYECTOS ENTIDADES DECENTRALIZADAS",null,{"$f":"SUM(D59:D60)","v":46},{"$f":"SUM(E59:E60)","v":271344445338},35668241939.72998,307012687277.72998,0,0,0,2,4,2,37,1]
[null," DECENTRALIZADAS","ICCU - GESPROY GB",{"$f":"GETPIVOTDATA(\"Cuenta de BPIM\",Hoja1!$G$4,\"EJECUTOR INTERNO\",\"ICCU - GESPROY GB\")","v":45},{"$f":"GETPIVOTDATA(\"Suma de VALOR SGR\",Hoja1!$G$4,\"EJECUTOR INTERNO\",\"ICCU - GESPROY GB\")","v":269371839280},{"$f":"G59-E59","v":35668241939.72998},{"$f":"GETPIVOTDATA(\"Suma de VALOR PROYECTO\",Hoja1!$G$4,\"EJECUTOR INTERNO\",\"ICCU - GESPROY GB\")","v":305040081219.72998},{"$f":"COUNTIFS('Proyectos en Ejecución'!$C$7:$C$277, $C59, 'Proyectos en Ejecución'!$U$7:$U$277, H$3)","v":0},{"$f":"COUNTIFS('Proyectos en Ejecución'!$C$7:$C$277, $C59, 'Proyectos en Ejecución'!$U$7:$U$277, I$3)","v":0},{"$f":"COUNTIFS('Proyectos en Ejecución'!$C$7:$C$277, $C59, 'Proyectos en Ejecución'!$U$7:$U$277, J$3)","v":0},{"$f":"COUNTIFS('Proyectos en Ejecución'!$C$7:$C$277, $C59, 'Proyectos en Ejecución'!$U$7:$U$277, K$3)","v":2},{"$f":"COUNTIFS('Proyectos en Ejecución'!$C$7:$C$277, $C59, 'Proyectos en Ejecución'!$U$7:$U$277, L$3)","v":4},{"$f":"COUNTIFS('Proyectos en Ejecución'!$C$7:$C$277, $C59, 'Proyectos en Ejecución'!$U$7:$U$277, M$3)","v":2},{"$f":"COUNTIFS('Proyectos en Ejecución'!$C$7:$C$277, $C59, 'Proyectos en Ejecución'!$U$7:$U$277, N$3)","v":36},{"$f":"COUNTIFS('Proyectos en Ejecución'!$C$7:$C$277, $C59, 'Proyectos en Ejecución'!$U$7:$U$277, O$3)","v":1}]
[null," DECENTRALIZADAS","IDECUT",{"$f":"GETPIVOTDATA(\"Cuenta de BPIM\",Hoja1!$G$4,\"EJECUTOR INTERNO\",\"IDECUT\")","v":1},{"$f":"GETPIVOTDATA(\"Suma de VALOR SGR\",Hoja1!$G$4,\"EJECUTOR INTERNO\",\"IDECUT\")","v":1972606058},{"$f":"G60-E60","v":0},{"$f":"GETPIVOTDATA(\"Suma de VALOR SGR\",Hoja1!$G$4,\"EJECUTOR INTERNO\",\"IDECUT\")","v":1972606058},{"$f":"COUNTIFS('Proyectos en Ejecución'!$C$7:$C$277, $C60, 'Proyectos en Ejecución'!$U$7:$U$277, H$3)","v":0},{"$f":"COUNTIFS('Proyectos en Ejecución'!$C$7:$C$277, $C60, 'Proyectos en Ejecución'!$U$7:$U$277, I$3)","v":0},{"$f":"COUNTIFS('Proyectos en Ejecución'!$C$7:$C$277, $C60, 'Proyectos en Ejecución'!$U$7:$U$277, J$3)","v":0},{"$f":"COUNTIFS('Proyectos en Ejecución'!$C$7:$C$277, $C60, 'Proyectos en Ejecución'!$U$7:$U$277, K$3)","v":0},{"$f":"COUNTIFS('Proyectos en Ejecución'!$C$7:$C$277, $C60, 'Proyectos en Ejecución'!$U$7:$U$277, L$3)","v":0},{"$f":"COUNTIFS('Proyectos en Ejecución'!$C$7:$C$277, $C60, 'Proyectos en Ejecución'!$U$7:$U$277, M$3)","v":0},{"$f":"COUNTIFS('Proyectos en Ejecución'!$C$7:$C$277, $C60, 'Proyectos en Ejecución'!$U$7:$U$277, N$3)","v":1},{"$f":"COUNTIFS('Proyectos en Ejecución'!$C$7:$C$277, $C60, 'Proyectos en Ejecución'!$U$7:$U$277, O$3)","v":0}]

{"sheet":"Tablas","index":1,"n_rows":17,"n_cols":21,"rows_kept":17,"cut":false,"hidden":true,"merged":[]}
["EJECUTOR (Dpto / Entidad)","CUNDINAMARCA",null,null,null,"EJECUTOR (Dpto / Entidad)","(Varios elementos)",null,null,null,null,"EJECUTOR (Dpto / Entidad)","CUNDINAMARCA",null,null,null,null,"EJECUTOR (Dpto / Entidad)","CUNDINAMARCA"]
[null,null,null,null,null,"ESTADO","(Varios elementos)",null,null,null,null,"ESTADO","(Varios elementos)",null,null,null,null,"ESTADO","(Varios elementos)"]
["Etiquetas de fila","Cuenta de ESTADO"]
["CONTRATADO EN EJECUCIÓN",38,null,null,null,"Etiquetas de fila","Cuenta de SECTOR","Suma de VALOR PROYECTO","Suma de VALOR SGR",null,null,"Etiquetas de fila","Cuenta de EJECUTOR INTERNO","Suma de VALOR PROYECTO","Suma de VALOR SGR",null,null,"Etiquetas de fila","Promedio de \tAVANCE FÍSICO","Promedio de \tAVANCE FINANCIERO","Cuenta de EJECUTOR INTERNO"]
["PARA CIERRE",7,null,null,null,"EDUCACIÓN",5,188177731805,188177731805,null,null,"SECRETARIA DE GOBIERNO",1,9260000000,8500000000,null,null,"SECRETARIA DE CIENCIA, TECNOLOGIA E INNOVACIÓN",0.71987037037037049,0.75098888888888904,27]
["TERMINADO",6,null,null,null,"CTEL",27,194210559816.78,157570339540.23001,null,null,"SECRETARIA DE AGRICULTURA",1,6523880054,4220000000,null,null,"SECRETARIA DE EDUCACIÓN",0.79147999999999996,0.52888000000000002,5]
["SIN CONTRATAR",2,null,null,null,"AGRICULTURA ",7,53446293854.169998,47237215508.68,null,null,"SUPERVISIÓN / INTERVENTORÍA -EPC",1,4999900475,4999900475,null,null,"SECRETARIA DE HABITAT Y VIVIENDA",0.83705000000000007,0.7504249999999999,4]
["Total general",53,null,null,null,"AMBIENTE Y DESARROLLO SOSTENIBLE",4,41211785924,38442719610,null,null,"SECRETARIA DE PLANEACIÓN",1,6791102421.6400003,6725380621.6400003,null,null,"SECRETARIA DE COMPETITIVIDAD",0.479825,0.46884999999999999,4]
[null,null,null,null,null,"MINAS Y ENERGÍA",2,23075304536,12711103496,null,null,"SUPERVISIÓN / INTERVENTORÍA RAPE - SECRETARIA DE PLANEACIÓN",1,32499987282,32499987282,null,null,"SECRETARIA DE MINAS, ENERGIA Y GAS",0.4173,0.38716666666666666,3]
[null,null,null,null,null,"GOBIERNO TERRITORIAL",3,10973468211,10973468211,null,null,"SECRETARIA DE AMBIENTE",2,5626890769,2857824455,null,null,"UNIDAD ADMINISTRATIVA DE GESTIÓN DEL RIESGO.",0.40100000000000002,0.3802666666666667,3]
[null,null,null,null,null,"JUSTICIA Y DEL DERECHO ",1,9260000000,8500000000,null,null,"SECRETARIA DE MINAS, ENERGIA Y GAS",3,23075304536,12711103496,null,null,"SECRETARIA DE AMBIENTE",3.2499999999999999E-3,0,2]
[null,null,null,null,null,"VIVIENDA, CIUDAD Y TERRITORIO ",2,7354218600,7354218600,null,null,"UNIDAD ADMINISTRATIVA DE GESTIÓN DEL RIESGO.",3,14058376084,14058376084,null,null,"SECRETARIA DE PLANEACIÓN",0.98519999999999996,0.92030000000000001,1]
[null,null,null,null,null,"TRANSPORTE",1,6791102421.6400003,6725380621.6400003,null,null,"SECRETARIA DE HABITAT Y VIVIENDA",4,17979476172.169998,17339445951.68,null,null,"SUPERVISIÓN / INTERVENTORÍA -EPC",0.85780000000000001,0.78310000000000002,1]
[null,null,null,null,null,"COMERCIO, INDUSTRIA Y TURISMO ",1,1752501814,1708104361,null,null,"SECRETARIA DE COMPETITIVIDAD",4,33049757567,29740192043,null,null,"SUPERVISIÓN / INTERVENTORÍA RAPE - SECRETARIA DE PLANEACIÓN",0.99809999999999999,0.99880000000000002,1]
[null,null,null,null,null,"(en blanco)",null,null,null,null,null,"SECRETARIA DE EDUCACIÓN",5,188177731805,188177731805,null,null,"SECRETARIA DE AGRICULTURA",0.86480000000000001,0.84630000000000005,1]
[null,null,null,null,null,"Total general",53,536252966982.58997,479400281753.55005,null,null,"SECRETARIA DE CIENCIA, TECNOLOGIA E INNOVACIÓN",27,194210559816.78,157570339540.22998,null,null,"SECRETARIA DE GOBIERNO",1,1,1]
[null,null,null,null,null,null,null,null,null,null,null,"Total general",53,536252966982.59003,479400281753.54999,null,null,"Total general",0.67601320754716987,0.65375471698113219,53]

{"sheet":"Vencimiento días","index":2,"n_rows":129,"n_cols":14,"rows_kept":129,"cut":false,"hidden":true,"merged":[]}
["EJECUTOR (Dpto / Entidad)","EJECUTOR INTERNO","ENCARGADO DE LA ENTIDAD ","ENLACE EMTIDAD EJECUTORA","BPIN ","PROYECTO","SECTOR","VALOR","ESTADO","FECHA ","FECHA DE TERMINACIÓN2","HOY","VENCIMIENTO N° DÍAS ","Columna1"]
["CUNDINAMARCA","SECRETARIA GENERAL","YAHIR ARCINIEGAS","JIMENA TAFUR",2012000050010,"ESTUDIOS Y DISEÑOS PARA LA RECUPERACIÓN Y ADECUACION DEL PATRIMONIO HISTORICO CULTURAL PALACIO DE SAN FRANCISCO EN BOGOTA D.C. DEPARTAMENTO DE CUNDINAMARCA ","CULTURA ",1000000000,"TERMINADO",43465,{"$f":"VLOOKUP(Tabla22[[#This Row],[BPIN ]],[1]Base1!F$3:Z$223,21,0)","v":43465},{"$f":"+TODAY()","v":45224},{"$f":"Tabla22[[#This Row],[FECHA DE TERMINACIÓN2]]-Tabla22[[#This Row],[HOY]]","v":-1759},{"$f":"Tabla22[[#This Row],[FECHA ]]-Tabla22[[#This Row],[FECHA DE TERMINACIÓN2]]","v":0}]
["CUNDINAMARCA","SECRETARIA DE COMPETITIVIDAD","ALEXANDER RIVEROS/JEIMY FORERO","FABIAN CUESTA",2012000050030,"DESARROLLO CREACION Y FORTALECIMIENTO DE NUEVE (9) CENTROS DE EMPREDIMIENTO Y FORTALECIMIENTO EMPRESARIAL EN EL DEPARTAMENTO DE CUNDINAMARCA ","COMERCIO, INDUSTRIA Y TURISMO ",1752501814,"PARA CIERRE",42369,{"$f":"VLOOKUP(Tabla22[[#This Row],[BPIN ]],[1]Base1!F$3:Z$223,21,0)","v":42369},45224,{"$f":"Tabla22[[#This Row],[FECHA ]]-Tabla22[[#This Row],[HOY]]","v":-2855},{"$f":"Tabla22[[#This Row],[FECHA ]]-Tabla22[[#This Row],[FECHA DE TERMINACIÓN2]]","v":0}]
["CUNDINAMARCA","SECRETARIA DE CIENCIA, TECNOLOGIA E INNOVACIÓN","ALEXANDER RIVEROS Y YAHIR ARCINIEGAS","LUIS MANUEL GONZALEZ",2012000100010,"FORTALECIMIENTO DE LAS REGIONES COLOMBIANAS EN SUS CAPACIDADES DE CTI - CUNDINAMARCA","CTEL",8721806744,"CONTRATADO EN EJECUCIÓN",44926,{"$f":"VLOOKUP(Tabla22[[#This Row],[BPIN ]],[1]Base1!F$3:Z$223,21,0)","v":44926},45224,{"$f":"Tabla22[[#This Row],[FECHA ]]-Tabla22[[#This Row],[HOY]]","v":-298},{"$f":"Tabla22[[#This Row],[FECHA ]]-Tabla22[[#This Row],[FECHA DE TERMINACIÓN2]]","v":0}]
["CUNDINAMARCA","SECRETARIA DE CIENCIA, TECNOLOGIA E INNOVACIÓN","ALEXANDER RIVEROS Y YAHIR ARCINIEGAS","LUIS MANUEL GONZALEZ",2012000100144,"INVESTIGACIÓN INVESTIGACION, DESARROLLO Y TRANSFERENCIA TECNOLOGICA EN EL SECTOR AGROPECUARIO Y AGROINDUSTRIAL CON EL FIN DE MEJORAR L TODO EL DEPARTAMENTO, CUNDINAMARCA, CENTRO ORIENTE","CTEL",50514736439,"CONTRATADO EN EJECUCIÓN",45716,{"$f":"VLOOKUP(Tabla22[[#This Row],[BPIN ]],[1]Base1!F$3:Z$223,21,0)","v":45716},45224,{"$f":"Tabla22[[#This Row],[FECHA ]]-Tabla22[[#This Row],[HOY]]","v":492},{"$f":"Tabla22[[#This Row],[FECHA ]]-Tabla22[[#This Row],[FECHA DE TERMINACIÓN2]]","v":0}]
["CUNDINAMARCA","SECRETARIA DE MINAS, ENERGIA Y GAS","DIEGO TORRES","ALVARO CHACON",2013000050026,"CONSTRUCCIÓN REDES ELECTRICAS EN LA ZONA RURAL DE LOS MUNICIPIOS DE PARATEBUENO Y GUTIERREZ EN EL DEPARTAMENTO DE CUNDINAMARCA","MINAS Y ENERGÍA",1068319227,"TERMINADO",42369,{"$f":"VLOOKUP(Tabla22[[#This Row],[BPIN ]],[1]Base1!F$3:Z$223,21,0)","v":42369},45224,{"$f":"Tabla22[[#This Row],[FECHA ]]-Tabla22[[#This Row],[HOY]]","v":-2855},{"$f":"Tabla22[[#This Row],[FECHA ]]-Tabla22[[#This Row],[FECHA DE TERMINACIÓN2]]","v":0}]
["ENTIDAD APORTANTE RECURSOS","BANCO AGRARIO DE COLOMBIA","DIEGO TORRES / JEIMY FORERO",null,2013000050044,"CONSTRUCCIÓN CUNDINAMARCA VISR 2013 TODO EL DEPARTAMENTO, CUNDINAMARCA, CENTRO ORIENTE","AGRICULTURA ",60041780218,"CONTRATADO EN EJECUCIÓN",45260,{"$f":"VLOOKUP(Tabla22[[#This Row],[BPIN ]],[1]Base1!F$3:Z$223,21,0)","v":45260},45224,{"$f":"Tabla22[[#This Row],[FECHA ]]-Tabla22[[#This Row],[HOY]]","v":36},{"$f":"Tabla22[[#This Row],[FECHA ]]-Tabla22[[#This Row],[FECHA DE TERMINACIÓN2]]","v":0}]
["CUNDINAMARCA","SECRETARIA DE CIENCIA, TECNOLOGIA E INNOVACIÓN","ALEXANDER RIVEROS Y YAHIR ARCINIEGAS","LUIS MANUEL GONZALEZ",2013000100129,"INCREMENTO EN LAS ESTRATEGIAS SUSTENTABLES EN EL USO DEL RECURSO DE ENERGA ELECTRICA PARA LA POBLACION VULNERABLE EN EL DPTO. DE CUNDINAMARCA","CTEL",5170002961,"CONTRATADO EN EJECUCIÓN",44865,{"$f":"VLOOKUP(Tabla22[[#This Row],[BPIN ]],[1]Base1!F$3:Z$223,21,0)","v":44865},45224,{"$f":"Tabla22[[#This Row],[FECHA ]]-Tabla22[[#This Row],[HOY]]","v":-359},{"$f":"Tabla22[[#This Row],[FECHA ]]-Tabla22[[#This Row],[FECHA DE TERMINACIÓN2]]","v":0}]
["CUNDINAMARCA","SECRETARIA DE CIENCIA, TECNOLOGIA E INNOVACIÓN","ALEXANDER RIVEROS Y YAHIR ARCINIEGAS","LUIS MANUEL GONZALEZ",2013000100176,"INNOVACIÓN SISTEMA DE PRODUCCION DE FRUTAS/HORTALIZAS FRESCAS/PROCESADAS TIPO EXPORTACION CON TECNOLOGIA BIOLOGICA /INTEGRAL INOCUA SUBACHOQUE, CUNDINAMARCA, CENTRO ORIENTE","CTEL",9285096292,"CONTRATADO EN EJECUCIÓN",44377,{"$f":"VLOOKUP(Tabla22[[#This Row],[BPIN ]],[1]Base1!F$3:Z$223,21,0)","v":44377},45224,{"$f":"Tabla22[[#This Row],[FECHA ]]-Tabla22[[#This Row],[HOY]]","v":-847},{"$f":"Tabla22[[#This Row],[FECHA ]]-Tabla22[[#This Row],[FECHA DE TERMINACIÓN2]]","v":0}]
["CUNDINAMARCA","SECRETARIA DE CIENCIA, TECNOLOGIA E INNOVACIÓN","ALEXANDER RIVEROS Y YAHIR ARCINIEGAS","LUIS MANUEL GONZALEZ",2013000100248,"INNOVACIÓN , CIENCIA Y TECNOLOGIA PARA PRODUCTORES DE LECHE EN LA PROVINCIA DE UBATE, CUNDINAMARCA.","CTEL",11619725567,"CONTRATADO EN EJECUCIÓN",43496,{"$f":"VLOOKUP(Tabla22[[#This Row],[BPIN ]],[1]Base1!F$3:Z$223,21,0)","v":"31/01/2019\n\n"},45224,{"$f":"Tabla22[[#This Row],[FECHA ]]-Tabla22[[#This Row],[HOY]]","v":-1728},{"$f":"Tabla22[[#This Row],[FECHA ]]-Tabla22[[#This Row],[FECHA DE TERMINACIÓN2]]","v":{"$error":"#VALUE!"}}]
["CUNDINAMARCA","SECRETARIA DE GOBIERNO","DAYANA FERNANDEZ ","EDUARDO ",2014000050010,"CONSTRUCCIÓN DE UN CENTRO DE ATENCION ESPECIALIZADA AL SERVICIO DE ADOLESCENTES INFRACTORES DE LA LEY PENAL EN EL DEPARTAMENTO DE CUNDINAMARCA","JUSTICIA Y DEL DERECHO ",9260000000,"PARA CIERRE",43190,{"$f":"VLOOKUP(Tabla22[[#This Row],[BPIN ]],[1]Base1!F$3:Z$223,21,0)","v":43190},45224,{"$f":"Tabla22[[#This Row],[FECHA ]]-Tabla22[[#This Row],[HOY]]","v":-2034},{"$f":"Tabla22[[#This Row],[FECHA ]]-Tabla22[[#This Row],[FECHA DE TERMINACIÓN2]]","v":0}]
["CUNDINAMARCA","SECRETARIA DE HABITAT Y VIVIENDA","ALEXANDER RIVEROS/JEIMY FORERO","BEATRIZ GAMEZ",2016000050052,"CONSTRUCCIÓN DE VIVIENDAS NUEVAS RURALES EN EL DEPARTAMENTO DE CUNDINAMARCA","AGRICULTURA ",5983779025,"CONTRATADO EN EJECUCIÓN",44561,{"$f":"VLOOKUP(Tabla22[[#This Row],[BPIN ]],[1]Base1!F$3:Z$223,21,0)","v":44561},{"$f":"+TODAY()","v":45224},{"$f":"Tabla22[[#This Row],[FECHA ]]-Tabla22[[#This Row],[HOY]]","v":-663},{"$f":"Tabla22[[#This Row],[FECHA ]]-Tabla22[[#This Row],[FECHA DE TERMINACIÓN2]]","v":0}]
["CUNDINAMARCA","SECRETARIA DE CIENCIA, TECNOLOGIA E INNOVACIÓN","ALEXANDER RIVEROS Y YAHIR ARCINIEGAS","LUIS MANUEL GONZALEZ",2016000100027,"ANLISIS DE FACTORES GENETICOS, SANITARIOS Y MEDIOAMBIENTALES QUE AFECTAN LAS TASAS DE PREÑEZ A PARTIR DE EMBRIONES IN VITRO EN EL DEPARTAMENTO DE CUNDINAMARCA","CTEL",6401358633,"CONTRATADO EN EJECUCIÓN",44742,{"$f":"VLOOKUP(Tabla22[[#This Row],[BPIN ]],[1]Base1!F$3:Z$223,21,0)","v":44742},45224,{"$f":"Tabla22[[#This Row],[FECHA ]]-Tabla22[[#This Row],[HOY]]","v":-482},{"$f":"Tabla22[[#This Row],[FECHA ]]-Tabla22[[#This Row],[FECHA DE TERMINACIÓN2]]","v":0}]
["ENTIDAD DESIGNADA PARA LA SUPERVISIÓN DEL PROYECTO O PARA CONTRATAR LA INTERVENTORÍA","RAPE - INTERVENTORIA SECRETARIA DE PLANEACIÓN","YAHIR ARCINIEGAS","ANGELA MARTINEZ",2016000050012,"IMPLEMENTACIÓN DE ACCIONES DE CONSERVACION Y RESTAURACION DE LOS COMPLEJOS DE PARAMO, BOSQUE ALTO-ANDINO Y SERVICIOS ECOSISTEMICOS DE LA REGION CENTRAL","AMBIENTE Y DESARROLLO SOSTENIBLE",32499987282,"CONTRATADO EN EJECUCIÓN",44530,{"$f":"VLOOKUP(Tabla22[[#This Row],[BPIN ]],[1]Base1!F$3:Z$223,21,0)","v":44530},45224,{"$f":"Tabla22[[#This Row],[FECHA ]]-Tabla22[[#This Row],[HOY]]","v":-694},{"$f":"Tabla22[[#This Row],[FECHA ]]-Tabla22[[#This Row],[FECHA DE TERMINACIÓN2]]","v":0}]
["ENTIDAD APORTANTE RECURSOS","MUNICIPIO DE ZIPAQUIRA","ALEXANDER RIVEROS","JAIRO JARA",2017000050029,"CONSERVACIÓN  Y GESTIÓN INTEGRAL DEL RECURSO HÍDRICO MEDIANTE LA ADQUISICIÓN Y RESTAURACIÓN DE PREDIOS DE INTERÉS ECOSISTÉMICO EN ELDEPARTAMENTO DE   CUNDINAMARCA","AMBIENTE Y DESARROLLO SOSTENIBLE",900000000,"CONTRATADO EN EJECUCIÓN",44865,{"$f":"VLOOKUP(Tabla22[[#This Row],[BPIN ]],[1]Base1!F$3:Z$223,21,0)","v":44865},45224,{"$f":"Tabla22[[#This Row],[FECHA ]]-Tabla22[[#This Row],[HOY]]","v":-359},{"$f":"Tabla22[[#This Row],[FECHA ]]-Tabla22[[#This Row],[FECHA DE TERMINACIÓN2]]","v":0}]
["CUNDINAMARCA","SECRETARIA DE MINAS, ENERGIA Y GAS","DIEGO TORRES / LIYUGETH ALFONSO","JAHIR HERNANDEZ",2017000050036,"IMPLEMENTACIÓN Y EXPANSIÓN DEL SERVICIO DE GAS COMBUSTIBLE POR REDES PARA VEREDAS Y CENTROS POBLADOS DEL DEPARTAMENTO DE CUNDINAMARCA","MINAS Y ENERGÍA",4751658472,"PARA CIERRE",44196,{"$f":"VLOOKUP(Tabla22[[#This Row],[BPIN ]],[1]Base1!F$3:Z$223,21,0)","v":44196},45224,{"$f":"Tabla22[[#This Row],[FECHA ]]-Tabla22[[#This Row],[HOY]]","v":-1028},{"$f":"Tabla22[[#This Row],[FECHA ]]-Tabla22[[#This Row],[FECHA DE TERMINACIÓN2]]","v":0}]
["CUNDINAMARCA","SECRETARIA DE PLANEACIÓN","YESID CASTAÑO Y JEIMY FORERO","RUSVEL NIETO",2017000050039,"MEJORAMIENTO DE VÍAS TERCIARIAS MEDIANTE EL USO DE PLACA HUELLA EN LOS MUNICIPIOS DE GUATAVITA, PACHO, SAN JUAN DE RIOSECO, SUBACHOQUE, TENA Y ZIPAQUIRÁ, DEPARTAMENTO DE CUNDINAMARCA","TRANSPORTE",6791102422,"CONTRATADO EN EJECUCIÓN",43830,{"$f":"VLOOKUP(Tabla22[[#This Row],[BPIN ]],[1]Base1!F$3:Z$223,21,0)","v":43830},45224,{"$f":"Tabla22[[#This Row],[FECHA ]]-Tabla22[[#This Row],[HOY]]","v":-1394},{"$f":"Tabla22[[#This Row],[FECHA ]]-Tabla22[[#This Row],[FECHA DE TERMINACIÓN2]]","v":0}]
["CUNDINAMARCA","SECRETARIA DE HABITAT Y VIVIENDA","ALEXANDER RIVEROS/JEIMY FORERO","BEATRIZ GAMEZ",2017000050042,"MEJORAMIENTO DE VIVIENDAS RURALES DE LA PROVINCIA DE UBATÉ - CUNDINAMARCA","AGRICULTURA ",2354318125,"TERMINADO",44561,{"$f":"VLOOKUP(Tabla22[[#This Row],[BPIN ]],[1]Base1!F$3:Z$223,21,0)","v":44561},45224,{"$f":"Tabla22[[#This Row],[FECHA ]]-Tabla22[[#This Row],[HOY]]","v":-663},{"$f":"Tabla22[[#This Row],[FECHA ]]-Tabla22[[#This Row],[FECHA DE TERMINACIÓN2]]","v":0}]
["CUNDINAMARCA","SECRETARIA DE AGRICULTURA","DIEGO TORRES/VALENTINA PORTILLO","JAVIER HERREDIA",2017000050065,"MEJORAMIENTO DE LA PRODUCTIVIDAD Y RENTABILIDAD DE LOS CAFICULTORES DEL DEPARTAMENTO DE CUNDINAMARCA","AGRICULTURA ",6523880054,"TERMINADO",44196,{"$f":"VLOOKUP(Tabla22[[#This Row],[BPIN ]],[1]Base1!F$3:Z$223,21,0)","v":44196},45224,{"$f":"Tabla22[[#This Row],[FECHA ]]-Tabla22[[#This Row],[HOY]]","v":-1028},{"$f":"Tabla22[[#This Row],[FECHA ]]-Tabla22[[#This Row],[FECHA DE TERMINACIÓN2]]","v":0}]
["CUNDINAMARCA","SECRETARIA DE CIENCIA, TECNOLOGIA E INNOVACIÓN","ALEXANDER RIVEROS Y YAHIR ARCINIEGAS","LUIS MANUEL GONZALEZ",2017000100016,"IMPLEMENTACIÓN PROGRAMA DE INNOVACIÓN PARA LA VALIDACIÓN Y GENERACIÓN DE PRODUCTOS DERIVADOS DE LA BIODIVERSIDAD EN EL DEPARTAMENTO DE CUNDINAMARCA","CTEL",4486653319,"CONTRATADO EN EJECUCIÓN",44926,{"$f":"VLOOKUP(Tabla22[[#This Row],[BPIN ]],[1]Base1!F$3:Z$223,21,0)","v":44926},45224,{"$f":"Tabla22[[#This Row],[FECHA ]]-Tabla22[[#This Row],[HOY]]","v":-298},{"$f":"Tabla22[[#This Row],[FECHA ]]-Tabla22[[#This Row],[FECHA DE TERMINACIÓN2]]","v":0}]
["CUNDINAMARCA","SECRETARIA DE CIENCIA, TECNOLOGIA E INNOVACIÓN","ALEXANDER RIVEROS Y YAHIR ARCINIEGAS","LUIS MANUEL GONZALEZ",2017000100034,"IMPLEMENTACIÓN DE UN SISTEMA DE GESTIÓN DE INNOVACIÓN PARA LA INDUSTRIA DE CUNDINAMARCA","CTEL",3925471448,"CONTRATADO EN EJECUCIÓN",44530,{"$f":"VLOOKUP(Tabla22[[#This Row],[BPIN ]],[1]Base1!F$3:Z$223,21,0)","v":44530},45224,{"$f":"Tabla22[[#This Row],[FECHA ]]-Tabla22[[#This Row],[HOY]]","v":-694},{"$f":"Tabla22[[#This Row],[FECHA ]]-Tabla22[[#This Row],[FECHA DE TERMINACIÓN2]]","v":0}]
["CUNDINAMARCA","SECRETARIA DE CIENCIA, TECNOLOGIA E INNOVACIÓN","ALEXANDER RIVEROS Y YAHIR ARCINIEGAS","LUIS MANUEL GONZALEZ",2017000100074,"IMPLEMENTACIÓN DE ESTRATEGIAS DE FOMENTO A LA CULTURA Y SERVICIOS DE INNOVACIÓN EN LAS PROVINCIAS SABANA OCCIDENTE, SABANA CENTRAL, SOACHA Y SUMAPAZ CUNDINAMARCA","CTEL",6183633276,"TERMINADO",44592,{"$f":"VLOOKUP(Tabla22[[#This Row],[BPIN ]],[1]Base1!F$3:Z$223,21,0)","v":44592},45224,{"$f":"Tabla22[[#This Row],[FECHA ]]-Tabla22[[#This Row],[HOY]]","v":-632},{"$f":"Tabla22[[#This Row],[FECHA ]]-Tabla22[[#This Row],[FECHA DE TERMINACIÓN2]]","v":0}]
["CUNDINAMARCA","SECRETARIA DE CIENCIA, TECNOLOGIA E INNOVACIÓN","ALEXANDER RIVEROS Y YAHIR ARCINIEGAS","LUIS MANUEL GONZALEZ",2017000100076,"FORTALECIMIENTO DE CAPACIDADES DE GESTIÓN DEL RIESGO A TRAVÉS DE APROPIACIÓN SOCIAL DE LA CIENCIA, LA TECNOLOGÍA Y LA INNOVACIÓN EN EL DEPARTAMENTO DE CUNDINAMARCA","CTEL",4404970720,"CONTRATADO EN EJECUCIÓN",44895,{"$f":"VLOOKUP(Tabla22[[#This Row],[BPIN ]],[1]Base1!F$3:Z$223,21,0)","v":44895},45224,{"$f":"Tabla22[[#This Row],[FECHA ]]-Tabla22[[#This Row],[HOY]]","v":-329},{"$f":"Tabla22[[#This Row],[FECHA ]]-Tabla22[[#This Row],[FECHA DE TERMINACIÓN2]]","v":0}]
["CUNDINAMARCA","SECRETARIA DE CIENCIA, TECNOLOGIA E INNOVACIÓN","ALEXANDER RIVEROS Y YAHIR ARCINIEGAS","LUIS MANUEL GONZALEZ",2017000100087,"FORMACIÓN DE TALENTO HUMANO DE ALTO NIVEL EN MAESTRÍAS EN EL DEPARTAMENTO DE CUNDINAMARCA","CTEL",5148022960,"CONTRATADO EN EJECUCIÓN",45747,{"$f":"VLOOKUP(Tabla22[[#This Row],[BPIN ]],[1]Base1!F$3:Z$223,21,0)","v":45747},45224,{"$f":"Tabla22[[#This Row],[FECHA ]]-Tabla22[[#This Row],[HOY]]","v":523},{"$f":"Tabla22[[#This Row],[FECHA ]]-Tabla22[[#This Row],[FECHA DE TERMINACIÓN2]]","v":0}]
["CUNDINAMARCA","SECRETARIA DE CIENCIA, TECNOLOGIA E INNOVACIÓN","ALEXANDER RIVEROS Y YAHIR ARCINIEGAS","LUIS MANUEL GONZALEZ",2017000100104,"FORTALECIMIENTO DE LA CULTURA DE LA GESTIÓN Y UTILIZACIÓN DEL CONOCIMIENTO EN CTEI EN NIÑOS, JÓVENES Y COMUNIDADES DEL DEPARTAMENTO DE CUNDINAMARCA","CTEL",9498967749,"CONTRATADO EN EJECUCIÓN",44926,{"$f":"VLOOKUP(Tabla22[[#This Row],[BPIN ]],[1]Base1!F$3:Z$223,21,0)","v":44926},45224,{"$f":"Tabla22[[#This Row],[FECHA ]]-Tabla22[[#This Row],[HOY]]","v":-298},{"$f":"Tabla22[[#This Row],[FECHA ]]-Tabla22[[#This Row],[FECHA DE TERMINACIÓN2]]","v":0}]
["CUNDINAMARCA","UNIDAD ADMINISTRATIVA DE GESTIÓN DEL RIESGO.","DIEGO TORRES/VALENTINA PORTILLO","GINNA HERRERA",20172401060022,"ESTUDIOS DETALLADOS PARA LA INCORPORACIÓN DE LA GESTIÓN DEL RIESGO PARA LOS MUNICIPIOS DE GIRARDOT, RICAURTE","AMBIENTE Y DESARROLLO SOSTENIBLE",3084907873,"CONTRATADO EN EJECUCIÓN",44773,{"$f":"VLOOKUP(Tabla22[[#This Row],[BPIN ]],[1]Base1!F$3:Z$223,21,0)","v":44773},45224,{"$f":"Tabla22[[#This Row],[FECHA ]]-Tabla22[[#This Row],[HOY]]","v":-451},{"$f":"Tabla22[[#This Row],[FECHA ]]-Tabla22[[#This Row],[FECHA DE TERMINACIÓN2]]","v":0}]
["CUNDINAMARCA","SECRETARIA DE CIENCIA, TECNOLOGIA E INNOVACIÓN","ALEXANDER RIVEROS Y YAHIR ARCINIEGAS","LUIS MANUEL GONZALEZ",20170000100012,"CONFORMACIÓN DE UNA CONVOCATORIA REGIONAL DE PROYECTOS I+D EN FOCOS PRIORIZADOS CTEI PARA EL FORTALECIMIENTO DE LOS GRUPOS DE INVESTIGACIÓN CUNDINAMARCA","CTEL",7321934035,"CONTRATADO EN EJECUCIÓN",44926,{"$f":"VLOOKUP(Tabla22[[#This Row],[BPIN ]],[1]Base1!F$3:Z$223,21,0)","v":44926},45224,{"$f":"Tabla22[[#This Row],[FECHA ]]-Tabla22[[#This Row],[HOY]]","v":-298},{"$f":"Tabla22[[#This Row],[FECHA ]]-Tabla22[[#This Row],[FECHA DE TERMINACIÓN2]]","v":0}]
["ENTIDAD APORTANTE RECURSOS","CAR","YESID CASTAÑO","CARLOS MURCIA",2017000050063,"RECUPERACIÓN HIDRÁULICA Y AMBIENTAL DEL COMPLEJO LAGUNAR  FÚQUENE","AMBIENTE Y DESARROLLO SOSTENIBLE",18000000000,"CONTRATADO EN EJECUCIÓN",45199,{"$f":"VLOOKUP(Tabla22[[#This Row],[BPIN ]],[1]Base1!F$3:Z$223,21,0)","v":45199},45224,{"$f":"Tabla22[[#This Row],[FECHA ]]-Tabla22[[#This Row],[HOY]]","v":-25},{"$f":"Tabla22[[#This Row],[FECHA ]]-Tabla22[[#This Row],[FECHA DE TERMINACIÓN2]]","v":0}]
["ENTIDAD APORTANTE RECURSOS","MUNICIPIO DE UTICA","JUAN CARLOS TORRES","CESAR SIMANCAS",2017000050087,"MEJORAMIENTO DEL SENDERO TURÍSTICO DE LA PROVINCIA DEL GUALIVÁ  – ÚTICA  CUNDINAMARCA","COMERCIO, INDUSTRIA Y TURISMO ",2347004868,"CONTRATADO EN EJECUCIÓN",44530,{"$f":"VLOOKUP(Tabla22[[#This Row],[BPIN ]],[1]Base1!F$3:Z$223,21,0)","v":44530},45224,{"$f":"Tabla22[[#This Row],[FECHA ]]-Tabla22[[#This Row],[HOY]]","v":-694},{"$f":"Tabla22[[#This Row],[FECHA ]]-Tabla22[[#This Row],[FECHA DE TERMINACIÓN2]]","v":0}]
["CUNDINAMARCA","SECRETARIA DE HABITAT Y VIVIENDA","ALEXANDER RIVEROS/JEIMY FORERO","BEATRIZ GAMEZ",2018000050039,"MEJORAMIENTO DE VIVIENDA RURAL EN LOS MUNICIPIOS DE CUCUNUBÁ, JERUSALEN, QUEBRADANEGRA Y VIOTÁ - DEPARTAMENTO DE CUNDINAMARCA","AGRICULTURA ",4024793625,"PARA CIERRE",44561,{"$f":"VLOOKUP(Tabla22[[#This Row],[BPIN ]],[1]Base1!F$3:Z$223,21,0)","v":"31/12/2021\n"},45224,{"$f":"Tabla22[[#This Row],[FECHA ]]-Tabla22[[#This Row],[HOY]]","v":-663},{"$f":"Tabla22[[#This Row],[FECHA ]]-Tabla22[[#This Row],[FECHA DE TERMINACIÓN2]]","v":{"$error":"#VALUE!"}}]
["CUNDINAMARCA","SECRETARIA DE CIENCIA, TECNOLOGIA E INNOVACIÓN","ALEXANDER RIVEROS Y YAHIR ARCINIEGAS","LUIS MANUEL GONZALEZ",2018000100106,"INNOVACIÓN EN EL MODELO DE GESTIÓN DEL MEDICAMENTO FASE III EN EL DEPARTAMENTO DE  CUNDINAMARCA","CTEL",3452890062,"NO HA MIGRADO A GESPROY",null,{"$f":"VLOOKUP(Tabla22[[#This Row],[BPIN ]],[1]Base1!F$3:Z$223,21,0)","v":0},45224,{"$f":"Tabla22[[#This Row],[FECHA ]]-Tabla22[[#This Row],[HOY]]","v":-45224},{"$f":"Tabla22[[#This Row],[FECHA ]]-Tabla22[[#This Row],[FECHA DE TERMINACIÓN2]]","v":0}]
["CUNDINAMARCA","SECRETARIA DE CIENCIA, TECNOLOGIA E INNOVACIÓN","ALEXANDER RIVEROS Y YAHIR ARCINIEGAS","LUIS MANUEL GONZALEZ",2018000100160,"FORMACIÓN DE CAPITAL HUMANO DE ALTO NIVEL PARA LA INVESTIGACIÓN, EL DESARROLLO TECNOLÓGICO Y LA INNOVACIÓN MAESTRÍAS DE INVESTIGACIÓN PARA DOCENTES DEL DEPARTAMENTO DE CUNDINAMARCA","CTEL",5217415747,"CONTRATADO EN EJECUCIÓN",47087,{"$f":"VLOOKUP(Tabla22[[#This Row],[BPIN ]],[1]Base1!F$3:Z$223,21,0)","v":"30/11/2027\n"},45224,{"$f":"Tabla22[[#This Row],[FECHA ]]-Tabla22[[#This Row],[HOY]]","v":1863},{"$f":"Tabla22[[#This Row],[FECHA ]]-Tabla22[[#This Row],[FECHA DE TERMINACIÓN2]]","v":{"$error":"#VALUE!"}}]
["ENTIDAD DESIGNADA PARA LA SUPERVISIÓN DEL PROYECTO O PARA CONTRATAR LA INTERVENTORÍA","EMPRESAS PUBLICAS DE CUNDINAMARCA -EPC","ALEXANDER RIVEROS/LIYUGETH ALFONSO","PAULA ACUÑA",20181301010555,"CONSTRUCCIÓN DE UNIDADES SANITARIAS EN EL ÁREA RURAL DEL DEPARTAMENTO DE CUNDINAMARCA","VIVIENDA, CIUDAD Y TERRITORIO ",4999900475,"CONTRATADO EN EJECUCIÓN",44712,{"$f":"VLOOKUP(Tabla22[[#This Row],[BPIN ]],[1]Base1!F$3:Z$223,21,0)","v":"31/05/2022\n"},45224,{"$f":"Tabla22[[#This Row],[FECHA ]]-Tabla22[[#This Row],[HOY]]","v":-512},{"$f":"Tabla22[[#This Row],[FECHA ]]-Tabla22[[#This Row],[FECHA DE TERMINACIÓN2]]","v":{"$error":"#VALUE!"}}]
["CUNDINAMARCA","SECRETARIA DE EDUCACIÓN","YAHIR ARCINIEGAS Y ALEXANDER RIVEROS","PABLO CAJAMARCA",2019000050020,"FORTALECIMIENTO DE LA PERMANENCIA DE LOS ESTUDIANTES PARA EL AÑO 2019 EN LOS MUNICIPIOS DEL DEPARTAMENTO DE CUNDINAMARCA","EDUCACIÓN",20536293937,"TERMINADO",43769,{"$f":"VLOOKUP(Tabla22[[#This Row],[BPIN ]],[1]Base1!F$3:Z$223,21,0)","v":"31/10/2019\n"},45224,{"$f":"Tabla22[[#This Row],[FECHA ]]-Tabla22[[#This Row],[HOY]]","v":-1455},{"$f":"Tabla22[[#This Row],[FECHA ]]-Tabla22[[#This Row],[FECHA DE TERMINACIÓN2]]","v":{"$error":"#VALUE!"}}]
["CUNDINAMARCA","SECRETARIA DE AGRICULTURA","DIEGO TORRES/VALENTINA PORTILLO","JAVIER HERREDIA",2019000050027," MEJORAMIENTO DE LA COMPETITIVIDAD  DE LA CADENA PRODUCTIVA DE CACAO EN EL DEPARTAMENTO DE CUNDINAMARCA","AGRICULTURA ",5862983962,"TERMINADO",44651,{"$f":"VLOOKUP(Tabla22[[#This Row],[BPIN ]],[1]Base1!F$3:Z$223,21,0)","v":"31/03/2022\n"},45224,{"$f":"Tabla22[[#This Row],[FECHA ]]-Tabla22[[#This Row],[HOY]]","v":-573},{"$f":"Tabla22[[#This Row],[FECHA ]]-Tabla22[[#This Row],[FECHA DE TERMINACIÓN2]]","v":{"$error":"#VALUE!"}}]
["ENTIDAD APORTANTE RECURSOS","MEDICINA LEGAL Y CIENCIAS FORENSES","ALEXANDER RIVEROS","MARTIN SEPULVEDA",2019000050025,"ESTUDIOS Y DISEÑOS PARA LA CONSTRUCCIÓN DE LA SEDE DE MEDICINA LEGAL EN EL DEPARTAMENTO DE CUNDINAMARCA","FISCALIA",904521100,"CONTRATADO EN EJECUCIÓN",44620,{"$f":"VLOOKUP(Tabla22[[#This Row],[BPIN ]],[1]Base1!F$3:Z$223,21,0)","v":"28/02/2022\n"},{"$f":"+TODAY()","v":45224},{"$f":"Tabla22[[#This Row],[FECHA ]]-Tabla22[[#This Row],[HOY]]","v":-604},{"$f":"Tabla22[[#This Row],[FECHA ]]-Tabla22[[#This Row],[FECHA DE TERMINACIÓN2]]","v":{"$error":"#VALUE!"}}]
["DECENTRALIZADOS","IDECUT","DIEGO TORRES Y YAHIR ARCINIEGAS","MARTHA VANEGAS",2019000050059,"FORTALECIMIENTO A LAS ESCUELAS MUNICIPALES DE MÚSICA, DANZA, TEATRO Y ARTES PLÁSTICAS Y VISUALES EN EL DEPARTAMENTO DE CUNDINAMARCA","CULTURA ",1972606058,"TERMINADO",44530,{"$f":"VLOOKUP(Tabla22[[#This Row],[BPIN ]],[1]Base1!F$3:Z$223,21,0)","v":44530},45224,{"$f":"Tabla22[[#This Row],[FECHA ]]-Tabla22[[#This Row],[HOY]]","v":-694},{"$f":"Tabla22[[#This Row],[FECHA ]]-Tabla22[[#This Row],[FECHA DE TERMINACIÓN2]]","v":0}]
["CUNDINAMARCA","SECRETARIA DE MINAS, ENERGIA Y GAS","DIEGO TORRES / LIYUGETH ALFONSO","JAHIR HERNANDEZ",2019000050073,"AMPLIACIÓN DE LA COBERTURA DEL SERVICIO DE GAS COMBUSTIBLE DOMICILIARIO A TRAVÉS DE LA FINANCIACIÓN DE LA CONEXIÓN Y LA RED INTERNA PARA USUARIOS DE BARRIOS PERIFÉRICOS, VEREDAS Y CENTROS POBLADOS DEL DEPARTAMENTO DE CUNDINAMARCA","MINAS Y ENERGÍA",12461377100,"CONTRATADO EN EJECUCIÓN",44530,{"$f":"VLOOKUP(Tabla22[[#This Row],[BPIN ]],[1]Base1!F$3:Z$223,21,0)","v":"30/11/2021\n"},45224,{"$f":"Tabla22[[#This Row],[FECHA ]]-Tabla22[[#This Row],[HOY]]","v":-694},{"$f":"Tabla22[[#This Row],[FECHA ]]-Tabla22[[#This Row],[FECHA DE TERMINACIÓN2]]","v":{"$error":"#VALUE!"}}]
["ENTIDAD APORTANTE RECURSOS","UNAD","ALEXANDER RIVEROS","ANDRES ACOSTA",2019000050069,"MEJORAMIENTO DE INFRAESTRUCTURA FÍSICA, DOTACIÓN DE MOBILIARIO Y EQUIPAMIENTO TECNOLÓGICO DE LA UNIVERSIDAD NACIONAL ABIERTA Y A DISTANCIA EN MUNICIPIOS DEL DEPARTAMENTO DE CUNDINAMARCA","EDUCACIÓN",16011115461,"TERMINADO",44165,{"$f":"VLOOKUP(Tabla22[[#This Row],[BPIN ]],[1]Base1!F$3:Z$223,21,0)","v":"30/11/2020\n"},45224,{"$f":"Tabla22[[#This Row],[FECHA ]]-Tabla22[[#This Row],[HOY]]","v":-1059},{"$f":"Tabla22[[#This Row],[FECHA ]]-Tabla22[[#This Row],[FECHA DE TERMINACIÓN2]]","v":{"$error":"#VALUE!"}}]
["ENTIDAD APORTANTE RECURSOS","U TECNOLOGICA DE PEREIRA","YAHIR ARCINIEGAS","LUIS MANUEL GONZALEZ",2019000100009,"FORMACIÓN DE CAPITAL HUMANO DE ALTO NIVEL UNIVERSIDAD TECNOLÓGICA DE PEREIRA  NACIONAL","CTEL",4360028215,"CONTRATADO EN EJECUCIÓN",46784,{"$f":"VLOOKUP(Tabla22[[#This Row],[BPIN ]],[1]Base1!F$3:Z$223,21,0)","v":"10/02/2028\n"},45224,{"$f":"Tabla22[[#This Row],[FECHA ]]-Tabla22[[#This Row],[HOY]]","v":1560},{"$f":"Tabla22[[#This Row],[FECHA ]]-Tabla22[[#This Row],[FECHA DE TERMINACIÓN2]]","v":{"$error":"#VALUE!"}}]
["ENTIDAD APORTANTE RECURSOS","U EAN","YAHIR ARCINIEGAS","LUIS MANUEL GONZALEZ",2019000100015,"FORMACIÓN DE CAPITAL HUMANO DE ALTO NIVEL - UNIVERSIDAD EAN -  NACIONAL","CTEL",1294375000,"CONTRATADO EN EJECUCIÓN",46964,{"$f":"VLOOKUP(Tabla22[[#This Row],[BPIN ]],[1]Base1!F$3:Z$223,21,0)","v":"30/07/2028\n"},45224,{"$f":"Tabla22[[#This Row],[FECHA ]]-Tabla22[[#This Row],[HOY]]","v":1740},{"$f":"Tabla22[[#This Row],[FECHA ]]-Tabla22[[#This Row],[FECHA DE TERMINACIÓN2]]","v":{"$error":"#VALUE!"}}]
["ENTIDAD APORTANTE RECURSOS","U CATOLICA","YAHIR ARCINIEGAS","LUIS MANUEL GONZALEZ",2019000100022,"FORMACIÓN DE CAPITAL HUMANO DE ALTO NIVEL - UNIVERSIDAD CATÓLICA DE COLOMBIA -  NACIONAL","CTEL",343595000,"CONTRATADO EN EJECUCIÓN",46904,{"$f":"VLOOKUP(Tabla22[[#This Row],[BPIN ]],[1]Base1!F$3:Z$223,21,0)","v":"31/05/2028\n"},45224,{"$f":"Tabla22[[#This Row],[FECHA ]]-Tabla22[[#This Row],[HOY]]","v":1680},{"$f":"Tabla22[[#This Row],[FECHA ]]-Tabla22[[#This Row],[FECHA DE TERMINACIÓN2]]","v":{"$error":"#VALUE!"}}]
["ENTIDAD APORTANTE RECURSOS","UNIVERSIDAD MILITAR NUEVA GRANADA","YAHIR ARCINIEGAS","LUIS MANUEL GONZALEZ",2019000100025,"FORMACIÓN DE CAPITAL HUMANO DE ALTO NIVEL UNIVERSIDAD MILITAR NUEVA GRANADA  NACIONAL","CTEL",294375000,"CONTRATADO EN EJECUCIÓN",46752,{"$f":"VLOOKUP(Tabla22[[#This Row],[BPIN ]],[1]Base1!F$3:Z$223,21,0)","v":"31/12/2027\n"},45224,{"$f":"Tabla22[[#This Row],[FECHA ]]-Tabla22[[#This Row],[HOY]]","v":1528},{"$f":"Tabla22[[#This Row],[FECHA ]]-Tabla22[[#This Row],[FECHA DE TERMINACIÓN2]]","v":{"$error":"#VALUE!"}}]
["ENTIDAD APORTANTE RECURSOS","UNIVERSIDAD NACIONAL DE COLOMBIA","YAHIR ARCINIEGAS","LUIS MANUEL GONZALEZ",2019000100026,"FORMACIÓN DE CAPITAL HUMANO DE ALTO NIVEL UNIVERSIDAD NACIONAL DE COLOMBIA   NACIONAL","CTEL",21162064500,"CONTRATADO EN EJECUCIÓN",46904,{"$f":"VLOOKUP(Tabla22[[#This Row],[BPIN ]],[1]Base1!F$3:Z$223,21,0)","v":"31/05/2028\n"},45224,{"$f":"Tabla22[[#This Row],[FECHA ]]-Tabla22[[#This Row],[HOY]]","v":1680},{"$f":"Tabla22[[#This Row],[FECHA ]]-Tabla22[[#This Row],[FECHA DE TERMINACIÓN2]]","v":{"$error":"#VALUE!"}}]
["ENTIDAD APORTANTE RECURSOS","U DISTRITAL","YAHIR ARCINIEGAS","LUIS MANUEL GONZALEZ",2019000100027,"FORMACIÓN DE CAPITAL HUMANO DE ALTO NIVEL EN DOCTORADO PARA EL DESARROLLO REGIONAL, UNIVERSIDAD DISTRITAL FRANCISCO JOSÉ DE CALDAS, A NIVEL  NACIONAL","CTEL",1218668841,"CONTRATADO EN EJECUCIÓN",46899,{"$f":"VLOOKUP(Tabla22[[#This Row],[BPIN ]],[1]Base1!F$3:Z$223,21,0)","v":"26/05/2028\n"},45224,{"$f":"Tabla22[[#This Row],[FECHA ]]-Tabla22[[#This Row],[HOY]]","v":1675},{"$f":"Tabla22[[#This Row],[FECHA ]]-Tabla22[[#This Row],[FECHA DE TERMINACIÓN2]]","v":{"$error":"#VALUE!"}}]
["ENTIDAD APORTANTE RECURSOS","U JAVERIANA","YAHIR ARCINIEGAS","LUIS MANUEL GONZALEZ",2019000100028,"FORMACIÓN DE CAPITAL HUMANO DE ALTO NIVEL PONTIFICIA UNIVERSIDAD JAVERIANA SEDE CENTRAL  NACIONAL","CTEL",6524500000,"CONTRATADO EN EJECUCIÓN",46921,{"$f":"VLOOKUP(Tabla22[[#This Row],[BPIN ]],[1]Base1!F$3:Z$223,21,0)","v":"17/06/2028\n"},45224,{"$f":"Tabla22[[#This Row],[FECHA ]]-Tabla22[[#This Row],[HOY]]","v":1697},{"$f":"Tabla22[[#This Row],[FECHA ]]-Tabla22[[#This Row],[FECHA DE TERMINACIÓN2]]","v":{"$error":"#VALUE!"}}]
["ENTIDAD APORTANTE RECURSOS","U DE LOS ANDES","YAHIR ARCINIEGAS","LUIS MANUEL GONZALEZ",2019000100036,"FORMACIÓN  DE CAPITAL HUMANO DE ALTO NIVEL UNIVERSIDAD DE LOS ANDES   NACIONAL","CTEL",2814671307,"CONTRATADO EN EJECUCIÓN",46828,{"$f":"VLOOKUP(Tabla22[[#This Row],[BPIN ]],[1]Base1!F$3:Z$223,21,0)","v":"16/03/2028\n"},45224,{"$f":"Tabla22[[#This Row],[FECHA ]]-Tabla22[[#This Row],[HOY]]","v":1604},{"$f":"Tabla22[[#This Row],[FECHA ]]-Tabla22[[#This Row],[FECHA DE TERMINACIÓN2]]","v":{"$error":"#VALUE!"}}]
["ENTIDAD APORTANTE RECURSOS","UNIVERSIDAD NACIONAL DE COLOMBIA","YAHIR ARCINIEGAS","LUIS MANUEL GONZALEZ",2019000100061,"FORTALECIMIENTO DE LA CAPACIDAD TECNOLÓGICA INSTALADA EN EL CENTRO AGROPECUARIO MARENGO PARA LA INVESTIGACIÓN EN LOS SISTEMAS AGROPRODUCTIVOS DEL TRÓPICO ALTO, BAJO EL EFECTO DE LA VARIABILIDAD Y CAMBIO CLIMÁTICO -  CUNDINAMARCA","CTEL",2386591598.0999999,"CONTRATADO EN EJECUCIÓN",44739,{"$f":"VLOOKUP(Tabla22[[#This Row],[BPIN ]],[1]Base1!F$3:Z$223,21,0)","v":"27/06/2022\n"},45224,{"$f":"Tabla22[[#This Row],[FECHA ]]-Tabla22[[#This Row],[HOY]]","v":-485},{"$f":"Tabla22[[#This Row],[FECHA ]]-Tabla22[[#This Row],[FECHA DE TERMINACIÓN2]]","v":{"$error":"#VALUE!"}}]
["CUNDINAMARCA","SECRETARIA DE CIENCIA, TECNOLOGIA E INNOVACIÓN","ALEXANDER RIVEROS Y YAHIR ARCINIEGAS","LUIS MANUEL GONZALEZ",2020000100137,"FORTALECIMIENTO DE LAS CAPACIDADES DE INVESTIGACIÓN Y DESARROLLO PARA ATENDER PROBLEMÁTICAS ASOCIADAS CON AGENTES BIOLÓGICOS PARA LA SALUD PÚBLICA, A TRAVÉS DEL MEJORAMIENTO DEL LABORATORIO DE SALUD PÚBLICA DE CUNDINAMARCA","CTEL",4506359274,"CONTRATADO EN EJECUCIÓN",44677,{"$f":"VLOOKUP(Tabla22[[#This Row],[BPIN ]],[1]Base1!F$3:Z$223,21,0)","v":"26/04/2022\n"},45224,{"$f":"Tabla22[[#This Row],[FECHA ]]-Tabla22[[#This Row],[HOY]]","v":-547},{"$f":"Tabla22[[#This Row],[FECHA ]]-Tabla22[[#This Row],[FECHA DE TERMINACIÓN2]]","v":{"$error":"#VALUE!"}}]
["CUNDINAMARCA","SECRETARIA DE SALUD","DAYANA FERNANDEZ/ LIYUGETH ALFONSO","OLGA LUCIA GARZON",2020000050003,"ADQUISICIÓN DE AMBULANCIAS,EQUIPOS BIOMÉDICOS, ELEMENTOS DE PROTECCIÓN PERSONAL, ASEO Y DESINFECCIÓN PARA LA ATENCIÓN DE LA CALAMIDAD SANITARIA POR COVID-19 EN LAS E.S.E DEL DEPARTAMENTO DE   CUNDINAMARCA","SALUD Y PROTECCIÓN SOCIAL",43433295564,"CONTRATADO EN EJECUCIÓN",44742,{"$f":"VLOOKUP(Tabla22[[#This Row],[BPIN ]],[1]Base1!F$3:Z$223,21,0)","v":"30/06/2022\n"},45224,{"$f":"Tabla22[[#This Row],[FECHA ]]-Tabla22[[#This Row],[HOY]]","v":-482},{"$f":"Tabla22[[#This Row],[FECHA ]]-Tabla22[[#This Row],[FECHA DE TERMINACIÓN2]]","v":{"$error":"#VALUE!"}}]
["CUNDINAMARCA","SECRETARIA DE EDUCACIÓN","YAHIR ARCINIEGAS Y ALEXANDER RIVEROS","GENNY PADILLA",2020000050019,"FORTALECIMIENTO A LA ESTRATEGIA DE ALIMENTACIÓN ESCOLAR PARA EL AÑO 2020, EN LOS MUNICIPIOS DEL DEPARTAMENTO DE CUNDINAMARCA ","EDUCACIÓN",26240955000,"PARA CIERRE",44178,{"$f":"VLOOKUP(Tabla22[[#This Row],[BPIN ]],[1]Base1!F$3:Z$223,21,0)","v":"13/12/2020\n"},45224,{"$f":"Tabla22[[#This Row],[FECHA ]]-Tabla22[[#This Row],[HOY]]","v":-1046},{"$f":"Tabla22[[#This Row],[FECHA ]]-Tabla22[[#This Row],[FECHA DE TERMINACIÓN2]]","v":{"$error":"#VALUE!"}}]
["CUNDINAMARCA","SECRETARIA DE CIENCIA, TECNOLOGIA E INNOVACIÓN","ALEXANDER RIVEROS Y YAHIR ARCINIEGAS","LUIS MANUEL GONZALEZ",2020000100266,"GENERACIÓN DE ESPACIOS DE ENCUENTRO DE LA SOCIEDAD CON LA CIENCIA Y LA TECNOLOGÍA - UN VIAJE CON LA CIENCIA EN EL DEPARTAMENTO DE CUNDINAMARCA","CTEL",2241429590,"CONTRATADO EN EJECUCIÓN",44929,{"$f":"VLOOKUP(Tabla22[[#This Row],[BPIN ]],[1]Base1!F$3:Z$223,21,0)","v":"03/01/2023\n"},45224,{"$f":"Tabla22[[#This Row],[FECHA ]]-Tabla22[[#This Row],[HOY]]","v":-295},{"$f":"Tabla22[[#This Row],[FECHA ]]-Tabla22[[#This Row],[FECHA DE TERMINACIÓN2]]","v":{"$error":"#VALUE!"}}]
["CUNDINAMARCA","SECRETARIA DE CIENCIA, TECNOLOGIA E INNOVACIÓN","ALEXANDER RIVEROS Y YAHIR ARCINIEGAS","LUIS MANUEL GONZALEZ",2020000100246,"FORTALECIMIENTO DE LA COMPETITIVIDAD DE LA CADENA PRODUCTIVA DE LA GUADUA POR MEDIO DEL DESARROLLO E IMPLEMENTACIÓN DE DOS (2) PAQUETES TECNOLÓGICOS PARA LA GENERACIÓN DE PRODUCTOS CON VALOR AGREGADO EN EL DEPARTAMENTO DE CUNDINAMARCA ","CTEL",3144525520,"CONTRATADO EN EJECUCIÓN",45120,{"$f":"VLOOKUP(Tabla22[[#This Row],[BPIN ]],[1]Base1!F$3:Z$223,21,0)","v":"13/07/2023\n"},45224,{"$f":"Tabla22[[#This Row],[FECHA ]]-Tabla22[[#This Row],[HOY]]","v":-104},{"$f":"Tabla22[[#This Row],[FECHA ]]-Tabla22[[#This Row],[FECHA DE TERMINACIÓN2]]","v":{"$error":"#VALUE!"}}]
["ENTIDAD APORTANTE RECURSOS","CONNECT BOGOTA REGIÓN","YAHIR ARCINIEGAS","LUIS MANUEL GONZALEZ",2020000100078,"DISEÑO E IMPLEMENTACIÓN DE UN MODELO DE GESTIÓN DE CONOCIMIENTO, INNOVACIÓN Y TRANSFERENCIA DE TECNOLOGÍA CON APLICACIÓN EN EL SECTOR AGROPECUARIO Y AGROINDUSTRIAL EN EL DEPARTAMENTO DE CUNDINAMARCA ","CTEL",3309848753,"CONTRATADO EN EJECUCIÓN",45473,{"$f":"VLOOKUP(Tabla22[[#This Row],[BPIN ]],[1]Base1!F$3:Z$223,21,0)","v":"30/06/2024\n"},45224,{"$f":"Tabla22[[#This Row],[FECHA ]]-Tabla22[[#This Row],[HOY]]","v":249},{"$f":"Tabla22[[#This Row],[FECHA ]]-Tabla22[[#This Row],[FECHA DE TERMINACIÓN2]]","v":{"$error":"#VALUE!"}}]
["ENTIDAD APORTANTE RECURSOS","FEDERACIÓN NACIONAL DE CAFETEROS","YAHIR ARCINIEGAS","LUIS MANUEL GONZALEZ",2020000100205,"TRASLADO DE TECNOLOGÍAS INNOVADORAS A CAFICULTORES CON IMPACTO SOBRE LA CALIDAD DEL CAFÉ Y LA GESTIÓN DEL RECURSO HÍDRICO DURANTE EL PROCESO DE BENEFICIO EN ZONA CAFETERA DEL DEPARTAMENTO DE CUNDINAMARCA ","CTEL",13783557324,"CONTRATADO EN EJECUCIÓN",45629,{"$f":"VLOOKUP(Tabla22[[#This Row],[BPIN ]],[1]Base1!F$3:Z$223,21,0)","v":"03/12/2024\n"},45224,{"$f":"Tabla22[[#This Row],[FECHA ]]-Tabla22[[#This Row],[HOY]]","v":405},{"$f":"Tabla22[[#This Row],[FECHA ]]-Tabla22[[#This Row],[FECHA DE TERMINACIÓN2]]","v":{"$error":"#VALUE!"}}]
["ENTIDAD APORTANTE RECURSOS","AGROSAVIA","YAHIR ARCINIEGAS","LUIS MANUEL GONZALEZ",2020000100197,"DESARROLLO DE BIOPLAGUICIDAS POTENCIADOS DE NUEVA GENERACIÓN PARA EL MEJORAMIENTO DE LA PRODUCTIVIDAD E INOCUIDAD DEL CULTIVO DE TOMATE Y CRUCÍFERAS EN EL DEPARTAMENTO DE CUNDINAMARCA ","CTEL",4583970033,"CONTRATADO EN EJECUCIÓN",46112,{"$f":"VLOOKUP(Tabla22[[#This Row],[BPIN ]],[1]Base1!F$3:Z$223,21,0)","v":"31/03/2026\n"},45224,{"$f":"Tabla22[[#This Row],[FECHA ]]-Tabla22[[#This Row],[HOY]]","v":888},{"$f":"Tabla22[[#This Row],[FECHA ]]-Tabla22[[#This Row],[FECHA DE TERMINACIÓN2]]","v":{"$error":"#VALUE!"}}]
["ENTIDAD APORTANTE RECURSOS","UNIVERSIDAD NACIONAL DE COLOMBIA","YAHIR ARCINIEGAS","LUIS MANUEL GONZALEZ",2020000100240,"ESTUDIO DE PREFACTIBILIDAD PARA LA CREACIÓN DE UN CENTRO DE INNOVACIÓN Y DE PRODUCTIVIDAD PARA EL SECTOR AGROPECUARIO DE SABANA OCCIDENTE DE CUNDINAMARCA ","CTEL",1896154229,"CONTRATADO EN EJECUCIÓN",44926,{"$f":"VLOOKUP(Tabla22[[#This Row],[BPIN ]],[1]Base1!F$3:Z$223,21,0)","v":"31/12/2022\n"},45224,{"$f":"Tabla22[[#This Row],[FECHA ]]-Tabla22[[#This Row],[HOY]]","v":-298},{"$f":"Tabla22[[#This Row],[FECHA ]]-Tabla22[[#This Row],[FECHA DE TERMINACIÓN2]]","v":{"$error":"#VALUE!"}}]
["ENTIDAD APORTANTE RECURSOS","UNIVERSIDAD DE CUNDINAMARCA","YAHIR ARCINIEGAS","LUIS MANUEL GONZALEZ",2020000100158,"FORTALECIMIENTO DE LA INFRAESTRUCTURA FÍSICA Y TECNOLÓGICA DEL CENTRO DE ESTUDIOS AGROAMBIENTALES DE LA UNIVERSIDAD DE CUNDINAMARCA AGROU CUNDINAMARCA ","CTEL",2024433669,"SIN CONTRATAR",null,{"$f":"VLOOKUP(Tabla22[[#This Row],[BPIN ]],[1]Base1!F$3:Z$223,21,0)","v":45489},45224,{"$f":"Tabla22[[#This Row],[FECHA ]]-Tabla22[[#This Row],[HOY]]","v":-45224},{"$f":"Tabla22[[#This Row],[FECHA ]]-Tabla22[[#This Row],[FECHA DE TERMINACIÓN2]]","v":-45489}]
["ENTIDAD APORTANTE RECURSOS","ZIPAQUIRA","YESID CASTAÑO / JEIMY FORERO",null,2020000050013,"Mejoramiento de la vía que comunica a los municipios de Zipaquirá y Tocancipá, tramo barandillas - la fuente, departamento de Cundinamarca","TRANSPORTE","6.788.620.869,00","CONTRATADO EN EJECUCIÓN",44709,{"$f":"VLOOKUP(Tabla22[[#This Row],[BPIN ]],[1]Base1!F$3:Z$223,21,0)","v":"28/05/2022\n"},45224,{"$f":"Tabla22[[#This Row],[FECHA ]]-Tabla22[[#This Row],[HOY]]","v":-515},{"$f":"Tabla22[[#This Row],[FECHA ]]-Tabla22[[#This Row],[FECHA DE TERMINACIÓN2]]","v":{"$error":"#VALUE!"}}]
["ENTIDAD APORTANTE RECURSOS","ZIPAQUIRA","YESID CASTAÑO / JEIMY FORERO",null,2020000050015,"MEJORAMIENTO DE LA VÍA ZIPAQUIRÁ - SAN JORGE - TABIO DEPARTAMENTO DE CUNDINAMARCA","TRANSPORTE",7458735075,"CONTRATADO EN EJECUCIÓN",44920,{"$f":"VLOOKUP(Tabla22[[#This Row],[BPIN ]],[1]Base1!F$3:Z$223,21,0)","v":"25/12/2022\n"},45224,{"$f":"Tabla22[[#This Row],[FECHA ]]-Tabla22[[#This Row],[HOY]]","v":-304},{"$f":"Tabla22[[#This Row],[FECHA ]]-Tabla22[[#This Row],[FECHA DE TERMINACIÓN2]]","v":{"$error":"#VALUE!"}}]
["CUNDINAMARCA","SECRETARIA DE CIENCIA, TECNOLOGIA E INNOVACIÓN","ALEXANDER RIVEROS Y YAHIR ARCINIEGAS","LUIS MANUEL GONZALEZ",2020000100695,"DESARROLLO, TRANSFERENCIA DE TECNOLOGÍA Y CONOCIMIENTO PARA LA INNOVACIÓN QUE FORTALEZCAN CAPACIDADES COMUNITARIAS EN LA COMPRENSIÓN Y/O MITIGACIÓN DE LOS PROBLEMAS DE VIOLENCIAS BASADAS EN GÉNERO, DERIVADAS DE LA EMERGENCIA POR COVID 19, EN CUNDINAMARCA","CTEL",3100000000,"CONTRATADO EN EJECUCIÓN",45000,{"$f":"VLOOKUP(Tabla22[[#This Row],[BPIN ]],[1]Base1!F$3:Z$223,21,0)","v":"15/03/2023\n"},45224,{"$f":"Tabla22[[#This Row],[FECHA ]]-Tabla22[[#This Row],[HOY]]","v":-224},{"$f":"Tabla22[[#This Row],[FECHA ]]-Tabla22[[#This Row],[FECHA DE TERMINACIÓN2]]","v":{"$error":"#VALUE!"}}]
["CUNDINAMARCA","SECRETARIA DE CIENCIA, TECNOLOGIA E INNOVACIÓN","ALEXANDER RIVEROS Y YAHIR ARCINIEGAS","LUIS MANUEL GONZALEZ",2020000100650,"FORTALECIMIENTO DE CAPACIDADES DE CTEI PARALA INNOVACION EDUCATIVA EN LOS NIVELES DE BÁSICA Y\nMEDIA, MEDIANTE USO DE TICS EN INSTITUCIONES EDUCATIVAS OFICIALES DE LOS MUNICIPIOS NO\nCERTIFICADOS DEL DEPARTAMENTO DE CUNDINAMARCA","CTEL",10804663122,"CONTRATADO EN EJECUCIÓN",45217,{"$f":"VLOOKUP(Tabla22[[#This Row],[BPIN ]],[1]Base1!F$3:Z$223,21,0)","v":"18/10/2023\n"},45224,{"$f":"Tabla22[[#This Row],[FECHA ]]-Tabla22[[#This Row],[HOY]]","v":-7},{"$f":"Tabla22[[#This Row],[FECHA ]]-Tabla22[[#This Row],[FECHA DE TERMINACIÓN2]]","v":{"$error":"#VALUE!"}}]
["CUNDINAMARCA","SECRETARIA DE CIENCIA, TECNOLOGIA E INNOVACIÓN","ALEXANDER RIVEROS Y YAHIR ARCINIEGAS","LUIS MANUEL GONZALEZ",2020000100696,"FORTALECIMIENTO DE CAPACIDADES DE CTEI PARA LA REACTIVACIÓN ECONÓMICA Y LA TRANSFORMACIÓN\nPRODUCTIVA EN CUNDINAMARCA","CTEL",7370634083,"CONTRATADO EN EJECUCIÓN",45204,{"$f":"VLOOKUP(Tabla22[[#This Row],[BPIN ]],[1]Base1!F$3:Z$223,21,0)","v":"05/10/2023\n"},45224,{"$f":"Tabla22[[#This Row],[FECHA ]]-Tabla22[[#This Row],[HOY]]","v":-20},{"$f":"Tabla22[[#This Row],[FECHA ]]-Tabla22[[#This Row],[FECHA DE TERMINACIÓN2]]","v":{"$error":"#VALUE!"}}]
["CUNDINAMARCA","SECRETARIA DE CIENCIA, TECNOLOGIA E INNOVACIÓN","ALEXANDER RIVEROS Y YAHIR ARCINIEGAS","LUIS MANUEL GONZALEZ",2020000100649,"FORTALECIMIENTO DE CAPACIDADES DE CTeI PARA EL RELACIONAMIENTO ESCUELA - CONTEXTO RURAL MEDIANTE LA APROPIACIÓN Y USO DE LAS TIC EN EL MUNICIPIO DE SIBATÉ, DEPARTAMENTO DE CUNDINAMARCA","CTEL",4292464018,"CONTRATADO EN EJECUCIÓN",45245,{"$f":"VLOOKUP(Tabla22[[#This Row],[BPIN ]],[1]Base1!F$3:Z$223,21,0)","v":"15/11/2023\n"},45224,{"$f":"Tabla22[[#This Row],[FECHA ]]-Tabla22[[#This Row],[HOY]]","v":21},{"$f":"Tabla22[[#This Row],[FECHA ]]-Tabla22[[#This Row],[FECHA DE TERMINACIÓN2]]","v":{"$error":"#VALUE!"}}]
["ENTIDAD APORTANTE RECURSOS","FUNDACION UNIVERSIDAD DEL VALLE","YAHIR ARCINIEGAS","JOSE MARIA LEITON",2020000050044,"FORTALECIMIENTO DE LAS COMPETENCIAS COMUNICATIVAS EN INGLÉS DE LOS ESTUDIANTES DE LOS ESTABLECIMIENTOS EDUCATIVOS NO OFICIALES DE CUNDINAMARCA","EDUCACIÓN","$ 10.468.961.978","CONTRATADO EN EJECUCIÓN",45137,{"$f":"VLOOKUP(Tabla22[[#This Row],[BPIN ]],[1]Base1!F$3:Z$223,21,0)","v":"30/07/2023\n"},45224,{"$f":"Tabla22[[#This Row],[FECHA ]]-Tabla22[[#This Row],[HOY]]","v":-87},{"$f":"Tabla22[[#This Row],[FECHA ]]-Tabla22[[#This Row],[FECHA DE TERMINACIÓN2]]","v":{"$error":"#VALUE!"}}]
["ENTIDAD APORTANTE RECURSOS","UNAD","YAHIR ARCINIEGAS","LUIS MANUEL GONZALEZ",2020000100433,"Investigación de los compuestos volátiles orgánicos e inducidos para el manejo de moscas plagas en gulupa y granadilla en el departamento de  Cundinamarca","CTEL",3412874201,"CONTRATADO EN EJECUCIÓN",45514,{"$f":"VLOOKUP(Tabla22[[#This Row],[BPIN ]],[1]Base1!F$3:Z$223,21,0)","v":"10/08/2024\n"},45224,{"$f":"Tabla22[[#This Row],[FECHA ]]-Tabla22[[#This Row],[HOY]]","v":290},{"$f":"Tabla22[[#This Row],[FECHA ]]-Tabla22[[#This Row],[FECHA DE TERMINACIÓN2]]","v":{"$error":"#VALUE!"}}]
["ENTIDAD APORTANTE RECURSOS","UNIVERSIDAD INDUSTRIAL DE SANTANDER","YAHIR ARCINIEGAS","LUIS MANUEL GONZALEZ",2020000100415,"Desarrollo de un sistema óptico  computacional para estimar el contenido de carbono orgánico de suelos agrícolas a través de imágenes espectrales e inteligencia artificial en cultivos de cítricos de   Santander","CTEL",2184125885.29,"CONTRATADO EN EJECUCIÓN",45412,{"$f":"VLOOKUP(Tabla22[[#This Row],[BPIN ]],[1]Base1!F$3:Z$223,21,0)","v":45412},45224,{"$f":"Tabla22[[#This Row],[FECHA ]]-Tabla22[[#This Row],[HOY]]","v":188},{"$f":"Tabla22[[#This Row],[FECHA ]]-Tabla22[[#This Row],[FECHA DE TERMINACIÓN2]]","v":0}]
["ENTIDAD APORTANTE RECURSOS","UNIVERSIDAD INDUSTRIAL DE SANTANDER","YAHIR ARCINIEGAS","LUIS MANUEL GONZALEZ",2020000100375,"Conformación de una plataforma para estudios celulares avanzados in vivo en tiempo real para el análisis de la respuesta inmunometabólica ante la reexpresión de interferón tipo I kappa en esferoides de células tumorales de cuello uterino en  Santander","CTEL",3123997801,"CONTRATADO EN EJECUCIÓN",45416,{"$f":"VLOOKUP(Tabla22[[#This Row],[BPIN ]],[1]Base1!F$3:Z$223,21,0)","v":"04/05/2024\n"},45224,{"$f":"Tabla22[[#This Row],[FECHA ]]-Tabla22[[#This Row],[HOY]]","v":192},{"$f":"Tabla22[[#This Row],[FECHA ]]-Tabla22[[#This Row],[FECHA DE TERMINACIÓN2]]","v":{"$error":"#VALUE!"}}]
["ENTIDAD APORTANTE RECURSOS","UNIVERSIDAD INDUSTRIAL DE SANTANDER","YAHIR ARCINIEGAS","LUIS MANUEL GONZALEZ",2020000100351,"Desarrollo de un prototipo selectivo y sensible para monitorear contenido de cadmio in situ en diversas matrices asociadas a la producción de granos de cacao en el departamento de  Santander","CTEL",2585800000,"CONTRATADO EN EJECUCIÓN",44865,{"$f":"VLOOKUP(Tabla22[[#This Row],[BPIN ]],[1]Base1!F$3:Z$223,21,0)","v":"31/10/2022\n"},45224,{"$f":"Tabla22[[#This Row],[FECHA ]]-Tabla22[[#This Row],[HOY]]","v":-359},{"$f":"Tabla22[[#This Row],[FECHA ]]-Tabla22[[#This Row],[FECHA DE TERMINACIÓN2]]","v":{"$error":"#VALUE!"}}]
["ENTIDAD APORTANTE RECURSOS","INSTITUTO SUPERIOR DE EDUCACION RURAL DE PAMPLONA","YAHIR ARCINIEGAS","LUIS MANUEL GONZALEZ",2020000100343,"Implementación laboratorio de calidad fisicoquímica de alimentos para el fortalecimiento competitivo y sostenible de lascadenas agroalimentarias del departamento de  Norte de Santander","CTEL",1097306327,"CONTRATADO EN EJECUCIÓN",45427,{"$f":"VLOOKUP(Tabla22[[#This Row],[BPIN ]],[1]Base1!F$3:Z$223,21,0)","v":"15/05/2024\n"},45224,{"$f":"Tabla22[[#This Row],[FECHA ]]-Tabla22[[#This Row],[HOY]]","v":203},{"$f":"Tabla22[[#This Row],[FECHA ]]-Tabla22[[#This Row],[FECHA DE TERMINACIÓN2]]","v":{"$error":"#VALUE!"}}]
["ENTIDAD APORTANTE RECURSOS","UNIVERSIDAD NACIONAL DE COLOMBIA","YAHIR ARCINIEGAS","LUIS MANUEL GONZALEZ",2020000100342,"Estudio de potenciales insecticidas en matrices poliméricas para el control de plagas de granos almacenados basados en aceites esenciales provenientes de la biodiversidadflorística del departamento de  Cundinamarca","CTEL",2748237104,"CONTRATADO EN EJECUCIÓN",45507,{"$f":"VLOOKUP(Tabla22[[#This Row],[BPIN ]],[1]Base1!F$3:Z$223,21,0)","v":"03/08/2024\n"},45224,{"$f":"Tabla22[[#This Row],[FECHA ]]-Tabla22[[#This Row],[HOY]]","v":283},{"$f":"Tabla22[[#This Row],[FECHA ]]-Tabla22[[#This Row],[FECHA DE TERMINACIÓN2]]","v":{"$error":"#VALUE!"}}]
["ENTIDAD APORTANTE RECURSOS","UNIVERSIDAD MILITAR NUEVA GRANADA","YAHIR ARCINIEGAS","LUIS MANUEL GONZALEZ",2020000100728,"Generación y transferencia de conocimientos y tecnologías para elevar capacidades de CTel de pequeños productores de tomate para afrontar problemas derivados del COVID-19 asociadas a la Seg. Alimentaria en las Sab. Centro y Oriente  Cundinamarca","CTEL",4162541452,"CONTRATADO EN EJECUCIÓN",44966,{"$f":"VLOOKUP(Tabla22[[#This Row],[BPIN ]],[1]Base1!F$3:Z$223,21,0)","v":"09/02/2024\n"},45224,{"$f":"Tabla22[[#This Row],[FECHA ]]-Tabla22[[#This Row],[HOY]]","v":-258},{"$f":"Tabla22[[#This Row],[FECHA ]]-Tabla22[[#This Row],[FECHA DE TERMINACIÓN2]]","v":{"$error":"#VALUE!"}}]
["ENTIDAD APORTANTE RECURSOS","UNIVERSIDAD NACIONAL DE COLOMBIA","YAHIR ARCINIEGAS","LUIS MANUEL GONZALEZ",2020000100339,"Desarrollo de Nuevos Métodos No Destructivos para Monitoreo In Situ de Probabilidad de Ocurrencia de Falla en Tuberías en el Sector de Hidrocarburos en los Departamentos de  Bogotá Boyacá Santander","CTEL",2412084140,"CONTRATADO EN EJECUCIÓN",45077,{"$f":"VLOOKUP(Tabla22[[#This Row],[BPIN ]],[1]Base1!F$3:Z$223,21,0)","v":"31/05/2023\n"},45224,{"$f":"Tabla22[[#This Row],[FECHA ]]-Tabla22[[#This Row],[HOY]]","v":-147},{"$f":"Tabla22[[#This Row],[FECHA ]]-Tabla22[[#This Row],[FECHA DE TERMINACIÓN2]]","v":{"$error":"#VALUE!"}}]
["ENTIDAD APORTANTE RECURSOS","UNIVERSIDAD MILITAR NUEVA GRANADA","YAHIR ARCINIEGAS","LUIS MANUEL GONZALEZ",2020000100216,"Innovación y transferencia tecnológica de UMNGBIO a productores de flores para el control biológico de Tetranychus urticae (Acari: Tetranychiidae) en cultivos de invernadero con el ácaro benéfico Neoseiulus californicus (Acari: Phytoseiidae)  Cundinamarca","CTEL",2431580000,"CONTRATADO EN EJECUCIÓN",45456,{"$f":"VLOOKUP(Tabla22[[#This Row],[BPIN ]],[1]Base1!F$3:Z$223,21,0)","v":"13/06/2024\n"},45224,{"$f":"Tabla22[[#This Row],[FECHA ]]-Tabla22[[#This Row],[HOY]]","v":232},{"$f":"Tabla22[[#This Row],[FECHA ]]-Tabla22[[#This Row],[FECHA DE TERMINACIÓN2]]","v":{"$error":"#VALUE!"}}]
["CUNDINAMARCA","SECRETARIA DE COMPETITIVIDAD","DIEGO TORRES/VALENTINA PORTILLO","FABIAN CUESTA",2019000050026,"Desarrollo de un programa productivo, amigable con el medio ambiente del sector ganadero en el Departamento de Cundinamarca Cundinamarca","AGRICULTURA ",9757143522,"CONTRATADO EN EJECUCIÓN",null,{"$f":"VLOOKUP(Tabla22[[#This Row],[BPIN ]],[1]Base1!F$3:Z$223,21,0)","v":"NO DEFINIDO\n"},45224,{"$f":"Tabla22[[#This Row],[FECHA ]]-Tabla22[[#This Row],[HOY]]","v":-45224},{"$f":"Tabla22[[#This Row],[FECHA ]]-Tabla22[[#This Row],[FECHA DE TERMINACIÓN2]]","v":{"$error":"#VALUE!"}}]
["ENTIDAD APORTANTE RECURSOS","UNIVERSIDAD NACIONAL DE COLOMBIA","YAHIR ARCINIEGAS","LUIS MANUEL GONZALEZ",2020000100169,"Investigación Desarrollo, innovación y transferencia de conocimiento para el procesamiento de la semilla de Sacha Inchi en productos de valor agregado, como estrategia para mejorar la productividad del sector agroindustrial de la Región  Cundinamarca","CTEL",2757697312,"CONTRATADO EN EJECUCIÓN",45457,{"$f":"VLOOKUP(Tabla22[[#This Row],[BPIN ]],[1]Base1!F$3:Z$223,21,0)","v":"14/06/2024\n"},45224,{"$f":"Tabla22[[#This Row],[FECHA ]]-Tabla22[[#This Row],[HOY]]","v":233},{"$f":"Tabla22[[#This Row],[FECHA ]]-Tabla22[[#This Row],[FECHA DE TERMINACIÓN2]]","v":{"$error":"#VALUE!"}}]
["ENTIDAD APORTANTE RECURSOS","UPTC","YAHIR ARCINIEGAS","LUIS MANUEL GONZALEZ",2020000100114,"Fortalecimiento del ecosistema de investigación científica para CTeI en la universidad pedagógica y tecnológica de Colombia UPTC, I-SPACIO  Sogamoso","CTEL",2310634882,"CONTRATADO EN EJECUCIÓN",45077,{"$f":"VLOOKUP(Tabla22[[#This Row],[BPIN ]],[1]Base1!F$3:Z$223,21,0)","v":"31/05/2023\n"},45224,{"$f":"Tabla22[[#This Row],[FECHA ]]-Tabla22[[#This Row],[HOY]]","v":-147},{"$f":"Tabla22[[#This Row],[FECHA ]]-Tabla22[[#This Row],[FECHA DE TERMINACIÓN2]]","v":{"$error":"#VALUE!"}}]
["ENTIDAD APORTANTE RECURSOS","UNIVERSIDAD DE ANTIOQUIA","YAHIR ARCINIEGAS","LUIS MANUEL GONZALEZ",2020000100079,"Fortalecimiento de la infraestructura tecnológica y equipamiento del ambiente de formación industrial para el aumento de las capacidades institucionales en CTeI de la ETITC  Bogotá","CTEL",1090608306,"CONTRATADO EN EJECUCIÓN",45046,{"$f":"VLOOKUP(Tabla22[[#This Row],[BPIN ]],[1]Base1!F$3:Z$223,21,0)","v":"30/04/2023\n"},45224,{"$f":"Tabla22[[#This Row],[FECHA ]]-Tabla22[[#This Row],[HOY]]","v":-178},{"$f":"Tabla22[[#This Row],[FECHA ]]-Tabla22[[#This Row],[FECHA DE TERMINACIÓN2]]","v":{"$error":"#VALUE!"}}]
["ENTIDAD APORTANTE RECURSOS","UNIVERSIDAD NACIONAL DE COLOMBIA","YAHIR ARCINIEGAS","LUIS MANUEL GONZALEZ",2020000100075,"Aprovechamiento de la biodiversidad en agraz y papa para el desarrollo de cultivos promisorios en el departamento de   Santander","CTEL",3177259696,"CONTRATADO EN EJECUCIÓN",45565,{"$f":"VLOOKUP(Tabla22[[#This Row],[BPIN ]],[1]Base1!F$3:Z$223,21,0)","v":"30/09/2024\n"},45224,{"$f":"Tabla22[[#This Row],[FECHA ]]-Tabla22[[#This Row],[HOY]]","v":341},{"$f":"Tabla22[[#This Row],[FECHA ]]-Tabla22[[#This Row],[FECHA DE TERMINACIÓN2]]","v":{"$error":"#VALUE!"}}]
["ENTIDAD APORTANTE RECURSOS","UNIVERSIDAD NACIONAL DE COLOMBIA","YAHIR ARCINIEGAS","LUIS MANUEL GONZALEZ",2020000100019,"Fortalecimiento de capacidades de investigación y desarrollo tecnológico de la Universidad Colegio Mayor de Cundinamarca a partir de tecnologías industria 4.0 para el diseño y construcción en   Bogotá","CTEL",2077571214,"CONTRATADO EN EJECUCIÓN",45075,{"$f":"VLOOKUP(Tabla22[[#This Row],[BPIN ]],[1]Base1!F$3:Z$223,21,0)","v":"29/05/2023\n\n"},45224,{"$f":"Tabla22[[#This Row],[FECHA ]]-Tabla22[[#This Row],[HOY]]","v":-149},{"$f":"Tabla22[[#This Row],[FECHA ]]-Tabla22[[#This Row],[FECHA DE TERMINACIÓN2]]","v":{"$error":"#VALUE!"}}]
["ENTIDAD APORTANTE RECURSOS","UNIVERSIDAD INDUSTRIAL DE SANTANDER","YAHIR ARCINIEGAS","LUIS MANUEL GONZALEZ",2020000100017,"Fortalecimiento DE LA CAPACIDAD INSTITUCIONAL DE INVESTIGACIÓN DE LA UNIVERSIDAD INDUSTRIAL DESANTANDER  Nacional","CTEL",2808520000,"CONTRATADO EN EJECUCIÓN",45269,{"$f":"VLOOKUP(Tabla22[[#This Row],[BPIN ]],[1]Base1!F$3:Z$223,21,0)","v":"09/12/2023\n"},45224,{"$f":"Tabla22[[#This Row],[FECHA ]]-Tabla22[[#This Row],[HOY]]","v":45},{"$f":"Tabla22[[#This Row],[FECHA ]]-Tabla22[[#This Row],[FECHA DE TERMINACIÓN2]]","v":{"$error":"#VALUE!"}}]
["ENTIDAD APORTANTE RECURSOS","UNIVERSIDAD MILITAR NUEVA GRANADA","YAHIR ARCINIEGAS","LUIS MANUEL GONZALEZ",2020000100103,"Fortalecimiento de capacidades instaladas de Ciencia y Tecnología del Laboratorio de Diagnóstico en el Campus de la Univ Militar Nueva Granada, para atender problemáticas asociadas con agentes biológicos de alto riesgo para la salud humana,  Cundinamarca","CTEL",5162742977,"CONTRATADO EN EJECUCIÓN",44834,{"$f":"VLOOKUP(Tabla22[[#This Row],[BPIN ]],[1]Base1!F$3:Z$223,21,0)","v":"30/09/2022\n"},45224,{"$f":"Tabla22[[#This Row],[FECHA ]]-Tabla22[[#This Row],[HOY]]","v":-390},{"$f":"Tabla22[[#This Row],[FECHA ]]-Tabla22[[#This Row],[FECHA DE TERMINACIÓN2]]","v":{"$error":"#VALUE!"}}]
["ENTIDAD APORTANTE RECURSOS","INSTITUTO UNIVERSITARIO DE LA PAZ – UNIPAZ","YAHIR ARCINIEGAS","LUIS MANUEL GONZALEZ",2020000100042,"Fortalecimiento de los procesos académicos en los programas ofrecidos por el Instituto Universitario de la Paz, UNIPAZ,   Barrancabermeja","CTEL",1178749590,"CONTRATADO EN EJECUCIÓN",44705,{"$f":"VLOOKUP(Tabla22[[#This Row],[BPIN ]],[1]Base1!F$3:Z$223,21,0)","v":"24/05/2022\n"},45224,{"$f":"Tabla22[[#This Row],[FECHA ]]-Tabla22[[#This Row],[HOY]]","v":-519},{"$f":"Tabla22[[#This Row],[FECHA ]]-Tabla22[[#This Row],[FECHA DE TERMINACIÓN2]]","v":{"$error":"#VALUE!"}}]
["ENTIDAD APORTANTE RECURSOS","INSTITUTO UNIVERSITARIO DE LA PAZ – UNIPAZ","YAHIR ARCINIEGAS","LUIS MANUEL GONZALEZ",2020000100016,"Adecuación , DOTACIÓN E IMPLEMENTACIÓN DE UN LABORATORIO DE FABRICACIÓN DIGITAL PARA PROMOVER EL DESARROLLO DE LA CIENCIA, LAINNOVACIÓN Y EL EMPRENDIMIENTO EN LA UNIVERSIDAD FRANCISCO DE PAULA SANTANDER.  Cúcuta","CTEL",2921057589,"CONTRATADO EN EJECUCIÓN",44872,{"$f":"VLOOKUP(Tabla22[[#This Row],[BPIN ]],[1]Base1!F$3:Z$223,21,0)","v":"07/11/2022\n"},45224,{"$f":"Tabla22[[#This Row],[FECHA ]]-Tabla22[[#This Row],[HOY]]","v":-352},{"$f":"Tabla22[[#This Row],[FECHA ]]-Tabla22[[#This Row],[FECHA DE TERMINACIÓN2]]","v":{"$error":"#VALUE!"}}]
["ENTIDAD APORTANTE RECURSOS","UNIVERSIDAD TECNOLOGICA DE SANTANDER","YAHIR ARCINIEGAS","LUIS MANUEL GONZALEZ",2020000100004,"Fortalecimiento y adecuación de equipos e infraestructura del Laboratorio de física del Departamento de Ciencias Básicas, para el mejoramiento de las capacidades institucionales y la investigación en las Unidades Tecnológicas de Santander -  Bucaramanga","CTEL",1016752702,"CONTRATADO EN EJECUCIÓN",null,{"$f":"VLOOKUP(Tabla22[[#This Row],[BPIN ]],[1]Base1!F$3:Z$223,21,0)","v":"30/11/2022\n"},45224,{"$f":"Tabla22[[#This Row],[FECHA ]]-Tabla22[[#This Row],[HOY]]","v":-45224},{"$f":"Tabla22[[#This Row],[FECHA ]]-Tabla22[[#This Row],[FECHA DE TERMINACIÓN2]]","v":{"$error":"#VALUE!"}}]
["CUNDINAMARCA","SECRETARIA DE EDUCACIÓN","YAHIR ARCINIEGAS","GENNY PADILLA",2020000050037,"Dotación del mobiliario escolar para las instituciones educativas de los municipios no certificados del Departamento de Cundinamarca","EDUCACIÓN",10093038848,"CONTRATADO EN EJECUCIÓN",44773,{"$f":"VLOOKUP(Tabla22[[#This Row],[BPIN ]],[1]Base1!F$3:Z$223,21,0)","v":"31/07/2022\n"},45224,{"$f":"Tabla22[[#This Row],[FECHA ]]-Tabla22[[#This Row],[HOY]]","v":-451},{"$f":"Tabla22[[#This Row],[FECHA ]]-Tabla22[[#This Row],[FECHA DE TERMINACIÓN2]]","v":{"$error":"#VALUE!"}}]
["ENTIDAD APORTANTE RECURSOS","UNIVERSIDAD DEL NORTE","YAHIR ARCINIEGAS","LUIS MANUEL GONZALEZ",2020000100287,"Formación de Capital Humano de Alto Nivel Universidad del Norte 2do Corte Nacional","CTEL",6920233499,"CONTRATADO EN EJECUCIÓN",47299,{"$f":"VLOOKUP(Tabla22[[#This Row],[BPIN ]],[1]Base1!F$3:Z$223,21,0)","v":"30/06/2029\n"},45224,{"$f":"Tabla22[[#This Row],[FECHA ]]-Tabla22[[#This Row],[HOY]]","v":2075},{"$f":"Tabla22[[#This Row],[FECHA ]]-Tabla22[[#This Row],[FECHA DE TERMINACIÓN2]]","v":{"$error":"#VALUE!"}}]
["ENTIDAD APORTANTE RECURSOS","UNIVERSIDAD DEL VALLE","YAHIR ARCINIEGAS","LUIS MANUEL GONZALEZ",2020000100345,"Formación de capital humano de alto Nivel segundo Corte Universidad del Valle Nacional","CTEL",5913070114,"CONTRATADO EN EJECUCIÓN",47330,{"$f":"VLOOKUP(Tabla22[[#This Row],[BPIN ]],[1]Base1!F$3:Z$223,21,0)","v":"31/07/2029\n"},{"$f":"+TODAY()","v":45224},{"$f":"Tabla22[[#This Row],[FECHA ]]-Tabla22[[#This Row],[HOY]]","v":2106},{"$f":"Tabla22[[#This Row],[FECHA ]]-Tabla22[[#This Row],[FECHA DE TERMINACIÓN2]]","v":{"$error":"#VALUE!"}}]
["ENTIDAD APORTANTE RECURSOS","UNIVERSIDAD NACIONAL DE COLOMBIA","YAHIR ARCINIEGAS","LUIS MANUEL GONZALEZ",2021000100003,"Formación de Capital Humano de Alto Nivel Universidad  Nacional de Colombia Corte II Nacionl","CTEL",18418143500,"CONTRATADO EN EJECUCIÓN",47330,{"$f":"VLOOKUP(Tabla22[[#This Row],[BPIN ]],[1]Base1!F$3:Z$223,21,0)","v":"31/07/2029\n"},45224,{"$f":"Tabla22[[#This Row],[FECHA ]]-Tabla22[[#This Row],[HOY]]","v":2106},{"$f":"Tabla22[[#This Row],[FECHA ]]-Tabla22[[#This Row],[FECHA DE TERMINACIÓN2]]","v":{"$error":"#VALUE!"}}]
["ENTIDAD APORTANTE RECURSOS","UNIVERSIDAD DE LA SABANA","YAHIR ARCINIEGAS","LUIS MANUEL GONZALEZ",2021000100004,"Formación de Capital Humano de Alto Nivel Universidad de La Sabana Core 2 Nacional","CTEL",1519950000,"CONTRATADO EN EJECUCIÓN",47385,{"$f":"VLOOKUP(Tabla22[[#This Row],[BPIN ]],[1]Base1!F$3:Z$223,21,0)","v":"24/09/2029\n"},45224,{"$f":"Tabla22[[#This Row],[FECHA ]]-Tabla22[[#This Row],[HOY]]","v":2161},{"$f":"Tabla22[[#This Row],[FECHA ]]-Tabla22[[#This Row],[FECHA DE TERMINACIÓN2]]","v":{"$error":"#VALUE!"}}]
["ENTIDAD APORTANTE RECURSOS","UNIVERSIDAD ANTONIO NARIÑO","YAHIR ARCINIEGAS","LUIS MANUEL GONZALEZ",2021000100014,"Formación de Capital Humano de Alto Nivel Universidad Antonio Nariño Core 2 Nacional","CTEL",4526652200,"CONTRATADO EN EJECUCIÓN",47311,{"$f":"VLOOKUP(Tabla22[[#This Row],[BPIN ]],[1]Base1!F$3:Z$223,21,0)","v":"12/07/2029\n"},45224,{"$f":"Tabla22[[#This Row],[FECHA ]]-Tabla22[[#This Row],[HOY]]","v":2087},{"$f":"Tabla22[[#This Row],[FECHA ]]-Tabla22[[#This Row],[FECHA DE TERMINACIÓN2]]","v":{"$error":"#VALUE!"}}]
["ENTIDAD APORTANTE RECURSOS","UNIVERSIDAD EAN","YAHIR ARCINIEGAS","LUIS MANUEL GONZALEZ",2021000100025,"Formación DE CAPITAL HUMANO DE ALTO NIVEL UNIVERSIDAD EAN NACIONAL COHORTE II Nacional","CTEL",2044506416,"CONTRATADO EN EJECUCIÓN",47425,{"$f":"VLOOKUP(Tabla22[[#This Row],[BPIN ]],[1]Base1!F$3:Z$223,21,0)","v":"03/11/2029\n"},45224,{"$f":"Tabla22[[#This Row],[FECHA ]]-Tabla22[[#This Row],[HOY]]","v":2201},{"$f":"Tabla22[[#This Row],[FECHA ]]-Tabla22[[#This Row],[FECHA DE TERMINACIÓN2]]","v":{"$error":"#VALUE!"}}]
["ENTIDAD APORTANTE RECURSOS","UNIVERSIDAD MILITAR NUEVA GRANADA","YAHIR ARCINIEGAS","LUIS MANUEL GONZALEZ",2021000100026,"Formación de Capital Humano de Alto Nivel Universidad Militar Nueva Granada Segundo Corte Nacional","CTEL",751632481,"CONTRATADO EN EJECUCIÓN",47184,{"$f":"VLOOKUP(Tabla22[[#This Row],[BPIN ]],[1]Base1!F$3:Z$223,21,0)","v":"07/03/2029\n"},45224,{"$f":"Tabla22[[#This Row],[FECHA ]]-Tabla22[[#This Row],[HOY]]","v":1960},{"$f":"Tabla22[[#This Row],[FECHA ]]-Tabla22[[#This Row],[FECHA DE TERMINACIÓN2]]","v":{"$error":"#VALUE!"}}]
["ENTIDAD APORTANTE RECURSOS","PONIFICA UNIVERSIDAD JAVERIANA","YAHIR ARCINIEGAS","LUIS MANUEL GONZALEZ",2021000100027,"Formación de Capital Humano de Alto Nivel Pontificia Universidad Javeriana Sede Bogotá Corte II Nacional","CTEL",8577491761,"CONTRATADO EN EJECUCIÓN",null,{"$f":"VLOOKUP(Tabla22[[#This Row],[BPIN ]],[1]Base1!F$3:Z$223,21,0)","v":"No definido "},45224,{"$f":"Tabla22[[#This Row],[FECHA ]]-Tabla22[[#This Row],[HOY]]","v":-45224},{"$f":"Tabla22[[#This Row],[FECHA ]]-Tabla22[[#This Row],[FECHA DE TERMINACIÓN2]]","v":{"$error":"#VALUE!"}}]
["ENTIDAD APORTANTE RECURSOS","UNIVERSIDAD DE CALDAS","YAHIR ARCINIEGAS","LUIS MANUEL GONZALEZ",2021000100028,"Formación de capital humano de alto nivel Corte 2 Universidad de Caldas - Nacional","CTEL",63580000000,"CONTRATADO EN EJECUCIÓN",47356,{"$f":"VLOOKUP(Tabla22[[#This Row],[BPIN ]],[1]Base1!F$3:Z$223,21,0)","v":"26/08/2029\n"},45224,{"$f":"Tabla22[[#This Row],[FECHA ]]-Tabla22[[#This Row],[HOY]]","v":2132},{"$f":"Tabla22[[#This Row],[FECHA ]]-Tabla22[[#This Row],[FECHA DE TERMINACIÓN2]]","v":{"$error":"#VALUE!"}}]
["CUNDINAMARCA","SECRETARIA DE EDUCACIÓN","YAHIR ARCINIEGAS","GENNY PADILLA",2021004250258,"Fortalecimiento a la Estrategia de Alimentación Escolar para el año 2021 en los municipios del Departamento de Cundinamarca","EDUCACIÓN",16289941201,"CONTRATADO EN EJECUCIÓN",44760,{"$f":"VLOOKUP(Tabla22[[#This Row],[BPIN ]],[1]Base1!F$3:Z$223,21,0)","v":"18/07/2022\n"},45224,{"$f":"Tabla22[[#This Row],[FECHA ]]-Tabla22[[#This Row],[HOY]]","v":-464},{"$f":"Tabla22[[#This Row],[FECHA ]]-Tabla22[[#This Row],[FECHA DE TERMINACIÓN2]]","v":{"$error":"#VALUE!"}}]
["CUNDINAMARCA","SECRETARIA DE HABITAT Y VIVIENDA","ALEXANDER RIVEROS/JEIMY FORERO","BEATRIZ GAMEZ",2018000050050,"Mejoramiento vivienda rural mediante construcción de cocinas habitaciones y pisos en los municipios de Cundinamarca","AGRICULTURA ",5616585397,"EN PROCESO DE CONTRATACIÓN",45023,{"$f":"VLOOKUP(Tabla22[[#This Row],[BPIN ]],[1]Base1!F$3:Z$223,21,0)","v":45023},45224,{"$f":"Tabla22[[#This Row],[FECHA ]]-Tabla22[[#This Row],[HOY]]","v":-201},{"$f":"Tabla22[[#This Row],[FECHA ]]-Tabla22[[#This Row],[FECHA DE TERMINACIÓN2]]","v":0}]
["CUNDINAMARCA","SECRETARIA DE COMPETITIVIDAD","ALEXANDER RIVEROS/JEIMY FORERO","FABIAN CUESTA",2020000050035,"Fortalecimiento de los sistemas productivos a través de la reactivación del sector agrícola en el Departamento de Cundinamarca","AGRICULTURA ",8993872200.5599995,"EN PROCESO DE CONTRATACIÓN",45322,{"$f":"VLOOKUP(Tabla22[[#This Row],[BPIN ]],[1]Base1!F$3:Z$223,21,0)","v":45322},45224,{"$f":"Tabla22[[#This Row],[FECHA ]]-Tabla22[[#This Row],[HOY]]","v":98},{"$f":"Tabla22[[#This Row],[FECHA ]]-Tabla22[[#This Row],[FECHA DE TERMINACIÓN2]]","v":0}]
["CUNDINAMARCA","SECRETARIA DE MINAS, ENERGIA Y GAS","DIEGO TORRES / LIYUGETH ALFONSO","YAHIR",2021004250686,"Construcción Del Centro De Formación E Innovación Minero Energético De Cundinamarca","GOBIERNO TERRITORIAL","$ 13.770.893.382,00","EN PROCESO DE CONTRATACIÓN",44888,{"$f":"VLOOKUP(Tabla22[[#This Row],[BPIN ]],[1]Base1!F$3:Z$223,21,0)","v":44888},45224,{"$f":"Tabla22[[#This Row],[FECHA ]]-Tabla22[[#This Row],[HOY]]","v":-336},{"$f":"Tabla22[[#This Row],[FECHA ]]-Tabla22[[#This Row],[FECHA DE TERMINACIÓN2]]","v":0}]
["CUNDINAMARCA","UNIDAD ADMINISTRATIVA DE GESTIÓN DEL RIESGO.","DIEGO TORRES/VALENTINA PORTILLO","GINNA HERRERA",2021004250690,"Fortalecimiento del sistema automotor para la gestión del riesgo de desastres del departamento de Cundinamarca","GOBIERNO TERRITORIAL",7299514100,"EN PROCESO DE CONTRATACIÓN",44888,{"$f":"VLOOKUP(Tabla22[[#This Row],[BPIN ]],[1]Base1!F$3:Z$223,21,0)","v":44888},45224,{"$f":"Tabla22[[#This Row],[FECHA ]]-Tabla22[[#This Row],[HOY]]","v":-336},{"$f":"Tabla22[[#This Row],[FECHA ]]-Tabla22[[#This Row],[FECHA DE TERMINACIÓN2]]","v":0}]
["CUNDINAMARCA","SECRETARIA DE COMPETITIVIDAD","ALEXANDER RIVEROS/JEIMY FORERO","FABIAN CUESTA",2020000050038,"Optimización de los sistemas Ganaderos bovinos de carne leche y doble propósito a partir de la implementación de mejoramiento genético productivo y entrega de maquinaria y equipos en municipios del Departamento de Cundinamarca","AGRICULTURA ",8732449919,"SIN CONTRATAR",45565,{"$f":"VLOOKUP(Tabla22[[#This Row],[BPIN ]],[1]Base1!F$3:Z$223,21,0)","v":45565},45224,{"$f":"Tabla22[[#This Row],[FECHA ]]-Tabla22[[#This Row],[HOY]]","v":341},{"$f":"Tabla22[[#This Row],[FECHA ]]-Tabla22[[#This Row],[FECHA DE TERMINACIÓN2]]","v":0}]
["DECENTRALIZADOS","ICCU - GESPROY GB","DIEGO TORRES / JEIMY FORERO","GIOVANY QUEVEDO",2018000050024,"MEJORAMIENTO Y REHABILITACIÓN DE LA VÍA LA MARÍA – TOBIA - PASO EL REJO - LA PEÑA, DEPARTAMENTO DE CUNDINAMARCA","TRANSPORTE",9149162991,"TERMINADO",44316,{"$f":"VLOOKUP(Tabla22[[#This Row],[BPIN ]],[1]Base1!F$3:Z$223,21,0)","v":"30/04/2021\n"},{"$f":"+TODAY()","v":45224},{"$f":"Tabla22[[#This Row],[FECHA ]]-Tabla22[[#This Row],[HOY]]","v":-908},{"$f":"Tabla22[[#This Row],[FECHA ]]-Tabla22[[#This Row],[FECHA DE TERMINACIÓN2]]","v":{"$error":"#VALUE!"}}]
["DECENTRALIZADOS","ICCU - GESPROY GB","DIEGO TORRES / JEIMY FORERO","GIOVANY QUEVEDO",2018000050026,"MEJORAMIENTO DE VÍAS EN LA PROVINCIA DE SUMAPAZ PARA LA CONSOLIDACIÓN DE UNA PAZ ESTABLE Y DURADERA EN EL DEPARTAMENTO DE CUNDINAMARCA","TRANSPORTE",11457047617,"CONTRATADO EN EJECUCIÓN",44316,{"$f":"VLOOKUP(Tabla22[[#This Row],[BPIN ]],[1]Base1!F$3:Z$223,21,0)","v":"30/04/2021\n"},45224,{"$f":"Tabla22[[#This Row],[FECHA ]]-Tabla22[[#This Row],[HOY]]","v":-908},{"$f":"Tabla22[[#This Row],[FECHA ]]-Tabla22[[#This Row],[FECHA DE TERMINACIÓN2]]","v":{"$error":"#VALUE!"}}]
["DECENTRALIZADOS","ICCU - GESPROY GB","DIEGO TORRES / JEIMY FORERO","GIOVANY QUEVEDO",2018000050059,"Mejoramiento de la vía Gusbita - Tibirita del Departamento de Cundinamarca","TRANSPORTE",5500531740,"TERMINADO",44469,{"$f":"VLOOKUP(Tabla22[[#This Row],[BPIN ]],[1]Base1!F$3:Z$223,21,0)","v":"30/09/2021\n"},45224,{"$f":"Tabla22[[#This Row],[FECHA ]]-Tabla22[[#This Row],[HOY]]","v":-755},{"$f":"Tabla22[[#This Row],[FECHA ]]-Tabla22[[#This Row],[FECHA DE TERMINACIÓN2]]","v":{"$error":"#VALUE!"}}]
["DECENTRALIZADOS","ICCU - GESPROY GB","DIEGO TORRES / JEIMY FORERO","GIOVANY QUEVEDO",2019000050011,"Mejoramiento de la vía Supatá - Pacho, departamento de Cundinamarca","TRANSPORTE",7339441010,"CONTRATADO EN EJECUCIÓN",44712,{"$f":"VLOOKUP(Tabla22[[#This Row],[BPIN ]],[1]Base1!F$3:Z$223,21,0)","v":"31/05/2022\n"},45224,{"$f":"Tabla22[[#This Row],[FECHA ]]-Tabla22[[#This Row],[HOY]]","v":-512},{"$f":"Tabla22[[#This Row],[FECHA ]]-Tabla22[[#This Row],[FECHA DE TERMINACIÓN2]]","v":{"$error":"#VALUE!"}}]
["DECENTRALIZADOS","ICCU - GESPROY GB","DIEGO TORRES / JEIMY FORERO","GIOVANY QUEVEDO",2019000050013,"Construcción de la Plaza de Mercado del municipio de Choachí Cundinamarca","TRANSPORTE",4481109943,"CONTRATADO EN EJECUCIÓN",44651,{"$f":"VLOOKUP(Tabla22[[#This Row],[BPIN ]],[1]Base1!F$3:Z$223,21,0)","v":"31/03/2022\n"},45224,{"$f":"Tabla22[[#This Row],[FECHA ]]-Tabla22[[#This Row],[HOY]]","v":-573},{"$f":"Tabla22[[#This Row],[FECHA ]]-Tabla22[[#This Row],[FECHA DE TERMINACIÓN2]]","v":{"$error":"#VALUE!"}}]
["DECENTRALIZADOS","ICCU - GESPROY GB","DIEGO TORRES / JEIMY FORERO","GIOVANY QUEVEDO",2019000050016,"Mejoramiento de la vía Anolaima Corralejas (Inspección de Corralejas), departamento de Cundinamarca","TRANSPORTE",5718724028,"TERMINADO",44469,{"$f":"VLOOKUP(Tabla22[[#This Row],[BPIN ]],[1]Base1!F$3:Z$223,21,0)","v":"30/09/2021\n"},45224,{"$f":"Tabla22[[#This Row],[FECHA ]]-Tabla22[[#This Row],[HOY]]","v":-755},{"$f":"Tabla22[[#This Row],[FECHA ]]-Tabla22[[#This Row],[FECHA DE TERMINACIÓN2]]","v":{"$error":"#VALUE!"}}]
["DECENTRALIZADOS","ICCU - GESPROY GB","DIEGO TORRES / JEIMY FORERO","GIOVANY QUEVEDO",2019000050023,"Mejoramiento de la vía Lenguazaque - Villapinzón, departamento de Cundinamarca","TRANSPORTE",8636278689,"TERMINADO",44227,{"$f":"VLOOKUP(Tabla22[[#This Row],[BPIN ]],[1]Base1!F$3:Z$223,21,0)","v":"31/01/2021\n"},45224,{"$f":"Tabla22[[#This Row],[FECHA ]]-Tabla22[[#This Row],[HOY]]","v":-997},{"$f":"Tabla22[[#This Row],[FECHA ]]-Tabla22[[#This Row],[FECHA DE TERMINACIÓN2]]","v":{"$error":"#VALUE!"}}]
["DECENTRALIZADOS","ICCU - GESPROY GB","DIEGO TORRES / JEIMY FORERO","GIOVANY QUEVEDO",2019000050029,"Mejoramiento de la vía Gachetá - Gama, Departamento de Cundinamarca","TRANSPORTE",5477582208,"TERMINADO",44469,{"$f":"VLOOKUP(Tabla22[[#This Row],[BPIN ]],[1]Base1!F$3:Z$223,21,0)","v":"30/09/2021\n"},45224,{"$f":"Tabla22[[#This Row],[FECHA ]]-Tabla22[[#This Row],[HOY]]","v":-755},{"$f":"Tabla22[[#This Row],[FECHA ]]-Tabla22[[#This Row],[FECHA DE TERMINACIÓN2]]","v":{"$error":"#VALUE!"}}]
["DECENTRALIZADOS","ICCU - GESPROY GB","DIEGO TORRES / JEIMY FORERO","GIOVANY QUEVEDO",2019000050047,"Mejoramiento de la vía Susa - Carmen de Carupa, Departamento de Cundinamarca","TRANSPORTE",5203497468,"TERMINADO",44469,{"$f":"VLOOKUP(Tabla22[[#This Row],[BPIN ]],[1]Base1!F$3:Z$223,21,0)","v":"30/09/2021\n"},{"$f":"+TODAY()","v":45224},{"$f":"Tabla22[[#This Row],[FECHA ]]-Tabla22[[#This Row],[HOY]]","v":-755},{"$f":"Tabla22[[#This Row],[FECHA ]]-Tabla22[[#This Row],[FECHA DE TERMINACIÓN2]]","v":{"$error":"#VALUE!"}}]
["DECENTRALIZADOS","ICCU - GESPROY GB","DIEGO TORRES / JEIMY FORERO","GIOVANY QUEVEDO",2019000050056,"Mejoramiento de la vía que conduce del municipio de Nimaima al municipio de Nocaima, departamento de Cundinamarca","TRANSPORTE",5082491570,"TERMINADO",44560,{"$f":"VLOOKUP(Tabla22[[#This Row],[BPIN ]],[1]Base1!F$3:Z$223,21,0)","v":"30/12/2021\n"},45224,{"$f":"Tabla22[[#This Row],[FECHA ]]-Tabla22[[#This Row],[HOY]]","v":-664},{"$f":"Tabla22[[#This Row],[FECHA ]]-Tabla22[[#This Row],[FECHA DE TERMINACIÓN2]]","v":{"$error":"#VALUE!"}}]
["DECENTRALIZADOS","ICCU - GESPROY GB","DIEGO TORRES / JEIMY FORERO","GIOVANY QUEVEDO",2019000050060,"Estudios y diseños de vías para mejorar la competitividad del departamento de Cundinamarca","TRANSPORTE",7089369627,"TERMINADO",44438,{"$f":"VLOOKUP(Tabla22[[#This Row],[BPIN ]],[1]Base1!F$3:Z$223,21,0)","v":"30/08/2021\n"},45224,{"$f":"Tabla22[[#This Row],[FECHA ]]-Tabla22[[#This Row],[HOY]]","v":-786},{"$f":"Tabla22[[#This Row],[FECHA ]]-Tabla22[[#This Row],[FECHA DE TERMINACIÓN2]]","v":{"$error":"#VALUE!"}}]
["DECENTRALIZADOS","ICCU - GESPROY GB","DIEGO TORRES / JEIMY FORERO","GIOVANY QUEVEDO",2019000050075,"Mejoramiento de la vía que conduce del municipio de Viani al municipio de Chaguani, (de la y de San Vicente a Chaguani), departamento de Cundinamarca","TRANSPORTE",7504443091,"CONTRATADO EN EJECUCIÓN",44651,{"$f":"VLOOKUP(Tabla22[[#This Row],[BPIN ]],[1]Base1!F$3:Z$223,21,0)","v":"31/03/2022\n"},45224,{"$f":"Tabla22[[#This Row],[FECHA ]]-Tabla22[[#This Row],[HOY]]","v":-573},{"$f":"Tabla22[[#This Row],[FECHA ]]-Tabla22[[#This Row],[FECHA DE TERMINACIÓN2]]","v":{"$error":"#VALUE!"}}]
["DECENTRALIZADOS","ICCU - GESPROY GB","DIEGO TORRES / JEIMY FORERO","GIOVANY QUEVEDO",2019000050079,"MEJORAMIENTO DE LA VÍA SERREZUELA - EL TRIUNFO, MUNICIPIO DE LA CALERA, DEPARTAMENTO DE CUNDINAMARCA","TRANSPORTE",7614258187,"TERMINADO",44316,{"$f":"VLOOKUP(Tabla22[[#This Row],[BPIN ]],[1]Base1!F$3:Z$223,21,0)","v":"30/04/2021\n"},45224,{"$f":"Tabla22[[#This Row],[FECHA ]]-Tabla22[[#This Row],[HOY]]","v":-908},{"$f":"Tabla22[[#This Row],[FECHA ]]-Tabla22[[#This Row],[FECHA DE TERMINACIÓN2]]","v":{"$error":"#VALUE!"}}]
["DECENTRALIZADOS","ICCU - GESPROY GB","DIEGO TORRES / JEIMY FORERO","GIOVANY QUEVEDO",2019000050085,"MEJORAMIENTO DE LA VÍA QUE CONDUCE DEL MUNICIPIO DE LA MESA AL MUNICIPIO DE CACHIPAY, (DE LA INSPECCIÓN DE PEÑA NEGRA AL MUNICIPIO DE CACHIPAY), DEPARTAMENTO DE CUNDINAMARCA","TRANSPORTE",7019896083,"CONTRATADO EN EJECUCIÓN",44620,{"$f":"VLOOKUP(Tabla22[[#This Row],[BPIN ]],[1]Base1!F$3:Z$223,21,0)","v":"28/02/2022\n"},45224,{"$f":"Tabla22[[#This Row],[FECHA ]]-Tabla22[[#This Row],[HOY]]","v":-604},{"$f":"Tabla22[[#This Row],[FECHA ]]-Tabla22[[#This Row],[FECHA DE TERMINACIÓN2]]","v":{"$error":"#VALUE!"}}]
["CUNDINAMARCA","SECRETARIA DE CIENCIA, TECNOLOGIA E INNOVACIÓN","YAHIR ARCINIEGAS","LUIS MANUEL GONZALEZ",2021000100327,"Desarrollo de un sistema de producción lechero para la obtención de leches inocuas de alta calidad y con un perfil lipídico saludable en el Departamento de Cundinamarca","CTEL",3833042862,"SIN CONTRATAR",null,{"$f":"VLOOKUP(Tabla22[[#This Row],[BPIN ]],[1]Base1!F$3:Z$223,21,0)","v":"No definido"},{"$f":"+TODAY()","v":45224},{"$f":"Tabla22[[#This Row],[FECHA ]]-Tabla22[[#This Row],[HOY]]","v":-45224},{"$f":"Tabla22[[#This Row],[FECHA ]]-Tabla22[[#This Row],[FECHA DE TERMINACIÓN2]]","v":{"$error":"#VALUE!"}}]
["CUNDINAMARCA","SECRETARIA DE CIENCIA, TECNOLOGIA E INNOVACIÓN","YAHIR ARCINIEGAS","LUIS MANUEL GONZALEZ",2021000100208,"Fortalecimiento de los niveles de Apropiación social del Conocimiento de la CTeI en comunidades de las provincias de Almeidas y Ubaté del Departamento de Cundinamarca","CTEL",2191964751,"SIN CONTRATAR",null,{"$f":"VLOOKUP(Tabla22[[#This Row],[BPIN ]],[1]Base1!F$3:Z$223,21,0)","v":"No definido"},45224,{"$f":"Tabla22[[#This Row],[FECHA ]]-Tabla22[[#This Row],[HOY]]","v":-45224},{"$f":"Tabla22[[#This Row],[FECHA ]]-Tabla22[[#This Row],[FECHA DE TERMINACIÓN2]]","v":{"$error":"#VALUE!"}}]
["CUNDINAMARCA","SECRETARIA DE CIENCIA, TECNOLOGIA E INNOVACIÓN","YAHIR ARCINIEGAS","LUIS MANUEL GONZALEZ",2021000100243,"Desarrollo participativo de una plataforma tecnológica de teledetección para la gestión sostenible de suelos en agroecosistemas del Departamento de Cundinamarca","CTEL",3042693625,"SIN CONTRATAR",null,{"$f":"VLOOKUP(Tabla22[[#This Row],[BPIN ]],[1]Base1!F$3:Z$223,21,0)","v":"No definido"},45224,{"$f":"Tabla22[[#This Row],[FECHA ]]-Tabla22[[#This Row],[HOY]]","v":-45224},{"$f":"Tabla22[[#This Row],[FECHA ]]-Tabla22[[#This Row],[FECHA DE TERMINACIÓN2]]","v":{"$error":"#VALUE!"}}]
["CUNDINAMARCA","SECRETARIA DE MINAS, ENERGIA Y GAS","DIEGO TORRES / LIYUGETH ALFONSO","YAHIR",2021000050019,"Ampliación DE LA COBERTURA DEL SERVICIO DE GAS COMBUTIBLE POR REDES A TRAVES DE LA FINANCIACIÓN DEL CARGO POR CONEXIÓN Y LA RED INTERNA PARA USUARIOS DE BARRIOS PERIFÉRICOS VEREDAS Y CENTROS POBLADOS DE LOS MUNICIPIOS DE Cundinamarca","MINAS Y ENERGÍA",10613927436,"SIN CONTRATAR",null,{"$f":"VLOOKUP(Tabla22[[#This Row],[BPIN ]],[1]Base1!F$3:Z$223,21,0)","v":"No definido"},45224,{"$f":"Tabla22[[#This Row],[FECHA ]]-Tabla22[[#This Row],[HOY]]","v":-45224},{"$f":"Tabla22[[#This Row],[FECHA ]]-Tabla22[[#This Row],[FECHA DE TERMINACIÓN2]]","v":{"$error":"#VALUE!"}}]
["CUNDINAMARCA","SECRETARIA DE EDUCACIÓN","YAHIR ARCINIEGAS","GENNY PADILLA",2022000050007,"Fortalecimiento a la Estrategia de Alimentación Escolar en los municipios no certificados del Departamento de Cundinamarca para la vigencia 2022 Cundinamarca\t","EDUCACIÓN","\t42.966.037.310,00","SIN CONTRATAR",null,{"$f":"VLOOKUP(Tabla22[[#This Row],[BPIN ]],[1]Base1!F$3:Z$223,21,0)","v":"No definido"},45224,{"$f":"Tabla22[[#This Row],[FECHA ]]-Tabla22[[#This Row],[HOY]]","v":-45224},{"$f":"Tabla22[[#This Row],[FECHA ]]-Tabla22[[#This Row],[FECHA DE TERMINACIÓN2]]","v":{"$error":"#VALUE!"}}]
["CUNDINAMARCA","SECRETARIA DE CIENCIA, TECNOLOGIA E INNOVACIÓN","YAHIR ARCINIEGAS","LUIS MANUEL GONZALEZ",2021000100467,"Fortalecimiento de las capacidades institucionales para el desarrollo y gestión del Ecosistema Territorial de CTeI en todas las provincias del Departamento de Cundinamarca\n","CTEL",2801037429,"SIN CONTRATAR",null,{"$f":"VLOOKUP(Tabla22[[#This Row],[BPIN ]],[1]Base1!F$3:Z$223,21,0)","v":44760},45224,{"$f":"Tabla22[[#This Row],[FECHA ]]-Tabla22[[#This Row],[HOY]]","v":-45224},{"$f":"Tabla22[[#This Row],[FECHA ]]-Tabla22[[#This Row],[FECHA DE TERMINACIÓN2]]","v":-44760}]
["CUNDINAMARCA","SECRETARIA DE CIENCIA, TECNOLOGIA E INNOVACIÓN","YAHIR ARCINIEGAS","LUIS MANUEL GONZALEZ",2021000100276,"Desarrollo DE UN MODELO DE PROMOCIÓN TURÍSTICA SOSTENIBLE DESDE LA TECNOLOGÍA 4.0 EN LOS MUNICIPIOS DE LA PALMA Y YACOPI EN EL DEPARTAMENTO DE Cundinamarca\n","CTEL",2608055295,"SIN CONTRATAR",null,{"$f":"VLOOKUP(Tabla22[[#This Row],[BPIN ]],[1]Base1!F$3:Z$223,21,0)","v":"No definido"},45224,{"$f":"Tabla22[[#This Row],[FECHA ]]-Tabla22[[#This Row],[HOY]]","v":-45224},{"$f":"Tabla22[[#This Row],[FECHA ]]-Tabla22[[#This Row],[FECHA DE TERMINACIÓN2]]","v":{"$error":"#VALUE!"}}]
["CUNDINAMARCA","SECRETARIA DE CIENCIA, TECNOLOGIA E INNOVACIÓN","YAHIR ARCINIEGAS","LUIS MANUEL GONZALEZ",2021000100523,"Desarrollo de Microredes y almacenamiento (ESS) prestadores de servicios complementarios para incrementar la cobertura eficiencia y confiabilidad del servicio en el departamento de Cundinamarca\n","CTEL",3942973233,"SIN CONTRATAR",null,{"$f":"VLOOKUP(Tabla22[[#This Row],[BPIN ]],[1]Base1!F$3:Z$223,21,0)","v":"No definido"},45224,{"$f":"Tabla22[[#This Row],[FECHA ]]-Tabla22[[#This Row],[HOY]]","v":-45224},{"$f":"Tabla22[[#This Row],[FECHA ]]-Tabla22[[#This Row],[FECHA DE TERMINACIÓN2]]","v":{"$error":"#VALUE!"}}]
["CUNDINAMARCA","SECRETARIA DE EDUCACIÓN","YAHIR ARCINIEGAS","GENNY PADILLA",2022004250011,"Fortalecimiento a la Estrategia de subsidio de Transporte Escolar en municipios no certificados del Departamento de Cundinamarca para la vigencia 2022 Cundinamarca","CTEL",24666685502,"CONTRATADO EN EJECUCIÓN",null,{"$f":"VLOOKUP(E124,[1]Base1!$A$3:$AD$220,21,0)","v":{"$error":"#N/A"}},45224,{"$f":"Tabla22[[#This Row],[FECHA ]]-Tabla22[[#This Row],[HOY]]","v":{"$error":"#VALUE!"}}]
["ENTIDAD APORTANTE RECURSOS","EMTEL","ALEXANDER RIVEROS/JEIMY FORERO","FABIAN CUESTA",2022004250006,"Implementación de una estrategia de reactivación económica para el progreso y la competitividad de micronegocios y unidades productivas en el Departamento de Cundinamarca","AGRICULTURA ",8993872200.5599995,"SIN CONTRATAR",null,{"$f":"VLOOKUP(Tabla22[[#This Row],[BPIN ]],[1]Base1!F$3:Z$223,21,0)","v":{"$error":"#VALUE!"}},45224,{"$f":"Tabla22[[#This Row],[FECHA ]]-Tabla22[[#This Row],[HOY]]","v":{"$error":"#VALUE!"}}]
["CUNDINAMARCA","SECRETARIA DE CIENCIA, TECNOLOGIA E INNOVACIÓN","YAHIR ARCINIEGAS","Implementación de una estrategia de reactivación económica para el progreso y la competitividad de micronegocios y unidades productivas en el Departamento de Cundinamarca",2021000100500,"Fortalecimiento del equilibrio ecosistémico mediante la innovación en los procesos de propagación vegetal orientados a la generación de conocimiento y uso sostenible en el Departamento de Cundinamarca","CTEL",4114706771,"NO HA MIGRADO A GESPROY",null,{"$f":"VLOOKUP(Tabla22[[#This Row],[BPIN ]],[1]Base1!F$3:Z$223,21,0)","v":{"$error":"#VALUE!"}},45224,{"$f":"Tabla22[[#This Row],[FECHA ]]-Tabla22[[#This Row],[HOY]]","v":{"$error":"#VALUE!"}}]
["CUNDINAMARCA","SECRETARIA DE HABITAT Y VIVIENDA","ALEXANDER RIVEROS/JEIMY FORERO","BEATRIZ GAMEZ",2018000050050,"Mejoramiento vivienda rural mediante construcción de cocinas habitaciones y pisos en los municipios de Cundinamarca","AGRICULTURA ",null,"EN PROCESO DE CONTRATACIÓN",null,{"$f":"VLOOKUP(Tabla22[[#This Row],[BPIN ]],[1]Base1!F$3:Z$223,21,0)","v":{"$error":"#VALUE!"}},45224,{"$f":"Tabla22[[#This Row],[FECHA ]]-Tabla22[[#This Row],[HOY]]","v":{"$error":"#VALUE!"}}]
["CUNDINAMARCA","SECRETARIA DE COMPETITIVIDAD","ALEXANDER RIVEROS/JEIMY FORERO","FABIAN CUESTA",2020000050035,"Fortalecimiento de los sistemas productivos a través de la reactivación del sector agrícola en el Departamento de Cundinamarca","AGRICULTURA ",8993872200.5599995,"EN PROCESO DE CONTRATACIÓN",null,{"$f":"VLOOKUP(Tabla22[[#This Row],[BPIN ]],[1]Base1!F$3:Z$223,21,0)","v":{"$error":"#VALUE!"}},45224,{"$f":"Tabla22[[#This Row],[FECHA ]]-Tabla22[[#This Row],[HOY]]","v":{"$error":"#VALUE!"}}]
["CUNDINAMARCA","SECRETARIA DE COMPETITIVIDAD","ALEXANDER RIVEROS/JEIMY FORERO","FABIAN CUESTA",2020000050038,"Optimización de los sistemas Ganaderos bovinos de carne leche y doble propósito a partir de la implementación de mejoramiento genético productivo y entrega de maquinaria y equipos en municipios del Departamento de Cundinamarca","AGRICULTURA ",8732449919,"SIN CONTRATAR",null,{"$f":"VLOOKUP(Tabla22[[#This Row],[BPIN ]],[1]Base1!F$3:Z$223,21,0)","v":{"$error":"#VALUE!"}},45224,{"$f":"Tabla22[[#This Row],[FECHA ]]-Tabla22[[#This Row],[HOY]]","v":{"$error":"#VALUE!"}}]

{"sheet":"Riesgo de liberación","index":3,"n_rows":7,"n_cols":18,"rows_kept":7,"cut":false,"hidden":true,"merged":[]}
[]
["N°","EJECUTOR (Dpto / Entidad)","EJECUTOR INTERNO","ENCARGADO DE LA ENTIDAD ","ENLACE EMTIDAD EJECUTORA","BPIN ","PROYECTO","SECTOR","VALOR PROYECTO","VALOR SGR","OTRAS FUENTES","FECHA DE APROBACIÓN OCAD","ACUERDO DE APROBACIÓN","ESTADO","FECHA LIMITE","DÍAS TRANSCURRIDOS DESDE EL ACUERDO DE APROBACIÓN  ","Columna1","DÍAS HABILES PARA REALIZAR ACTO DE APERTURA"]
[]
[220,"CUNDINAMARCA","UNIDAD ADMINISTRATIVA DE GESTIÓN DEL RIESGO.",null,null,2022004250031,{"$f":"VLOOKUP(F4,'Proyectos en Ejecución'!$D$7:$W$242,2,0)","v":"CONSTRUCCIÓN DE OBRAS PARA MITIGAR LOS RIESGOS QUE SE PRESENTAN EN LA ZONAS ALEDAÑAS A LA URBANIZACIÓN SASIPA DEL MUNICIPIO DE SILVANIA CUNDINAMARCA"},{"$f":"VLOOKUP(F4,'Proyectos en Ejecución'!$D$7:$W$242,4,0)","v":"GOBIERNO TERRITORIAL"},{"$f":"VLOOKUP(F4,'Proyectos en Ejecución'!$D$7:$W$242,5,0)","v":3673954111},{"$f":"VLOOKUP(F4,'Proyectos en Ejecución'!$D$7:$W$242,6,0)","v":3673954111},{"$f":"I4-J4","v":0},{"$f":"VLOOKUP(F4,'Proyectos en Ejecución'!$D$7:$W$242,8,0)","v":44922},{"$f":"VLOOKUP(F4,'Proyectos en Ejecución'!$D$7:$W$242,10,0)","v":"DECRETO No 513 DE 2022"},{"$f":"VLOOKUP(F4,'Proyectos en Ejecución'!$D$7:$W$242,18,0)","v":"SIN CONTRATAR"},{"$f":"IF(L4=0,\"-\",EDATE(L4,6))","v":45104},{"$f":"IF(L4=0,\"-\",_xlfn.DAYS(TODAY(),L4))","v":302},{"$f":"IF(O4=\"-\",\"-\",_xlfn.DAYS(TODAY(),O4))","v":120},{"$f":"-Q4","v":-120}]
[223,"CUNDINAMARCA","SECRETARIA DE AMBIENTE",null,null,20223201010038,{"$f":"VLOOKUP(F5,'Proyectos en Ejecución'!$D$7:$W$242,2,0)","v":"IMPLEMENTACION DE UN PROCESO DE RESTAURACIÓN ECOLÓGICA COMO MEDIDA DE CONSERVACIÓN DE ÁREAS AMBIENTALES ESTRATÉGICAS EN LA PROVINCIA DE GUALIVA CUNDINAMARCA"},{"$f":"VLOOKUP(F5,'Proyectos en Ejecución'!$D$7:$W$242,4,0)","v":"AMBIENTE Y DESARROLLO SOSTENIBLE"},{"$f":"VLOOKUP(F5,'Proyectos en Ejecución'!$D$7:$W$242,5,0)","v":2238923844},{"$f":"VLOOKUP(F5,'Proyectos en Ejecución'!$D$7:$W$242,6,0)","v":" $ 2.238.923.844 "},0,{"$f":"VLOOKUP(F5,'Proyectos en Ejecución'!$D$7:$W$242,8,0)","v":"20/01/2023"},{"$f":"VLOOKUP(F5,'Proyectos en Ejecución'!$D$7:$W$242,10,0)","v":"DE 2023"},{"$f":"VLOOKUP(F5,'Proyectos en Ejecución'!$D$7:$W$242,18,0)","v":"SIN CONTRATAR"},45127,278,97,-97]
[]
[null,null,null,null,null,null,null,null,{"$f":"SUM(I3:I5)","v":5912877955},{"$f":"SUM(J3:J5)","v":3673954111}]

{"sheet":"Control de avances","index":4,"n_rows":1651,"n_cols":33,"rows_kept":1651,"cut":false,"hidden":true,"merged":[[216,19,216,21],[217,19,217,21],[0,0,0,14],[0,18,0,19],[0,21,0,22],[214,19,214,21],[215,19,215,21]]}
[" SISTEMAS GENERAL DEL REGALÍAS-BASE DE PROYECTOS APROBADOS",null,null,null,null,null,null,null,null,null,null,null,null,null,null,null,null,null,"\tAVANCE FÍSICO Y FINANCIERO",null,null,"ESTADO"]
["N°","EJECUTOR (Dpto / Entidad)","EJECUTOR INTERNO","ENCARGADO DE LA ENTIDAD ","ENLACE ENTIDAD EJECUTORA","BPIN","PROYECTO","SECTOR","VALOR PROYECTO","VALOR SGR","OTRAS FUENTES","FECHA DE APROBACIÓN OCAD","ESTADO","\tAVANCE FÍSICO","\tAVANCE FINANCIERO",null,null,null,"presento avance en el mes vigente ",null,null,"presento avance en el mes vigente ",null,null,null,null,"ESTADO"]
[1,"CUNDINAMARCA","SECRETARIA DE AMBIENTE","ALEXANDER RIVEROS /  LIYUGETH ALFONSO","HERNAN CAMILO",2012000050005,"ESTUDIOS Y DISEÑOS DE DETALLE EMBALSE CALANDAIMA MUNICIPIO DE EL COLEGIO DEPARTAMENTO DE CUNDINAMARCA","AMBIENTE Y DESARROLLO SOSTENIBLE",4000000000,1000000000,{"$f":"I3-J3","v":3000000000},41271,"CERRADO",1,1,null,null,null,"lleva 1 mes sin reportar avance",null,null,"lleva 3 mes sin reportar avance",null,null,null,null,44972,44607,{"$f":"IF(AA3=0,0,_xlfn.DAYS(AA3,TODAY()))","v":-252},{"$f":"IF(AB3=0,0,_xlfn.DAYS(AB3,TODAY()))","v":-617},{"$f":"IF(Z3=0,0,_xlfn.DAYS(Z3,TODAY()))","v":0}]
[2,"DESENTRALIZADOS","ICCU - GESPROY GB","ALEXANDER RIVEROS / JEIMY FORERO","GIOVANY QUEVEDO",2012000050006,"CONSTRUCCIÓN CUBIERTA COLISEO DEL CENTRO AGROTECNOLOGICO DE EXPOSICIONES Y COMERCIALIZACION DE LA REGION DEL SUMAPAZ EN EL MUNICIPIO DE FUSAGASUGA - CUNDINAMARCA","TRANSPORTE",6352617736,3581530801,2771086935,41271,"CERRADO",1,0.99539999999999995,null,null,null,"lleva 3 mes sin reportar avance",null,null,"lleva 6 mes sin reportar avance",null,null,null,null,44972,44607,{"$f":"IF(AA4=0,0,_xlfn.DAYS(AA4,TODAY()))","v":-252},{"$f":"IF(AB4=0,0,_xlfn.DAYS(AB4,TODAY()))","v":-617},{"$f":"IF(Z4=0,0,_xlfn.DAYS(Z4,TODAY()))","v":0}]
[3,"CUNDINAMARCA","SECRETARIA DE AGRICULTURA","DIEGO TORRES/ LIYUGETH ALFONSO","RAINER ABUETA",2012000050007,"FORTALECIMIENTO DE LAS CADENAS HORTIFRUTICOLA Y AROMATICAS EN CUNDINAMARCA","AGRICULTURA ",2490400000,1300000000,1190400000,41271,"CERRADO",1,1,null,null,null,"lleva 4 mes sin reportar avance",null,null,"lleva 9 mes sin reportar avance",null,null,null,null,44607,44607,{"$f":"IF(AA5=0,0,_xlfn.DAYS(AA5,TODAY()))","v":-617},-617,{"$f":"IF(Z5=0,0,_xlfn.DAYS(Z5,TODAY()))","v":0}]
[4,"CUNDINAMARCA","SECRETARIA DE AGRICULTURA","DIEGO TORRES/ LIYUGETH ALFONSO","RAINER ABUETA",2012000050009,"FORTALECIMIENTO DE LA PRODUCTIVIDAD Y COMPETITIVIDAD DEL SECTOR CACAOTERO EN EL DEPARTAMENTO DE CUNDINAMARCA ","AGRICULTURA ",2334689275,1200000000,1134689275,41271,"CERRADO",1,0.96340000000000003,null,null,null,"lleva 6 mes sin reportar avance",null,null,"lleva 1 año sin reportar avance",null,null,null,null,44607,44607,{"$f":"IF(AA6=0,0,_xlfn.DAYS(AA6,TODAY()))","v":-617},-617,0]
[5,"CUNDINAMARCA","SECRETARIA GENERAL","DAYANA FERNANDEZ/ VALENTINA PORTILLO","JIMENA TAFUR",2012000050010,"ESTUDIOS Y DISEÑOS PARA LA RECUPERACIÓN Y ADECUACION DEL PATRIMONIO HISTORICO CULTURAL PALACIO DE SAN FRANCISCO EN BOGOTA D.C. DEPARTAMENTO DE CUNDINAMARCA ","CULTURA ",1000000000,1000000000,0,41271,"CERRADO",1,0.95140000000000002,null,null,null,null,null,null,null,null,null,null,45034,45187,45034,-37,-190,-190]
[6,"CUNDINAMARCA","SECRETARIA DE EDUCACIÓN","ALEXANDER RIVEROS / JEIMY FORERO","GENNY PADILLA",2012000050011,"FORTALECIMIENTO DE LA PERMANENCIA DE LOS ESTUDIANTES EN LOS MUNICIPIOS DEL DEPARTAMENTO DE CUNDINAMARCA DEPARTAMENTO DE CUNDINAMARCA\n","EDUCACIÓN",6000000000,6000000000,0,41187,"CERRADO",1,0.58189999999999997,null,null,null,null,null,null,null,null,null,null,null,44607,44607,-617,-617,0]
[7,"CUNDINAMARCA","SECRETARIA DE DESARROLLO E INCLUSIÓN SOCIAL","DIEGO TORRES/ LIYUGETH ALFONSO","TATIANA HERNANDEZ",2012000050012,"IMPLEMENTACIÓN DEL PROGRAMA DE COMPLEMENTACION ALIMENTARIA Y NUTRICIONAL EN MENORES DE 5 AÑOS, MUJERES GESTANTES Y LACTANTES EN TODO EL DEPARTAMENTO DE CUNDINAMARCA","SALUD Y PROTECCIÓN SOCIAL",4531022720,3000000000,1531022720,41187,"CERRADO",0.99039999999999995,0.99719999999999998,null,null,null,null,null,null,null,null,null,null,null,44607,44607,-617,-617,0]
[8,"CUNDINAMARCA","SECRETARIA DE TRANSPORTE Y MOVILIDAD","DAYANA FERNANDEZ Y EDGAR YAHIR ARCINIEGAS","JORGE PINZON",2012000050013,"ACTUALIZACION Y FORMULACION DE LOS ESTUDIOS Y DISEÑOS FASE II Y III DE LA EXTENCION NORTE - QUITO - SUR DEL SISTEMA TRANSMILENIO AL MUNICIPIO DE SOACHA DEPARTAMENTO DE CUNDINAMARCA ","SALUD Y PROTECCIÓN SOCIAL",4026917304,3130787355,896129949,41187,"CERRADO",0.96220000000000006,0.97030000000000005,null,null,null,null,null,null,null,null,null,null,null,44607,44607,-617,-617,0]
[9,"CUNDINAMARCA","SECRETARIA DE AGRICULTURA","DIEGO TORRES/ LIYUGETH ALFONSO","RAINER ABUETA",2012000050014,"MEJORAMIENTO DE LA COMPETITIVIDAD Y SOSTENIBILIDAD DEL SUB SECTOR PANELERO DE CUNDINAMARCA","AGRICULTURA ",1559272190,1300000000,259272190,41271,"CERRADO",1,1,null,null,null,null,null,null,null,null,null,null,null,44607,44607,-617,-617,0]
[10,"CUNDINAMARCA","SECRETARIA DE AGRICULTURA","DIEGO TORRES/ LIYUGETH ALFONSO","RAINER ABUETA",2012000050023,"FORTALECIMIENTO DE LA ACTIVIDAD CAFETERA COMO ALTERNATIVA SOSTENIBLE DE DESARROLLO REGIONAL EN EL DEPARTAMENTO DE CUNDINAMARCA ","AGRICULTURA ",77168795512,1300000000,75868795512,41271,"CERRADO",1,0.99990000000000001,null,null,null,null,null,null,null,null,null,null,null,44607,44607,-617,-617,0]
[11,"CUNDINAMARCA","SECRETARIA DE AGRICULTURA","DIEGO TORRES/ LIYUGETH ALFONSO","RAINER ABUETA",2012000050024,"IMPLEMENTACION DE UN MODELO DE PRODUCCION EN SISTEMAS DE DOBLE PROPOSITO EN PEQUEÑOS PRODUCTORES DEL DEPARTAMENTO DE CUNDINAMARCA","AGRICULTURA ",3371686373,1823985000,1547701373,41271,"CERRADO",1,0.99439999999999995,null,null,null,null,null,null,null,null,null,null,null,44607,44607,-617,-617,0]
[12,"CUNDINAMARCA","SECRETARIA DE GOBIERNO","DAYANA FERNANDEZ ","EDUARDO ORDOÑEZ",2012000050025,"ESTUDIOS Y DISEÑOS PARA LA CONSTRUCCIÓN DE UN CENTRO ESPECIALIZADO AL SERVICIO DE ADOLESCENTES INFRACTORES DE LA LEY EN EL DEPARTAMENTO DE CUNDINAMARCA","DEFENSA",200000000,200000000,0,41271,"CERRADO",1,1,null,null,null,null,null,null,null,null,null,null,null,44607,44607,-617,-617,0]
[13,"ENTIDAD APORTANTE RECURSOS","MUNICIPIO DE COGUA","ALEXANDER RIVEROS","SANDRA SHUAIB",2012000050026,"MEJORAMIENTO DE LA VA COGUA-SAN CAYETANO (SECTOR LAS MARGARITAS K8+300 SECTOR LAS MARGARITAS HASTA K10+300) CON K0+00 EN COGUA DEPARTAMENTO DE CUNDINAMARCA","TRANSPORTE",2000000000,2000000000,0,41271,"CERRADO",1,1,null,null,null,null,null,null,null,null,null,null,null,44607,44607,-617,-617,0]
[14,"DESENTRALIZADOS","ICCU - GESPROY GB","ALEXANDER RIVEROS / JEIMY FORERO","LUZ MARINA GALINDO",2012000050027,"MEJORAMIENTO DE LA VA UBALA-PALOMAS-MAMBITA (K0+00 UBICADO EN EL SITIO PROFESIONALES MUNICIPIO DE UBALA), DEPARTAMENTO DE CUNDINAMARCA ","TRANSPORTE",3359160462,3000000000,359160462,41271,"CERRADO",1,0.98660000000000003,null,null,null,null,null,null,null,null,null,null,null,44607,44607,-617,-617,0]
[15,"DESENTRALIZADOS","ICCU - GESPROY GB","ALEXANDER RIVEROS / JEIMY FORERO","GIOVANY QUEVEDO",2012000050028,"MEJORAMIENTO Y MANTENIMIENTO DE LA RED VIAL SECUNDARIA Y TERCIARIA MEDIANTE LA DOTACIÓN DE MAQUINARIA A LOS MUNICIPIOS DEL DEPARTAMENTO DE CUNDINAMARCA ","TRANSPORTE",19769772343,8103535586,11666236757,41271,"CERRADO",1,0.93179999999999996,null,null,null,null,null,null,null,null,null,null,null,44607,44607,-617,-617,0]
[16,"CUNDINAMARCA","SECRETARIA DE MINAS, ENERGIA Y GAS","DIEGO TORRES / VALENTINA PORTILLO","MARIA PAULA GONZALEZ",2012000050029,"IMPLEMENTACIÓN Y MASIFICACION DEL SERVICIO DE GAS COMBUSTIBLE POR REDES PARA MUNICIPIOS DE ANOLAIMA, CACHIPAY, CHOACHI, FOMEQUE, UBAQUE Y VIOTA CUNDINAMARCA","MINAS Y ENERGÍA",15253036000,2199142000,13053894000,41271,"CERRADO",1,0.94499999999999995,null,null,null,null,null,null,null,null,null,null,null,44607,44607,-617,-617,0]
[17,"CUNDINAMARCA","SECRETARIA DE COMPETITIVIDAD","ALEXANDER RIVEROS/JEIMY FORERO","FABIAN CUESTA",2012000050030,"DESARROLLO CREACION Y FORTALECIMIENTO DE NUEVE (9) CENTROS DE EMPREDIMIENTO Y FORTALECIMIENTO EMPRESARIAL EN EL DEPARTAMENTO DE CUNDINAMARCA ","COMERCIO, INDUSTRIA Y TURISMO ",1752501814,1708104361,44397453,41271,"PARA CIERRE",1,0.95069999999999999,null,null,null,null,null,null,null,null,null,null,null,44607,44607,-617,-617,0]
[18,"ENTIDAD APORTANTE RECURSOS","MUNICIPIO DE MOSQUERA","DAYANA FERNANDEZ","GIOVANY QUEVEDO",2012000050039,"MEJORAMIENTO DE LA VIA CALLE 23 ENTRE CRA 3 Y 9B EN MOSQUERA CLL 7 ENTRE CRA 13 Y 24 EN FUNZA DEPARTAMENTO DE CUNDINAMARCA","TRANSPORTE",2816415712,1000000000,1816415712,41271,"CERRADO",1,1,null,null,null,null,null,null,null,null,null,null,null,44607,44607,-617,-617,0]
[19,"ENTIDAD APORTANTE RECURSOS","MUNICIPIO DE SOACHA","ALEXANDER RIVEROS","LUZ MARINA GALINDO",2012000050044,"REHABILITACIÓN Y MEJORAMIENTO DE LA VIA PARALELA ( TRANSVERSAL 8 Y CARRERA 7) ENTRE CARRERA 13 CON AUTOPISTA SUR BARRIO LA DESPENSA, HASTA LA CALLE 27 DEL CENTRO DEL MUNICIPIO DE SOACHA CUNDINAMARCA (TRAMO N 1 - K0+000 HASTA K0+262)","TRANSPORTE",1000000000,1000000000,0,41271,"CERRADO",1,1,null,null,null,null,null,null,null,null,null,null,null,44607,44607,-617,-617,0]
[20,"DESENTRALIZADOS","ICCU - GESPROY GB","ALEXANDER RIVEROS / JEIMY FORERO","GIOVANY QUEVEDO",2012000050051,"MEJORAMIENTO DEL PUENTE GUATIMBOL SOBRE EL RIO SUMAPAZ EN LA VA VENECIA - ICONONZO DEPARTAMENTO DE CUNDINAMARCA","TRANSPORTE",827195639,620304130,206891509,41271,"CERRADO",1,0.98089999999999999,null,null,null,null,null,null,null,null,null,null,null,44607,44607,-617,-617,0]
[21,"DESENTRALIZADOS","ICCU - GESPROY GB","ALEXANDER RIVEROS / JEIMY FORERO","GIOVANY QUEVEDO",2012000050052,"FORMULACIÓN Y ACTUALIZACION DE LOS ESTUDIOS Y DISEÑOS DE LA VIA UBAQUE - LOS CEREZOS - CHIPAQUE DEPARTAMENTO DE CUNDINAMARCA","TRANSPORTE",257457261,250000000,7457261,41271,"CERRADO",1,0.99960000000000004,null,null,null,null,null,null,null,null,null,null,null,44607,44607,-617,-617,0]
[22,"DESENTRALIZADOS","ICCU - GESPROY GB","ALEXANDER RIVEROS / JEIMY FORERO","GIOVANY QUEVEDO",2012000050054,"FORMULACIÓN Y ACTUALIZACION DE LOS ESTUDIOS Y DISEÑOS PARA EL MEJORAMIENTO DE LA TRONCAL DEL CARBON EN LONGITUD DE 43 KMS (K0+00 LOCALIZADO EN TIERRA NEGRA) DEPARTAMENTO DE CUNDINAMARCA","TRANSPORTE",777429075,755000000,22429075,41271,"CERRADO",1,0.99839999999999995,null,null,null,null,null,null,null,null,null,null,null,44607,44607,-617,-617,0]
[23,"CUNDINAMARCA","SECRETARIA DE CIENCIA, TECNOLOGIA E INNOVACIÓN","ALEXANDER RIVEROS / VALENTINA PORTILLO","JUAN CARLOS BELTRAN",2012000100010,"FORTALECIMIENTO DE LAS REGIONES COLOMBIANAS EN SUS CAPACIDADES DE CTI - CUNDINAMARCA","CTEL",8721806744,8721806744,0,41263,"CONTRATADO EN EJECUCIÓN",0.86029999999999995,0.97289999999999999,null,null,null,null,null,null,null,null,null,null,44972,44972,45124,-252,-100,-252]
[24,"CUNDINAMARCA","SECRETARIA DE CIENCIA, TECNOLOGIA E INNOVACIÓN","ALEXANDER RIVEROS / VALENTINA PORTILLO","JUAN CARLOS BELTRAN",2012000100056,"INVESTIGACIÓN ESTRATEGIAS DE VALORACION Y APROPIACION DE LOS RECURSOS NATURALES MECANISMOS DE ADAPTACION A CAMBIO CLIMATICO. REGION DEL BAJO MAGDALENA","CTEL",7184175232,4100000000,3084175232,41263,"CERRADO",1,0.99970000000000003,null,null,null,null,null,null,null,null,null,null,null,44607,44607,-617,-617,0]
[25,"CUNDINAMARCA","SECRETARIA DE CIENCIA, TECNOLOGIA E INNOVACIÓN","ALEXANDER RIVEROS / VALENTINA PORTILLO","JUAN CARLOS BELTRAN",2012000100063,"FORTALECIMIENTO DE LAS CAPACIDADES DE INNOVACIÓN SOCIAL POR MEDIO DEL PARQUE CIENTIFICO EN BOGOTA - CUNDINAMARCA","CTEL",16942704000,8250704000,8692000000,41263,"CERRADO",1,0.94730000000000003,null,null,null,null,null,null,null,null,null,null,null,44607,44607,-617,-617,0]
[26,"CUNDINAMARCA","SECRETARIA DE CIENCIA, TECNOLOGIA E INNOVACIÓN","ALEXANDER RIVEROS / VALENTINA PORTILLO","JUAN CARLOS BELTRAN",2012000100118,"FORMACION EN CIENCIA, TECNOLOGIA E INNOVACION EN LA COMUNIDAD EDUCATIVA DE LAS INSTITUCIONES EDUCATIVAS OFICIALES DE LOS MUNICIPIOS NO CERTIFICADOS DEL DEPARTAMENTO","CTEL",22788739251,17739839251,5048900000,41295,"CERRADO",0.98180000000000001,0.94810000000000005,null,null,null,null,null,null,null,null,null,null,null,44607,44607,-617,-617,0]
[27,"CUNDINAMARCA","SECRETARIA DE CIENCIA, TECNOLOGIA E INNOVACIÓN","ALEXANDER RIVEROS / VALENTINA PORTILLO","JUAN CARLOS BELTRAN",2012000100144,"INVESTIGACIÓN INVESTIGACION, DESARROLLO Y TRANSFERENCIA TECNOLOGICA EN EL SECTOR AGROPECUARIO Y AGROINDUSTRIAL CON EL FIN DE MEJORAR L TODO EL DEPARTAMENTO, CUNDINAMARCA, CENTRO ORIENTE","CTEL",50514736439,34707000000,15807736439,41263,"CONTRATADO EN EJECUCIÓN",0.84330000000000005,0.82169999999999999,null,null,null,null,null,null,null,null,null,null,45034,44635,45096,-589,-128,-190]
[28,"CUNDINAMARCA","SECRETARIA DE CIENCIA, TECNOLOGIA E INNOVACIÓN","ALEXANDER RIVEROS / VALENTINA PORTILLO","JUAN CARLOS BELTRAN",2012000100156,"CONSTRUCCIÓN DEL ECOSISTEMA DE INNOVACION TIC PARA EL DEPTO DE CUNDINAMARCA","CTEL",7088000000,5000000000,2088000000,41263,"CERRADO",0.98980000000000001,0.93179999999999996,null,null,null,null,null,null,null,null,null,null,null,44607,44607,-617,-617,0]
[29,"DESENTRALIZADOS","ICCU - GESPROY GB","ALEXANDER RIVEROS / JEIMY FORERO","GIOVANY QUEVEDO",2013000050003,"ESTUDIOS Y DISEÑOS PARA EL MEJORAMIENTO DE LA VA VILLAPINZON-TURMEQUE EN LONGITUD DE 11 KMS (K0+00 LOCALIZADO EN VILLAPINZON DEPARTAMENTO DE CUNDINAMARCA","TRANSPORTE",245000000,245000000,0,41400,"CERRADO",1,0.73470000000000002,null,null,null,null,null,null,null,null,null,null,null,44607,44607,-617,-617,0]
[30,"DESENTRALIZADOS","ICCU - GESPROY GB","ALEXANDER RIVEROS / JEIMY FORERO","EDWIN",2013000050004,"ESTUDIOS Y DISEÑOS PARA EL MEJORAMIENTO DE LA VA YACOPI - LA VICTORIA CON K0+00 EN YACOPI DEPARTAMENTO DE CUNDINAMARCA","TRANSPORTE",250000000,250000000,0,41400,"CERRADO",1,0.74909999999999999,null,null,null,null,null,null,null,null,null,null,null,44607,44607,-617,-617,0]
[31,"CUNDINAMARCA","SECRETARIA DE DESARROLLO E INCLUSIÓN SOCIAL","DIEGO TORRES/ LIYUGETH ALFONSO","TATIANA HERNANDEZ",2013000050005,"IMPLEMENTACIÓN DEL PROGRAMA DE COMPLEMENTACION ALIMENTARIA Y NUTRICIONAL PARA MENORES DE CINCO AÑOS Y MUJERES GESTANTES Y LACTANTES EN TODO EL DEPARTAMENTO DE CUNDINAMARCA","EDUCACIÓN",6189832118,6000000000,189832118,41400,"CERRADO",0.99819999999999998,0.9899,null,null,null,null,null,null,null,null,null,null,null,44607,44607,-617,-617,0]
[32,"CUNDINAMARCA","SECRETARIA DE EDUCACIÓN","ALEXANDER RIVEROS / JEIMY FORERO","GENNY PADILLA",2013000050011,"FORTALECIMIENTO DE LA PERMANENCIA DE LOS ESTUDIANTES EN LOS MUNICIPIOS DEL DEPARTAMENTO DE CUNDINAMARCA 2013-2014 CUNDINAMARCA, CENTRO ORIENTE","EDUCACIÓN",13360387595,13360387595,0,41400,"CERRADO",0.998,0.9234,null,null,null,null,null,null,null,null,null,null,null,44607,44607,-617,-617,0]
[33,"CUNDINAMARCA","SECRETARIA DE MINAS, ENERGIA Y GAS","DIEGO TORRES / VALENTINA PORTILLO","MARIA PAULA GONZALEZ",2013000050026,"CONSTRUCCIÓN REDES ELECTRICAS EN LA ZONA RURAL DE LOS MUNICIPIOS DE PARATEBUENO Y GUTIERREZ EN EL DEPARTAMENTO DE CUNDINAMARCA","MINAS Y ENERGÍA",1068319227,1045119227,23200000,41502,"CERRADO",0.44929999999999998,0.44700000000000001,null,null,null,null,null,null,null,null,null,null,44793,45034,44607,-190,-617,-431]
[34,"CUNDINAMARCA","SECRETARIA DE AGRICULTURA","DIEGO TORRES/ LIYUGETH ALFONSO","RAINER ABUETA",2013000050027,"FORTALECIMIENTO DE LA ACTIVIDAD CAFETERA COMO ESTRATEGIA DE MEJORAMIENTO DE LA PRODUCTIVIDAD Y LA COMPETITIVIDAD EN EL DEPARTAMENTO DE CUNDINAMARCA, CENTRO ORIENTE","AGRICULTURA ",18756930869,3000000000,15756930869,41502,"CERRADO",1,0.99490000000000001,null,null,null,null,null,null,null,null,null,null,null,44607,44607,-617,-617,0]
[35,"CUNDINAMARCA","SECRETARIA DE AGRICULTURA","DIEGO TORRES/ LIYUGETH ALFONSO","RAINER ABUETA",2013000050028,"FORTALECIMIENTO DEL SUBSECTOR PANELERO EN EL DEPARTAMENTO DE CUNDINAMARCA","AGRICULTURA ",3427279826,2599564478,827715348,41502,"CERRADO",1,0.99960000000000004,null,null,null,null,null,null,null,null,null,null,null,44607,44607,-617,-617,0]
[36,"DESENTRALIZADOS","ICCU - GESPROY GB","ALEXANDER RIVEROS / JEIMY FORERO","GIOVANY QUEVEDO",2013000050043,"MEJORAMIENTO Y REHABILITACION DE LA VIA GUACHETA - CAPELLANIA (SECTOR K0+780 AL K2+240) K0+000 LOCALIZADO EN EL RIO UBATE GUACHET, CUNDINAMARCA, CENTRO ORIENTE","TRANSPORTE",1019047619,1000000000,19047619,41639,"CERRADO",1,0.98060000000000003,null,null,null,null,null,null,null,null,null,null,null,44607,44607,-617,-617,0]
[37,"ENTIDAD APORTANTE RECURSOS","BANCO AGRARIO DE COLOMBIA","DIEGO TORRES / JEIMY FORERO",null,2013000050044,"CONSTRUCCIÓN CUNDINAMARCA VISR 2013 TODO EL DEPARTAMENTO, CUNDINAMARCA, CENTRO ORIENTE","AGRICULTURA ",60041780218,15888838218,44152942000,41569,"CONTRATADO EN EJECUCIÓN",0.81020000000000003,0.85289999999999999,null,null,null,null,null,null,null,null,null,null,null,44607,44607,-617,-617,0]
[38,"DESENTRALIZADOS","ICCU - GESPROY GB","ALEXANDER RIVEROS / JEIMY FORERO","GIOVANY QUEVEDO",2013000050045,"MEJORAMIENTO Y PAVIMENTACIÓN DE LA VIA FOSCA - GUTIERREZ, DESDE EL KM 2+000 AL KM 3+000 (K0+000 LOCALIZADO EN FOSCA), DEPARTAMENTO DE CUNDINAMARCA","TRANSPORTE",2534999997,2000000000,534999997,41579,"CERRADO",1,0.97450000000000003,null,null,null,null,null,null,null,null,null,null,null,44607,44607,-617,-617,0]
[39,"CUNDINAMARCA","SECRETARIA DE MINAS, ENERGIA Y GAS","DIEGO TORRES / VALENTINA PORTILLO","MARIA PAULA GONZALEZ",2013000050046,"IMPLEMENTACIÓN Y MASIFICACION DEL SERVICIO DE GAS COMBUSTIBLE POR REDES PARA LOS MUNICIPIOS DE CAPARRAPI, EL PEÑON, LA PALMA, PAIME, TOPAIPI Y VILLAGOMEZ CUNDINAMARCA","MINAS Y ENERGÍA",6609136508,2118963154,4490173354,41579,"CERRADO",1,1,null,null,null,null,null,null,null,null,null,null,null,44607,44607,-617,-617,0]
[40,"DESENTRALIZADOS","ICCU - GESPROY GB","ALEXANDER RIVEROS / JEIMY FORERO","GIOVANY QUEVEDO",2013000050047,"MEJORAMIENTO Y PAVIMENTACIÓN VIA GUANACAS - EL PEÑON DESDE EL K0+000 AL K2+000 (K0+000 UBICADO EN GUANACAS) MUNICIPIO EL PEÑON, CUNDINAMARCA","TRANSPORTE",3000000000,3000000000,0,41808,"CERRADO",1,0.99639999999999995,null,null,null,null,null,null,null,null,null,null,null,44607,44607,-617,-617,0]
[41,"DESENTRALIZADOS","ICCU - GESPROY GB","ALEXANDER RIVEROS / JEIMY FORERO","GIOVANY QUEVEDO",2013000050049,"MEJORAMIENTO Y MANTENIMIENTO DE LA RE VIAL MEDIANTE LA ADQUISICION DE MAQUINARIA AÑO 2013-2014 PARA LOS MUNICIPIOS DEL DEPARTAMENTO DE CUNDINAMARCA","TRANSPORTE",14330854376,12431431552,1899422824,41609,"CERRADO",1,0.99960000000000004,null,null,null,null,null,null,null,null,null,null,null,44607,44607,-617,-617,0]
[42,"DESENTRALIZADOS","ICCU - GESPROY GB","ALEXANDER RIVEROS / JEIMY FORERO","GIOVANY QUEVEDO",2013000050050,"MEJORAMIENTO Y PAVIMENTACIÓN DE LA VIA SANAME - PUENTE QUETAME DESDE K0+000 AL K1+500 (K0+000 LOCALIZADO EN PUENTE QUEMADO) MUNICIPIO FOSCA, CUNDINAMARCA","TRANSPORTE",6000000000,6000000000,0,41639,"CERRADO",1,0.49209999999999998,null,null,null,null,null,null,null,null,null,null,null,44607,44607,-617,-617,0]
[43,"CUNDINAMARCA","SECRETARIA DE AMBIENTE","ALEXANDER RIVEROS /  LIYUGETH ALFONSO","HERNAN CAMILO",2013000050051,"FORTALECIMIENTO DE LA GESTION INTEGRAL DE RESIDUOS SOLIDOS, A TRAVES DE SISTEMAS RECIONALES EN LAS PROVINCIAS DE UBATE Y RIONEGRO EN EL DEPARTAMENTO DE CUNDINAMARCA","VIVIENDA, CIUDAD Y TERRITORIO ",3000000000,3000000000,0,41579,"CERRADO",0.48280000000000001,0.47399999999999998,null,null,null,null,null,null,null,null,null,null,null,44607,44607,-617,-617,0]
[44,"CUNDINAMARCA","SECRETARIA DE AGRICULTURA","DIEGO TORRES/ LIYUGETH ALFONSO","RAINER ABUETA",2013000050054,"MEJORAMIENTO DE LA PRODUCTIVIDAD Y COMPETITIVIDAD DEL SECTOR CAUCHERO EN EL DEPARTAMENTO DE CUNDINAMARCA","AGRICULTURA ",3765860000,2459000000,1306860000,41639,"CERRADO",1,1,null,null,null,null,null,null,null,null,null,null,null,44607,44607,-617,-617,0]
[45,"CUNDINAMARCA","SECRETARIA DE GOBIERNO","DAYANA FERNANDEZ ","EDUARDO ORDOÑEZ",2013000050056,"PREVENCIN DE INCENDIOS FORESTALES CON LA ADQUISICION DE VEHICULOS 4X4 ACCION RAPIDA TIPO FORESTAL PARA EL DEPARTAMENTO DE CUNDINAMARCA","AMBIENTE Y DESARROLLO SOSTENIBLE",4000000000,4000000000,0,41579,"CERRADO",1,0.99990000000000001,null,null,null,null,null,null,null,null,null,null,null,44607,44607,-617,-617,0]
[46,"CUNDINAMARCA","SECRETARIA DE AGRICULTURA","DIEGO TORRES/ LIYUGETH ALFONSO","RAINER ABUETA",2013000050081,"MEJORAMIENTO DE LA PRODUCTIVIDAD, CALIDAD, POSCOSECHA Y MERCADEO DE LAS CADENAS HORTIFRUTCOLA Y AROMATICAS DE CUNDINAMARCA","AGRICULTURA ",4900400000,2600000000,2300400000,41808,"CERRADO",1,1,null,null,null,null,null,null,null,null,null,null,null,44607,44607,-617,-617,0]
[47,"CUNDINAMARCA","SECRETARIA DE AGRICULTURA","DIEGO TORRES/ LIYUGETH ALFONSO","RAINER ABUETA",2013000050083,"IMPLEMENTACIÓN Y PUESTA EN MARCHA DE UNA PLANTA HOMOGENIZADORA DE MIELES PARA LA PRODUCCION DE PANELA EN CAPARRAPI CUNDINAMARCA, CENTRO ORIENTE","AGRICULTURA ",3322683076.3200002,3126242524.3200002,196440552,41808,"CERRADO",1,1,null,null,null,null,null,null,null,null,null,null,null,44607,44607,-617,-617,0]
[48,"DESENTRALIZADOS","ICCU - GESPROY GB","ALEXANDER RIVEROS / JEIMY FORERO","GIOVANY QUEVEDO",2013000050094,"MEJORAMIENTO Y REHABILITACION DE LA VIA TABIO - CHIA DEL K1+100 AL K3+200","TRANSPORTE",2000000000,2000000000,0,41639,"DESAPROBADO",0,0,null,null,null,null,null,null,null,null,null,null,null,44607,44607,-617,-617,0]
[49,"CUNDINAMARCA","SECRETARIA DE CIENCIA, TECNOLOGIA E INNOVACIÓN","ALEXANDER RIVEROS / VALENTINA PORTILLO","JUAN CARLOS BELTRAN",2013000100129,"INCREMENTO EN LAS ESTRATEGIAS SUSTENTABLES EN EL USO DEL RECURSO DE ENERGA ELECTRICA PARA LA POBLACION VULNERABLE EN EL DPTO. DE CUNDINAMARCA","CTEL",5264002961,4097083299,1166919662,41789,"CONTRATADO EN EJECUCIÓN",0.89290000000000003,0.75719999999999998,"x",null,null,null,null,null,null,null,null,null,45217,44607,45217,-617,-7,-7]
[50,"CUNDINAMARCA","SECRETARIA DE CIENCIA, TECNOLOGIA E INNOVACIÓN","ALEXANDER RIVEROS / VALENTINA PORTILLO","JUAN CARLOS BELTRAN",2013000100131,"INVESTIGACIÓN ESTIMAR VULNERABILIDAD AL CAMBIO CLIMATICO DE SISTEMAS CAFETEROS Y DISEÑO DE ARREGLOS AGROFORESTALES CON BIOTECNOLOGIA PACHO, TIBACUY, SAN JUAN DE RIO SECO, CUNDINAMARCA","CTEL",3287867000,2622860000,665007000,41474,"CERRADO",0.98450000000000004,0.89039999999999997,null,null,null,null,null,null,null,null,null,null,null,44607,44607,-617,-617,0]
[51,"CUNDINAMARCA","SECRETARIA DE CIENCIA, TECNOLOGIA E INNOVACIÓN","ALEXANDER RIVEROS / VALENTINA PORTILLO","JUAN CARLOS BELTRAN",2013000100149,"INNOVACIÓN EN EL MODELO DE GESTION DE MEDICAMENTO EN EL DEPARTAMENTO DE CUNDINAMARCA FASE II","CTEL",3079583047,2490946916,588636131,41474,"CERRADO",1,1,null,null,null,null,null,null,null,null,null,null,null,44607,44607,-617,-617,0]
[52,"CUNDINAMARCA","SECRETARIA DE CIENCIA, TECNOLOGIA E INNOVACIÓN","ALEXANDER RIVEROS / VALENTINA PORTILLO","JUAN CARLOS BELTRAN",2013000100176,"INNOVACIÓN SISTEMA DE PRODUCCION DE FRUTAS/HORTALIZAS FRESCAS/PROCESADAS TIPO EXPORTACION CON TECNOLOGIA BIOLOGICA /INTEGRAL INOCUA SUBACHOQUE, CUNDINAMARCA, CENTRO ORIENTE","CTEL",9285096292,6556945302,2728150990,41474,"TERMINADO",1,0.68710000000000004,null,null,null,null,null,null,null,null,null,null,44972,44972,44972,-252,-252,-252]
[53,"CUNDINAMARCA","SECRETARIA DE CIENCIA, TECNOLOGIA E INNOVACIÓN","ALEXANDER RIVEROS / VALENTINA PORTILLO","JUAN CARLOS BELTRAN",2013000100180,"DISEÑO SMART TON: TALENTO E INNOVACION APLICADA AL TERRITORIO","CTEL",3089954000,2497510000,592444000,41509,"CERRADO",1,0.86539999999999995,null,null,null,null,null,null,null,null,null,null,null,44607,44607,-617,-617,0]
[54,"CUNDINAMARCA","SECRETARIA DE CIENCIA, TECNOLOGIA E INNOVACIÓN","ALEXANDER RIVEROS / VALENTINA PORTILLO","JUAN CARLOS BELTRAN",2013000100215,"FORTALECIMIENTO DE LA GESTIN COMUNITARIA DEL RECURSO HIDRICO, POR MEDIO DE LA DISMINUCION DEL CONSUMO DE ESTE, UTILIZANDO TP Y TICS , CUNDINAMARCA, CENTRO ORIENTE","CTEL",1811292700,1608461700,202831000,41565,"CERRADO",1,0.90739999999999998,null,null,null,null,null,null,null,null,null,null,null,44607,44607,-617,-617,0]
[55,"CUNDINAMARCA","SECRETARIA DE CIENCIA, TECNOLOGIA E INNOVACIÓN","ALEXANDER RIVEROS / VALENTINA PORTILLO","JUAN CARLOS BELTRAN",2013000100217,"FORTALECIMIENTO DE LA COMPETITIVIDAD DEL SECTOR FLORICULTOR COLOMBIANO MEDIANTE EL USO DE CIENCIA, TECNOLOGA E INNOVACION APLICADAS EN EL DEPARTAMENTO DE CUNDINAMARCA","CTEL",7204002875,4618409839,2585593036,41789,"CERRADO",1,0.9859,null,null,null,null,null,null,null,null,null,null,null,44607,44607,-617,-617,0]
[56,"CUNDINAMARCA","SECRETARIA DE CIENCIA, TECNOLOGIA E INNOVACIÓN","ALEXANDER RIVEROS / VALENTINA PORTILLO","JUAN CARLOS BELTRAN",2013000100247,"INVESTIGACIÓN E INNOVACIÓN TECNOLÓGICA Y APROPIACIÓN SOCIAL DE CONOCIMIENTO CIENTÍFICO DE ORQUÍDEAS NATIVAS DE CUNDINAMARCA","CTEL",3400306874,2551931927,848374947,41856,"CERRADO",0.96699999999999997,0.9526,null,null,null,null,null,null,null,null,null,null,null,44607,44607,-617,-617,0]
[57,"CUNDINAMARCA","SECRETARIA DE CIENCIA, TECNOLOGIA E INNOVACIÓN","ALEXANDER RIVEROS / VALENTINA PORTILLO","JUAN CARLOS BELTRAN",2013000100248,"INNOVACIÓN , CIENCIA Y TECNOLOGIA PARA PRODUCTORES DE LECHE EN LA PROVINCIA DE UBATE, CUNDINAMARCA.","CTEL",11619725567,9380319099,2239406468,41565,"TERMINADO",0.80249999999999999,0.81969999999999998,null,null,null,null,null,null,null,null,null,null,44740,44793,44760,-431,-464,-484]
[58,"ENTIDAD APORTANTE RECURSOS","MUNICIPIO DE MADRID","ALEXANDER RIVEROS",null,2013000050048,"MEJORAMIENTO Y PAVIMENTACIÓN DE LA VIA AJOVER-SANTA CRUZ EN 2 KILOMETROS, MUNICIPIO DE MADRID, CUNDINAMARCA","TRANSPORTE",8946944399,8700000000,246944399,41689,"CERRADO",1,1,null,null,null,null,null,null,null,null,null,null,null,44607,44607,-617,-617,0]
[59,"ENTIDAD APORTANTE RECURSOS","CORMAGDALENA","ALEXANDER RIVEROS",null,20132401060001,"MANTENIMIENTO Y RECUPERACIÓN DE LA NAVEGABILIDAD DEL RIO MAGDALENA","TRANSPORTE",3527443454052,117000000000,3410443454052,41514,"CERRADO",4.4999999999999998E-2,3.8300000000000001E-2,null,null,null,null,null,null,null,null,null,null,null,44607,44607,-617,-617,0]
[60,"DESENTRALIZADOS","ICCU - GESPROY GB","ALEXANDER RIVEROS / JEIMY FORERO","GIOVANY QUEVEDO",2014000050033,"MEJORAMIENTO Y REHABILITACIÓN DE LA VIA TABIO - CHIA DEL K0+000 AL K1+800","TRANSPORTE",2570000000,2000000000,570000000,41893,"CERRADO",1,1,null,null,null,null,null,null,null,null,null,null,null,44607,44607,-617,-617,0]
[61,"DESENTRALIZADOS","ICCU - GESPROY GB","ALEXANDER RIVEROS / JEIMY FORERO","GIOVANY QUEVEDO",2014257720001,"MEJORAMIENTO Y PAVIMENTACIÓN DE LA VIA SUESCA LA PLAYA - SESQUILE DEPARTAMENTO DE CUNDINAMARCA","TRANSPORTE",4191000000,1391000000,2800000000,41743,"CERRADO",1,0.98670000000000002,null,null,null,null,null,null,null,null,null,null,null,44607,44607,-617,-617,0]
[62,"CUNDINAMARCA","SECRETARIA DE GOBIERNO","DAYANA FERNANDEZ ","EDUARDO ORDOÑEZ",2014000050010,"CONSTRUCCIÓN DE UN CENTRO DE ATENCION ESPECIALIZADA AL SERVICIO DE ADOLESCENTES INFRACTORES DE LA LEY PENAL EN EL DEPARTAMENTO DE CUNDINAMARCA","JUSTICIA Y DEL DERECHO ",9260000000,8500000000,760000000,41808,"PARA CIERRE",1,1,"x",null,null,null,null,null,null,null,null,null,null,44607,44607,-617,-617,0]
[63,"ENTIDAD APORTANTE RECURSOS","MUNICIPIO DE VILLETA","ALEXANDER RIVEROS",null,2014000050048,"MEJORAMIENTO Y PAVIMENTACIÓN DE LA VIA VILLETA-PANTANILLO-CORREDOR CHUGUACAL -CAMBAO DEL K0+360 AL K1+060 VILLETA, CUNDINAMARCA, CENTRO ORIENTE","TRANSPORTE",1701612797,1489209370.23,212403426.76999998,42089,"CERRADO",1,1,null,null,null,null,null,null,null,null,null,null,null,44607,44607,-617,-617,0]
[64,"DESENTRALIZADOS","ICCU - GESPROY GB","ALEXANDER RIVEROS / JEIMY FORERO","GIOVANY QUEVEDO",2015000050010,"MEJORAMIENTO DE LA VA SAN CAYETANO - COGUA SECTOR K6+670 - K8+366 (K0+000 LOCALIZADO EN EL CASCO URBANO DEL MUNICIPIO DE SAN CAYETANO) CUNDINAMARCA","TRANSPORTE",3796247522,3000000000,796247522,42158,"CERRADO",1,0.98760000000000003,null,null,null,null,null,null,null,null,null,null,null,44607,44607,-617,-617,0]
[65,"DESENTRALIZADOS","ICCU - GESPROY GB","ALEXANDER RIVEROS / JEIMY FORERO","GIOVANY QUEVEDO",2015000050013,"MEJORAMIENTO DE LA VA UBAQUE - LOS CEREZOS - CHIPAQUE SECTORES DEL K0+000 AL K2+040 Y DEL K16+000 AL K18+260 (K0+000 LOCALIZADO EN UBAQUE) DEPARTAMENTO DE CUNDINAMARCA","TRANSPORTE",8000000000,8000000000,{"$f":"I67-J67","v":0},42159,"CERRADO",0.99709999999999999,0.98750000000000004,null,null,null,null,null,null,null,null,null,null,null,44607,44607,-617,-617,0]
[66,"CUNDINAMARCA","SECRETARIA DE HABITAT Y VIVIENDA","ALEXANDER RIVEROS/JEIMY FORERO","FABIAN BACHILLER",2015000050014,"CONSTRUCCIÓN DE VIVIENDAS NUEVAS RURALES VISR 2015 EN EL DEPARTAMENTO DE CUNDINAMARCA-SGR","AGRICULTURA ",7588896000,6840269782,748626218,42173,"CERRADO",1,0.92759999999999998,null,null,null,null,null,null,null,null,null,null,null,44607,44607,{"$f":"IF(AA68=0,0,_xlfn.DAYS(AA68,TODAY()))","v":-617},-617,0]
[67,"CUNDINAMARCA","SECRETARIA DE EDUCACIÓN","ALEXANDER RIVEROS / JEIMY FORERO","GENNY PADILLA",2015000050015,"FORTALECIMIENTO DE LA PERMANENCIA DE LOS ESTUDIANTES EN LOS MUNICIPIOS DEL DEPARTAMENTO DE CUNDINAMARCA, CENTRO ORIENTE - 2015","EDUCACIÓN",8373797030,8373797030,0,42159,"CERRADO",0.97070000000000001,0.85189999999999999,null,null,null,null,null,null,null,null,null,null,null,44607,44607,-617,-617,{"$f":"IF(Z69=0,0,_xlfn.DAYS(Z69,TODAY()))","v":0}]
[68,"DESENTRALIZADOS","ICCU - GESPROY GB","ALEXANDER RIVEROS / JEIMY FORERO","GIOVANY QUEVEDO",2015000050025,"MEJORAMIENTO Y PAVIMENTACIÓN DE LA TRONCAL DEL CARBON SECTOR K0+000 AL K2+860 (K0+000 LOCALIZADO EN TIERRA NEGRA, MUNICIPIO DE TAUSA), DEPARTAMENTO DE CUNDINAMARCA","TRANSPORTE",7913699780,6000000000,1913699780,42159,"CERRADO",1,1,null,null,null,null,null,null,null,null,null,null,null,44607,44607,-617,-617,0]
[69,"CUNDINAMARCA","SECRETARIA DE EDUCACIÓN","ALEXANDER RIVEROS / JEIMY FORERO","GENNY PADILLA",2015000050026,"FORTALECIMIENTO A LA ESTRATEGIA DE ALIMENTACIÓN ESCOLAR PARA MUNICIPIOS NO CERTIFICADOS DEL DEPARTAMENTO DE CUNDINAMARCA, CENTRO ORIENTE","EDUCACIÓN",2100000000,2100000000,0,42159,"CERRADO",1,0.85509999999999997,null,null,null,null,null,null,null,null,null,null,null,44607,44607,-617,-617,0]
[70,"CUNDINAMARCA","SECRETARIA DE AGRICULTURA","DIEGO TORRES/ LIYUGETH ALFONSO","RAINER ABUETA",2015000050029,"IMPLEMENTACIÓN Y PUESTA EN MARCHA DE UNA PLANTA HOMOGENIZADORA DE MIELES PARA LA PRODUCCION DE PANELA EN EL MUNICIPIO DE QUIPILE, CUNDINAMARCA, CENTRO ORIENTE","AGRICULTURA ",3395531657,3139511657,256020000,42180,"CERRADO",1,1,null,null,null,null,null,null,null,null,null,null,null,44607,44607,-617,-617,0]
[71,"CUNDINAMARCA","SECRETARIA DE AGRICULTURA","DIEGO TORRES/ LIYUGETH ALFONSO","RAINER ABUETA",2015000050030,"FORTALECIMIENTO A LA CADENA PRODUCTIVA DEL CACAO EN EL DEPARTAMENTO DE CUNDINAMARCA","AGRICULTURA ",2253334400,1200000000,1053334400,42159,"CERRADO",1,1,null,null,null,null,null,null,null,null,null,null,null,44607,44607,-617,-617,0]
[72,"CUNDINAMARCA","SECRETARIA DE GOBIERNO","DAYANA FERNANDEZ","EDUARDO ORDOÑEZ",2015000050031,"ADQUISICIÓN DE VEHICULOS PARA LOS CUERPOS OPERATIVOS (BOMBEROS) PARA LAS PROVINCIAS DEL DEPARTAMENTO DE CUNDINAMARCA","AMBIENTE Y DESARROLLO SOSTENIBLE",3670000000,3670000000,0,42159,"CERRADO",1,0.98,null,null,null,null,null,null,null,null,null,null,null,44607,44607,-617,-617,0]
[73,"CUNDINAMARCA","SECRETARIA DE AGRICULTURA","DIEGO TORRES/ LIYUGETH ALFONSO","RAINER ABUETA",2015000050034,"FORTALECIMIENTO DE LA PRODUCTIVIDAD Y COMPETITIVIDAD DEL SECTOR CAUCHERO EN EL DEPARTAMENTO DE CUNDINAMARCA","AGRICULTURA ",2158800000,1500000000,658800000,42159,"CERRADO",1,1,null,null,null,null,null,null,null,null,null,null,null,44607,44607,-617,-617,0]
[74,"DESENTRALIZADOS","ICCU - GESPROY GB","ALEXANDER RIVEROS / JEIMY FORERO","GIOVANY QUEVEDO",2015000050041,"MEJORAMIENTO DE LA VA UBALA - PALOMAS - MAMBITA - MEDINA (K0+000 UBICADO EN EL SITIO PROFESIONALES MUNICIPIO DE UBALA, DEPARTAMENTO DE CUNDINAMARCA","TRANSPORTE",13663491451,12663491451,1000000000,42180,"CERRADO",1,1,null,null,null,null,null,null,null,null,null,null,null,44607,44607,-617,-617,0]
[75,"CUNDINAMARCA","SECRETARIA DE DESARROLLO E INCLUSIÓN SOCIAL","DIEGO TORRES/ LIYUGETH ALFONSO","TATIANA HERNANDEZ",2015000050048,"IMPLEMENTACIÓN DEL PROGRAMA DE COMPLEMENTACION ALIMENTARIA Y NUTRICIONAL PARA MENORES DE 5 AÑOS, MADRES GESTANTES Y LACTANTES EN TODO EL DEPARTAMENTO DE CUNDINAMARCA 2015","SALUD Y PROTECCIÓN SOCIAL",2900000000,2900000000,0,42348,"CERRADO",1,1,null,null,null,null,null,null,null,null,null,null,null,44607,44607,-617,-617,0]
[76,"CUNDINAMARCA","SECRETARIA DE EDUCACIÓN","ALEXANDER RIVEROS / JEIMY FORERO","GENNY PADILLA",2016000050005,"FORTALECIMIENTO DE LA PERMANENCIA DE LOS ESTUDIANTES EN LOS MUNICIPIOS DEL DEPARTAMENTO DE CUNDINAMARCA, CENTRO ORIENTE - 2016","EDUCACIÓN",14963757156,14963757156,0,42605,"CERRADO",0.96699999999999997,0.56169999999999998,null,null,null,null,null,null,null,null,null,null,null,44607,44607,-617,-617,0]
[77,"CUNDINAMARCA","SECRETARIA DE EDUCACIÓN","ALEXANDER RIVEROS / JEIMY FORERO","GENNY PADILLA",2016000050014,"FORTALECIMIENTO A LA ESTRATEGIA DE ALIMENTACION ESCOLAR PARA MUNICIPIOS NO CERTIFICADOS DEL DEPARTAMENTO DE CUNDINAMARCA, SGR 2016.","EDUCACIÓN",12339894658,12339894658,0,42625,"CERRADO",0.76700000000000002,0.74729999999999996,null,null,null,null,null,null,null,null,null,null,null,44607,44607,-617,-617,0]
[78,"DESENTRALIZADOS","ICCU - GESPROY GB","ALEXANDER RIVEROS / JEIMY FORERO","GIOVANY QUEVEDO",2016000050023,"MANTENIMIENTO DE LA RED VIAL EN AFIRMADO A TRAVS DE LA ADQUISICION DE MAQUINARIA PESADA Y EQUIPO DE TRANSPORTE EN EL DEPARTAMENTO DE CUNDINAMARCA","TRANSPORTE",24179817530,24179817530,0,43066,"CERRADO",0.9133,0.62809999999999999,null,null,null,null,null,null,null,null,null,null,null,44607,44607,-617,-617,0]
[79,"DESENTRALIZADOS","ICCU - GESPROY GB","ALEXANDER RIVEROS / JEIMY FORERO","GIOVANY QUEVEDO",2016000050025,"REHABILITACIÓN DE LA VIA BOQUERON - PANDI DEL DEPARTAMENTO DE CUNDINAMARCA","TRANSPORTE",4991550669,4991550669,0,42825,"CERRADO",1,0.98740000000000006,null,null,null,null,null,null,null,null,null,null,null,44607,44607,-617,-617,0]
[80,"DESENTRALIZADOS","ICCU - GESPROY GB","ALEXANDER RIVEROS / JEIMY FORERO","GIOVANY QUEVEDO",2016000050029,"REHABILITACIÓN DE LA VIA LA QUINTA - REPRESA DEL NEUSA, MUNICIPIO DE COGUA, DEPARTAMENTO DE CUNDINAMARCA","TRANSPORTE",6798676732,5625757063,1172919669,42846,"CERRADO",1,0.99990000000000001,null,null,null,null,null,null,null,null,null,null,null,44607,44607,-617,-617,0]
[81,"DESENTRALIZADOS","ICCU - GESPROY GB","ALEXANDER RIVEROS / JEIMY FORERO","GIOVANY QUEVEDO",2016000050032,"REHABILITACIÓN DE LA VIA CLUB EL BOSQUE - TIBACUY - CUMACA DEL DEPARTAMENTO DE CUNDINAMARCA","TRANSPORTE",4022150134,3022150134,1000000000,42825,"CERRADO",1,0.99980000000000002,null,null,null,null,null,null,null,null,null,null,null,44607,44607,-617,-617,0]
[82,"ENTIDAD APORTANTE RECURSOS","ALCALDIA MAYOR DE BOGOTA","ALEXANDER RIVEROS","ESPERANZA GUZMAN",2016000050033,"ELABORACIÓN DE LA ENCUESTA MULTIPROPOSITO 2017 : BOGOTA - CUNDINAMARCA","VIVIENDA, CIUDAD Y TERRITORIO ",17282722269,16761722269,521000000,42825,"CERRADO",1,0.99950000000000006,null,null,null,null,null,null,null,null,null,null,null,44607,44607,-617,-617,0]
[83,"CUNDINAMARCA","SECRETARIA DE HABITAT Y VIVIENDA","ALEXANDER RIVEROS/JEIMY FORERO","FABIAN BACHILLER",2016000050052,"CONSTRUCCIÓN DE VIVIENDAS NUEVAS RURALES EN EL DEPARTAMENTO DE CUNDINAMARCA","AGRICULTURA ",5983779025.1700001,5343748804.6800003,640030220.48999977,43090,"CONTRATADO EN EJECUCIÓN",0.99990000000000001,0.99990000000000001,null,null,null,null,null,null,null,null,null,null,45034,44607,45034,-617,-190,-190]
[84,"CUNDINAMARCA","SECRETARIA DE CIENCIA, TECNOLOGIA E INNOVACIÓN","ALEXANDER RIVEROS / VALENTINA PORTILLO","JUAN CARLOS BELTRAN",2016000100027,"ANLISIS DE FACTORES GENETICOS, SANITARIOS Y MEDIOAMBIENTALES QUE AFECTAN LAS TASAS DE PREÑEZ A PARTIR DE EMBRIONES IN VITRO EN EL DEPARTAMENTO DE CUNDINAMARCA","CTEL",8135504363,6359045755,{"$f":"I86-J86","v":1776458608},43098,"TERMINADO",1,0.99670000000000003,null,null,null,null,null,null,null,null,null,null,45187,45217,45187,-7,-37,-37]
[85,"CUNDINAMARCA","SUPERVISIÓN / INTERVENTORÍA RAPE - SECRETARIA DE PLANEACIÓN","YAHIR ARCINIEGAS","ANGELA MARTINEZ",2016000050012,"Implementación DE ACCIONES DE CONSERVACIoN Y RESTAURACIoN DE LOS COMPLEJOS DE PaRAMO, BOSQUE ALTO-ANDINO Y SERVICIOS ECOSISTeMICOS DE LA REGIoN CENTRAL","AMBIENTE Y DESARROLLO SOSTENIBLE",32499987282,{"$f":"I87","v":32499987282},0,42829,"CONTRATADO EN EJECUCIÓN",0.99809999999999999,0.99880000000000002,null,null,null,null,null,null,null,null,null,null,44793,45034,44972,-190,-252,-431]
[86,"CUNDINAMARCA","SECRETARIA DE DESARROLLO E INCLUSIÓN SOCIAL","DIEGO TORRES/ LIYUGETH ALFONSO","TATIANA HERNANDEZ",2017000050017,"FORTALECIMIENTO DEL PROGRAMA DE COMPLEMENTACIÓN ALIMENTARIA Y NUTRICIONAL PARA NIÑAS, NIÑOS MENORES DE 5 AÑOS Y MADRES GESTANTES Y LACTANTES EN RIESGO DE DESNUTRICIÓN DEL DEPARTAMENTO DE CUNDINAMARCA","INCLUSIÓN SOCIAL Y RECONCILIACIÓN",8199993544,8199993544,0,42915,"CERRADO",1,null,null,null,null,null,null,null,null,null,null,null,44793,44607,44607,-617,-617,-431]
[87,"CUNDINAMARCA","SECRETARIA DE EDUCACIÓN","ALEXANDER RIVEROS / JEIMY FORERO","PABLO CAJAMARCA",2017000050027,"FORTALECIMIENTO DE LA PERMANENCIA DE LOS ESTUDIANTES EN LOS MUNICIPIOS DEL DEPARTAMENTO DE CUNDINAMARCA , CENTRO ORIENTE 2017 CUNDINAMARCA","EDUCACIÓN",14995289800,14995289800,0,42961,"CERRADO",1,0.88590000000000002,null,null,null,null,null,null,null,null,null,null,44740,44760,44607,-464,-617,-484]
[88,"ENTIDAD APORTANTE RECURSOS","MUNICIPIO DE ZIPAQUIRA","ALEXANDER RIVEROS","JAIRO JARA",2017000050029,"CONSERVACIÓN  Y GESTIÓN INTEGRAL DEL RECURSO HÍDRICO MEDIANTE LA ADQUISICIÓN Y RESTAURACIÓN DE PREDIOS DE INTERÉS ECOSISTÉMICO EN ELDEPARTAMENTO DE   CUNDINAMARCA","AMBIENTE Y DESARROLLO SOSTENIBLE",900000000,467000000,433000000,43340,"CONTRATADO EN EJECUCIÓN",0.3327,0.47539999999999999,"x",null,null,null,null,null,null,null,null,null,null,44607,44607,-617,-617,0]
[89,"CUNDINAMARCA","SECRETARIA DE EDUCACIÓN","ALEXANDER RIVEROS / JEIMY FORERO","GENNY PADILLA",2017000050033,"FORTALECIMIENTO A LA ESTRATEGIA DE ALIMENTACIÓN ESCOLAR PARA MUNICIPIOS NO CERTIFICADOS DEL DEPARTAMENTO DE CUNDINAMARCA","EDUCACIÓN",14000000000,14000000000,0,42977,"CERRADO",1,0.26939999999999997,null,null,null,null,null,null,null,null,null,null,null,44607,44607,-617,-617,0]
[90,"CUNDINAMARCA","SECRETARIA DE MINAS, ENERGIA Y GAS","DIEGO TORRES / VALENTINA PORTILLO","MARIA PAULA GONZALEZ",2017000050036,"IMPLEMENTACIÓN Y EXPANSIÓN DEL SERVICIO DE GAS COMBUSTIBLE POR REDES PARA VEREDAS Y CENTROS POBLADOS DEL DEPARTAMENTO DE CUNDINAMARCA","MINAS Y ENERGÍA",4751658472,3069656503,1682001969,43356,"CERRADO",0.91510000000000002,0.92069999999999996,null,null,null,null,null,null,null,null,null,null,null,44972,44635,-252,-589,0]
[91,"CUNDINAMARCA","SECRETARIA DE PLANEACIÓN","YESID CASTAÑO Y JEIMY FORERO","RUSVEL NIETO",2017000050039,"MEJORAMIENTO DE VÍAS TERCIARIAS MEDIANTE EL USO DE PLACA HUELLA EN LOS MUNICIPIOS DE GUATAVITA, PACHO, SAN JUAN DE RIOSECO, SUBACHOQUE, TENA Y ZIPAQUIRÁ, DEPARTAMENTO DE CUNDINAMARCA","TRANSPORTE",6791102421.6400003,6725380621.6400003,65721800,43063,"CONTRATADO EN EJECUCIÓN",0.98519999999999996,0.92030000000000001,"x",null,null,null,null,null,null,null,null,null,44760,44607,44607,-617,-617,-464]
[92,"CUNDINAMARCA","SECRETARIA DE HABITAT Y VIVIENDA","ALEXANDER RIVEROS/JEIMY FORERO","FABIAN BACHILLER",2017000050042,"MEJORAMIENTO DE VIVIENDAS RURALES DE LA PROVINCIA DE UBATÉ - CUNDINAMARCA","VIVIENDA, CIUDAD Y TERRITORIO ",2354318125,2354318125,0,43096,"TERMINADO",1,0.99729999999999996,null,null,null,null,null,null,null,null,null,null,44972,44741,44980,-483,-244,-252]
[93,"CUNDINAMARCA","SECRETARIA DE SALUD","DAYANA FERNANDEZ / LIYUGETH ALFONSO","OLGA LUCIA GARZON",2017000050061,"ADQUISICIÓN AMBULANCIAS DE TRANSPORTE ASISTENCIAL BÁSICO (TAB) Y TRANSPORTE ASISTENCIAL MEDICALIZADA (TAM), PARA EL APOYO DEL SISTEMA DE REFERENCIA Y CONTRA REFERENCIA DE LA RED HOSPITALARIA DEL DEPARTAMENTO DE CUNDINAMARCA","SALUD Y PROTECCIÓN SOCIAL",3764666699,2000553024,1764113675,43081,"CERRADO",1,0.9708,null,null,null,null,null,null,null,null,null,null,null,44607,44607,-617,-617,0]
[94,"CUNDINAMARCA","SECRETARIA DE AGRICULTURA","DIEGO TORRES/ LIYUGETH ALFONSO","RAINER ABUETA",2017000050062,"FORTALECIMIENTO DE LAS CADENAS PRODUCTIVAS DE MANGO, AGUACATE Y CÍTRICOS EN EL DEPARTAMENTO DE CUNDINAMARCA","AGRICULTURA ",3000129600,2100129600,900000000,43124,"CERRADO",1,1,null,null,null,null,null,null,null,null,null,null,null,44607,44607,-617,-617,0]
[95,"CUNDINAMARCA","SECRETARIA DE MINAS, ENERGIA Y GAS","DIEGO TORRES / VALENTINA PORTILLO","MARIA PAULA GONZALEZ",2017000050064,"CONSTRUCCIÓN DE REDES ELÉCTRICAS EN ZONA RURAL DE 13 MUNICIPIOS, EN EL MARCO DEL PROYECTO ILUMINANDO VIDAS DEL DEPARTAMENTO DE CUNDINAMARCA","MINAS Y ENERGÍA",2972842689,2532327281,440515408,43273,"CERRADO",0.82330000000000003,0.81879999999999997,null,null,null,null,null,null,null,null,null,null,null,44607,44607,-617,-617,0]
[96,"CUNDINAMARCA","SECRETARIA DE AGRICULTURA","DIEGO TORRES/ LIYUGETH ALFONSO","RAINER ABUETA",2017000050065,"MEJORAMIENTO DE LA PRODUCTIVIDAD Y RENTABILIDAD DE LOS CAFICULTORES DEL DEPARTAMENTO DE CUNDINAMARCA","AGRICULTURA ",6523880054,4220000000,2303880054,43096,"TERMINADO",0.86480000000000001,0.84630000000000005,"x",null,null,null,null,null,null,null,null,null,44972,44793,45155,-431,-69,-252]
[97,"CUNDINAMARCA","SECRETARIA DE CIENCIA, TECNOLOGIA E INNOVACIÓN","ALEXANDER RIVEROS / VALENTINA PORTILLO","JUAN CARLOS BELTRAN",2017000100016,"IMPLEMENTACIÓN PROGRAMA DE INNOVACIÓN PARA LA VALIDACIÓN Y GENERACIÓN DE PRODUCTOS DERIVADOS DE LA BIODIVERSIDAD EN EL DEPARTAMENTO DE CUNDINAMARCA","CTEL",4825004077.9799995,4664086788.1700001,160917289.80999947,42941,"CONTRATADO EN EJECUCIÓN",0.79620000000000002,0.96160000000000001,null,null,null,null,null,null,null,null,null,null,45217,44607,45124,-617,-100,-7]
[98,"CUNDINAMARCA","SECRETARIA DE CIENCIA, TECNOLOGIA E INNOVACIÓN","ALEXANDER RIVEROS / VALENTINA PORTILLO","JUAN CARLOS BELTRAN",2017000100034,"IMPLEMENTACIÓN DE UN SISTEMA DE GESTIÓN DE INNOVACIÓN PARA LA INDUSTRIA DE CUNDINAMARCA","CTEL",3925471448,3714407118,211064330,42941,"CONTRATADO EN EJECUCIÓN",0.99209999999999998,0.94179999999999997,"x",null,null,null,null,null,null,null,null,null,null,44607,44706,-617,-518,0]
[99,"CUNDINAMARCA","SECRETARIA DE CIENCIA, TECNOLOGIA E INNOVACIÓN","ALEXANDER RIVEROS / VALENTINA PORTILLO","JUAN CARLOS BELTRAN",2017000100074,"IMPLEMENTACIÓN DE ESTRATEGIAS DE FOMENTO A LA CULTURA Y SERVICIOS DE INNOVACIÓN EN LAS PROVINCIAS SABANA OCCIDENTE, SABANA CENTRAL, SOACHA Y SUMAPAZ CUNDINAMARCA","CTEL",6183633276,5533633276,650000000,43098,"PARA CIERRE",1,0.99709999999999999,null,null,null,null,null,null,null,null,null,null,44972,45217,44980,-7,-244,-252]
[100,"CUNDINAMARCA","SECRETARIA DE CIENCIA, TECNOLOGIA E INNOVACIÓN","ALEXANDER RIVEROS / VALENTINA PORTILLO","JUAN CARLOS BELTRAN",2017000100076,"FORTALECIMIENTO DE CAPACIDADES DE GESTIÓN DEL RIESGO A TRAVÉS DE APROPIACIÓN SOCIAL DE LA CIENCIA, LA TECNOLOGÍA Y LA INNOVACIÓN EN EL DEPARTAMENTO DE CUNDINAMARCA","CTEL",4404970720,4000000000,404970720,43322,"CONTRATADO EN EJECUCIÓN",0.98760000000000003,1.2524,null,null,null,null,null,null,null,null,null,null,45155,44607,45217,-617,-7,-69]
[101,"CUNDINAMARCA","SECRETARIA DE CIENCIA, TECNOLOGIA E INNOVACIÓN","ALEXANDER RIVEROS / VALENTINA PORTILLO","JUAN CARLOS BELTRAN",2017000100087,"FORMACIÓN DE TALENTO HUMANO DE ALTO NIVEL EN MAESTRÍAS EN EL DEPARTAMENTO DE CUNDINAMARCA","CTEL",5148022960,5048022960,100000000,43698,"CONTRATADO EN EJECUCIÓN",0.61890000000000001,1.7048000000000001,null,null,null,null,null,null,null,null,null,null,45187,44972,45217,-252,-7,-37]
[102,"CUNDINAMARCA","SECRETARIA DE CIENCIA, TECNOLOGIA E INNOVACIÓN","ALEXANDER RIVEROS / VALENTINA PORTILLO","JUAN CARLOS BELTRAN",2017000100104,"FORTALECIMIENTO DE LA CULTURA DE LA GESTIÓN Y UTILIZACIÓN DEL CONOCIMIENTO EN CTEI EN NIÑOS, JÓVENES Y COMUNIDADES DEL DEPARTAMENTO DE CUNDINAMARCA","CTEL",9498967749,7498967749,2000000000,43565,"CONTRATADO EN EJECUCIÓN",0.93269999999999997,0.89470000000000005,null,null,null,null,null,null,null,null,null,null,45217,44607,45124,-617,-100,-7]
[103,"CUNDINAMARCA","UNIDAD ADMINISTRATIVA DE GESTIÓN DEL RIESGO.","DIEGO TORRES/VALENTINA PORTILLO","DAYAN HELENA MOLINA",20172401060022,"ESTUDIOS DETALLADOS PARA LA INCORPORACIÓN DE LA GESTIÓN DEL RIESGO PARA LOS MUNICIPIOS DE GIRARDOT, RICAURTE","AMBIENTE Y DESARROLLO SOSTENIBLE",3084907873,3084907873,0,43802,"CONTRATADO EN EJECUCIÓN",0.20300000000000001,0.20269999999999999,"x",null,null,null,null,null,null,null,null,null,44915,44607,44915,-617,-309,-309]
[104,"CUNDINAMARCA","SECRETARIA DE CIENCIA, TECNOLOGIA E INNOVACIÓN","ALEXANDER RIVEROS / VALENTINA PORTILLO","JUAN CARLOS BELTRAN",20170000100012,"CONFORMACIÓN DE UNA CONVOCATORIA REGIONAL DE PROYECTOS I+D EN FOCOS PRIORIZADOS CTEI PARA EL FORTALECIMIENTO DE LOS GRUPOS DE INVESTIGACIÓN CUNDINAMARCA","CTEL",7586358670.8000002,7375550629.0600004,210808041.73999977,42941,"CONTRATADO EN EJECUCIÓN",0.72089999999999999,0.96760000000000002,null,null,null,null,null,null,null,null,null,null,45217,44972,45187,-252,-37,-7]
[105,"ENTIDAD APORTANTE RECURSOS","CAR","YESID CASTAÑO","CARLOS MURCIA",2017000050063,"RECUPERACIÓN HIDRÁULICA Y AMBIENTAL DEL COMPLEJO LAGUNAR  FÚQUENE","AMBIENTE Y DESARROLLO SOSTENIBLE",18000000000,18000000000,0,43364,"CONTRATADO EN EJECUCIÓN",0.8982,0.64629999999999999,null,null,null,null,null,null,null,null,null,null,45187,44607,45217,-617,-7,-37]
[106,"ENTIDAD APORTANTE RECURSOS","CAR","YESID CASTAÑO","CARLOS MURCIA",2017000050070,"CONSTRUCCIÓN DE OBRAS DE MITIGACIÓN DEL RIESGO POR EVENTOS CLIMÁTICOS EN LA CUENCA DE LA QUEBRADA LA PARROQUIA EN EL CERRO DE FUSACATÁN DEL MUNICIPIO DE  FUSAGASUGÁ, CUNDINAMARCA","AMBIENTE Y DESARROLLO SOSTENIBLE",1976558725,1376558725,600000000,43417,"DESAPROBADO",0,0,"x",null,null,null,null,null,null,null,null,null,null,44607,44607,-617,-617,0]
[107,"ENTIDAD APORTANTE RECURSOS","MUNICIPIO DE UTICA","JUAN CARLOS TORRES","CESAR SIMANCAS",2017000050087,"MEJORAMIENTO DEL SENDERO TURÍSTICO DE LA PROVINCIA DEL GUALIVÁ  – ÚTICA  CUNDINAMARCA","COMERCIO, INDUSTRIA Y TURISMO ",2347004868,2123058880,223945988,43241,"TERMINADO",0.78920000000000001,0.95660000000000001,null,null,null,null,null,null,null,null,null,null,45096,45217,45035,-7,-189,-128]
[108,"CUNDINAMARCA","SECRETARIA DE EDUCACIÓN","ALEXANDER RIVEROS / JEIMY FORERO","PABLO CAJAMARCA",2018000050019,"FORTALECIMIENTO DE LA PERMANENCIA DE LOS ESTUDIANTES EN LOS MUNICIPIOS DEL DEPARTAMENTO DE CUNDINAMARCA, CENTRO ORIENTE 2018 CUNDINAMARCA","EDUCACIÓN",19395559645,19395559645,0,43336,"CERRADO",1,0.66120000000000001,null,null,null,null,null,null,null,null,null,null,null,44607,44607,-617,-617,0]
[109,"DESENTRALIZADOS","ICCU - GESPROY GB","ALEXANDER RIVEROS / JEIMY FORERO","GIOVANY QUEVEDO",2018000050022,"MEJORAMIENTO Y REHABILITACIÓN DE VÍAS SECUNDARIAS EN LA PROVINCIA DE UBATÉ, DEPARTAMENTO DE CUNDINAMARCA","TRANSPORTE",7524876363,7441105086,83771277,43320,"CERRADO",0.98829999999999996,0.97309999999999997,null,null,null,null,null,null,null,null,null,null,44706,44760,44607,-464,-617,-518]
[110,"DESENTRALIZADOS","ICCU - GESPROY GB","ALEXANDER RIVEROS / JEIMY FORERO","GIOVANY QUEVEDO",2018000050024,"MEJORAMIENTO Y REHABILITACIÓN DE LA VÍA LA MARÍA – TOBIA - PASO EL REJO - LA PEÑA, DEPARTAMENTO DE CUNDINAMARCA","TRANSPORTE",9149162991,8983328881,165834110,43417,"CERRADO",0.96450000000000002,0.96089999999999998,null,null,null,null,null,null,null,null,null,null,45035,45187,45035,-37,-189,-189]
[111,"DESENTRALIZADOS","ICCU - GESPROY GB","ALEXANDER RIVEROS / JEIMY FORERO","GIOVANY QUEVEDO",2018000050026,"MEJORAMIENTO DE VÍAS EN LA PROVINCIA DE SUMAPAZ PARA LA CONSOLIDACIÓN DE UNA PAZ ESTABLE Y DURADERA EN EL DEPARTAMENTO DE CUNDINAMARCA","TRANSPORTE",11457047617,11457047617,0,43462,"CONTRATADO EN EJECUCIÓN",0.52569999999999995,0.57879999999999998,"x",null,null,null,null,null,null,null,null,null,44915,44607,44915,-617,-309,-309]
[112,"CUNDINAMARCA","UNIDAD ADMINISTRATIVA DE GESTIÓN DEL RIESGO.","DIEGO TORRES/VALENTINA PORTILLO","DAYAN HELENA MOLINA",2018000050036,"CONSTRUCCIÓN DE OBRAS PARA LA MITIGACIÓN DEL RIESGO EN EL MUNICIPIO DE SAN BERNARDO, BENEFICIANDO A COMUNIDADES DE LOS MUNICIPIOS DE ARBELAEZ, PANDI Y VENECIA CUNDINAMARCA","AMBIENTE Y DESARROLLO SOSTENIBLE",2305788182,2305788182,0,43629,"DESAPROBADO",0,0,null,null,null,null,null,null,null,null,null,null,null,44607,44607,-617,-617,0]
[113,"CUNDINAMARCA","SECRETARIA DE HABITAT Y VIVIENDA","ALEXANDER RIVEROS/JEIMY FORERO","FABIAN BACHILLER",2018000050039,"MEJORAMIENTO DE VIVIENDA RURAL EN LOS MUNICIPIOS DE CUCUNUBÁ, JERUSALEN, QUEBRADANEGRA Y VIOTÁ - DEPARTAMENTO DE CUNDINAMARCA","AGRICULTURA ",4024793625,4024793625,0,43571,"PARA CIERRE",1,1,"x",null,null,null,null,null,null,null,null,null,44760,44760,44671,-464,-553,-464]
[114,"DESENTRALIZADOS","ICCU - GESPROY GB","ALEXANDER RIVEROS / JEIMY FORERO","GIOVANY QUEVEDO",2018000050049,"MEJORAMIENTO DE LA VÍA SESQUILÉ – GUATAVITA - GACHETÁ, DEPARTAMENTO DE CUNDINAMARCA","TRANSPORTE",3997714045,3935792642,61921403,43455,"CERRADO",0.80930000000000002,0.80869999999999997,null,null,null,null,null,null,null,null,null,null,44706,44760,44740,-464,-484,-518]
[115,"DESENTRALIZADOS","ICCU - GESPROY GB","ALEXANDER RIVEROS / JEIMY FORERO","GIOVANY QUEVEDO",2018000050055,"MEJORAMIENTO DE LA TRONCAL DE RIONEGRO, SECTOR LA PALMA CHARCO LARGO PARA LA CONSOLIDACIÓN DE UNA PAZ ESTABLE Y DURADERA EN EL DEPARTAMENTO DE CUNDINAMARCA","TRANSPORTE",17928531277,17928531277,0,43532,"CERRADO",0.95509999999999995,0.92210000000000003,null,null,null,null,null,null,null,null,null,null,null,44740,44607,-484,-617,0]
[116,"DESENTRALIZADOS","ICCU - GESPROY GB","ALEXANDER RIVEROS / JEIMY FORERO","GIOVANY QUEVEDO",2018000050059,"MEJORAMIENTO DE LA VÍA GUSBITA - TIBIRITA DEL DEPARTAMENTO DE CUNDINAMARCA","TRANSPORTE",5500531740,4870657724,629874016,43532,"PARA CIERRE",0.99580000000000002,0.99580000000000002,null,null,null,null,null,null,null,null,null,null,45217,45217,44607,-7,-617,-7]
[117,"CUNDINAMARCA","SECRETARIA DE CIENCIA, TECNOLOGIA E INNOVACIÓN","ALEXANDER RIVEROS / VALENTINA PORTILLO","JUAN CARLOS BELTRAN",2018000100106,"INNOVACIÓN EN EL MODELO DE GESTIÓN DEL MEDICAMENTO FASE III EN EL DEPARTAMENTO DE  CUNDINAMARCA","CTEL",3452890062,3071356262,381533800,43830,"DESAPROBADO",0,0,null,null,null,null,null,null,null,null,null,null,null,44887,44607,-337,-617,0]
[118,"CUNDINAMARCA","SECRETARIA DE CIENCIA, TECNOLOGIA E INNOVACIÓN","ALEXANDER RIVEROS / VALENTINA PORTILLO","JUAN CARLOS BELTRAN",2018000100160,"FORMACIÓN DE CAPITAL HUMANO DE ALTO NIVEL PARA LA INVESTIGACIÓN, EL DESARROLLO TECNOLÓGICO Y LA INNOVACIÓN MAESTRÍAS DE INVESTIGACIÓN PARA DOCENTES DEL DEPARTAMENTO DE CUNDINAMARCA","CTEL",5217415747,3519725709,1697690038,43731,"CONTRATADO EN EJECUCIÓN",0.16969999999999999,0.46289999999999998,null,null,null,null,null,null,null,null,null,null,45217,44607,45217,-617,-7,-7]
[119,"CUNDINAMARCA","SUPERVISIÓN / INTERVENTORÍA -EPC","ALEXANDER RIVEROS/LIYUGETH ALFONSO","PAULA ACUÑA",20181301010555,"CONSTRUCCIÓN DE UNIDADES SANITARIAS EN EL ÁREA RURAL DEL DEPARTAMENTO DE CUNDINAMARCA","VIVIENDA, CIUDAD Y TERRITORIO ",4999900475,4999900475,0,43378,"CONTRATADO EN EJECUCIÓN",0.85780000000000001,0.78310000000000002,"x",null,null,null,null,null,null,null,null,null,44972,44607,45155,-617,-69,-252]
[120,"DESENTRALIZADOS","ICCU - GESPROY GB","ALEXANDER RIVEROS / JEIMY FORERO","GIOVANY QUEVEDO",2019000050002,"MEJORAMIENTO DE LA VÍA DEPARTAMENTAL LA VICTORIA (EL COLEGIO) SAN GABRIEL (VIOTÁ), TRAMO LA VICTORIA ALTO DE LA MULA, DEPARTAMENTO DE CUNDINAMARCA","TRANSPORTE",5745879373,5745879373,0,43532,"CERRADO",0.97219999999999995,0.98519999999999996,null,null,null,null,null,null,null,null,null,null,null,44607,44607,-617,-617,0]
[121,"DESENTRALIZADOS","ICCU - GESPROY GB","ALEXANDER RIVEROS / JEIMY FORERO","GIOVANY QUEVEDO",2019000050003,"MEJORAMIENTO DE LA VÍA CÁQUEZA FOSCA, DEPARTAMENTO DE CUNDINAMARCA","TRANSPORTE",4049029755,4049029755,0,43585,"CERRADO",0.93269999999999997,0.98540000000000005,null,null,null,null,null,null,null,null,null,null,null,44740,44607,-484,-617,0]
[122,"DESENTRALIZADOS","ICCU - GESPROY GB","ALEXANDER RIVEROS / JEIMY FORERO","GIOVANY QUEVEDO",2019000050005,"MEJORAMIENTO DE LA VÍA FÓMEQUE UBAQUE, DEPARTAMENTO DE CUNDINAMARCA","TRANSPORTE",16514204213,14057373703,2456830510,43629,"CERRADO",0.99919999999999998,0.99919999999999998,null,null,null,null,null,null,null,null,null,null,null,44740,44607,-484,-617,0]
[123,"DESENTRALIZADOS","ICCU - GESPROY GB","ALEXANDER RIVEROS / JEIMY FORERO","GIOVANY QUEVEDO",2019000050011,"MEJORAMIENTO DE LA VÍA SUPATÁ - PACHO, DEPARTAMENTO DE CUNDINAMARCA","TRANSPORTE",7339441010,7339441010,0,43585,"CERRADO",0.33489999999999998,0.71899999999999997,"x",null,null,null,null,null,null,null,null,null,null,45217,45217,-7,-7,0]
[124,"DESENTRALIZADOS","ICCU - GESPROY GB","ALEXANDER RIVEROS / JEIMY FORERO","GIOVANY QUEVEDO",2019000050013,"CONSTRUCCIÓN DE LA PLAZA DE MERCADO DEL MUNICIPIO DE CHOACHÍ CUNDINAMARCA","AGRICULTURA ",4481109943.3100004,3152125044,1328984899.3100004,43678,"TERMINADO",1,0.67859999999999998,null,null,null,null,null,null,null,null,null,null,44972,45125,44980,-99,-244,-252]
[125,"DESENTRALIZADOS","ICCU - GESPROY GB","ALEXANDER RIVEROS / JEIMY FORERO","GIOVANY QUEVEDO",2019000050016,"MEJORAMIENTO DE LA VÍA ANOLAIMA CORRALEJAS (INSPECCIÓN DE CORRALEJAS), DEPARTAMENTO DE CUNDINAMARCA","TRANSPORTE",6898362469,5718724028,1179638441,43629,"CERRADO",0.99850000000000005,0.99960000000000004,null,null,null,null,null,null,null,null,null,null,44972,44972,44980,-252,-244,-252]
[126,"CUNDINAMARCA","SECRETARIA DE EDUCACIÓN","ALEXANDER RIVEROS / JEIMY FORERO","PABLO CAJAMARCA",2019000050020,"FORTALECIMIENTO DE LA PERMANENCIA DE LOS ESTUDIANTES PARA EL AÑO 2019 EN LOS MUNICIPIOS DEL DEPARTAMENTO DE CUNDINAMARCA","EDUCACIÓN",20536293937,20536293937,0,43629,"PARA CIERRE",1,0.9103,"x",null,null,null,null,null,null,null,null,null,44972,45217,44980,-7,-244,-252]
[127,"DESENTRALIZADOS","ICCU - GESPROY GB","ALEXANDER RIVEROS / JEIMY FORERO","GIOVANY QUEVEDO",2019000050023,"MEJORAMIENTO DE LA VÍA LENGUAZAQUE - VILLAPINZÓN, DEPARTAMENTO DE CUNDINAMARCA","TRANSPORTE",8636278689,7310087087,1326191602,43629,"CERRADO",1,0.99180000000000001,null,null,null,null,null,null,null,null,null,null,45155,45187,45096,-37,-128,-69]
[128,"CUNDINAMARCA","SECRETARIA DE AGRICULTURA","DIEGO TORRES/ LIYUGETH ALFONSO","RAINER ABUETA",2019000050027," MEJORAMIENTO DE LA COMPETITIVIDAD  DE LA CADENA PRODUCTIVA DE CACAO EN EL DEPARTAMENTO DE CUNDINAMARCA","AGRICULTURA ",5862983962,4397237971,1465745991,43819,"CERRADO",1,1,null,null,null,null,null,null,null,null,null,null,44973,45064,44973,-160,-251,-251]
[129,"DESENTRALIZADOS","ICCU - GESPROY GB","ALEXANDER RIVEROS / JEIMY FORERO","GIOVANY QUEVEDO",2019000050029,"MEJORAMIENTO DE LA VÍA GACHETÁ - GAMA, DEPARTAMENTO DE CUNDINAMARCA","TRANSPORTE",5477582208,5322582208,{"$f":"I131-J131","v":155000000},43629,"TERMINADO",0.95509999999999995,0.9425,null,null,null,null,null,null,null,null,null,null,44973,44671,44973,-553,-251,-251]
[130,"CUNDINAMARCA","SECRETARIA DE SALUD","DAYANA FERNANDEZ / LIYUGETH ALFONSO","OLGA LUCIA GARZON",2019000050036,"ADQUISICIÓN DE AMBULANCIAS PARA EL FORTALECIMIENTO DE LA RED HOSPITALARIA DEL DEPARTAMENTO CUNDINAMARCA","SALUD Y PROTECCIÓN SOCIAL",2385000000,2385000000,{"$f":"I132-J132","v":0},43656,"CERRADO",1,0.82809999999999995,null,null,null,null,null,null,null,null,null,null,null,44607,44607,{"$f":"IF(AA132=0,0,_xlfn.DAYS(AA132,TODAY()))","v":-617},-617,0]
[131,"CUNDINAMARCA","UNIDAD ADMINISTRATIVA DE GESTIÓN DEL RIESGO.","DIEGO TORRES/VALENTINA PORTILLO","DAYAN HELENA MOLINA",2019000050037," FORTALECIMIENTO DEL SISTEMA DEPARTAMENTAL PARA LA GESTIÓN DEL RIESGO DE DESASTRES DEL DEPARTAMENTO DE CUNDINAMARCA","PRESIDENCIA DE LA REPÚBLICA",24666685502,4936307506,19730377996,43748,"DESAPROBADO",0,0,null,null,null,null,null,null,null,null,null,null,null,44607,44607,-617,-617,{"$f":"IF(Z133=0,0,_xlfn.DAYS(Z133,TODAY()))","v":0}]
[132,"ENTIDAD APORTANTE RECURSOS","MEDICINA LEGAL Y CIENCIAS FORENSES","ALEXANDER RIVEROS","MARTIN SEPULVEDA",2019000050025,"ESTUDIOS Y DISEÑOS PARA LA CONSTRUCCIÓN DE LA SEDE DE MEDICINA LEGAL EN EL DEPARTAMENTO DE CUNDINAMARCA","FISCALIA",904521100,904521100,0,43677,"CERRADO",1,1,null,null,null,null,null,null,null,null,null,null,44973,45187,44980,-37,-244,-251]
[133,"CUNDINAMARCA","SECRETARIA DE MINAS, ENERGIA Y GAS","DIEGO TORRES / VALENTINA PORTILLO","MARIA PAULA GONZALEZ",2019000050039," ESTUDIO Y DISEÑO PARA LA CONSTRUCCIÓN DE REDES ELÉCTRICAS AÉREAS EN ZONAS RURALES DEL DEPARTAMENTO DE CUNDINAMARCA","MINAS Y ENERGÍA",1616407501,1616407501,0,43714,"DESAPROBADO",0,0,null,null,null,null,null,null,null,null,null,null,null,44607,44607,-617,-617,0]
[134,"CUNDINAMARCA","SECRETARIA DE EDUCACIÓN","ALEXANDER RIVEROS / JEIMY FORERO","GENNY PADILLA",2019000050044,"FORTALECIMIENTO A LA ESTRATEGIA DE ALIMENTACIÓN ESCOLAR PARA MUNICIPIOS NO CERTIFICADOS, VIGENCIA 2019 DEL DEPARTAMENTO DE CUNDINAMARCA","EDUCACIÓN",18301749135,18301749135,0,43656,"CERRADO",0.2152,0.53269999999999995,null,null,null,null,null,null,null,null,null,null,null,44607,44607,-617,-617,0]
[135,"DESENTRALIZADOS","ICCU - GESPROY GB","ALEXANDER RIVEROS / JEIMY FORERO","GIOVANY QUEVEDO",2019000050047,"MEJORAMIENTO DE LA VÍA SUSA - CARMEN DE CARUPA, DEPARTAMENTO DE CUNDINAMARCA","TRANSPORTE",5203497467.6199999,4131178258,1072319209.6199999,43677,"CERRADO",1,1,null,null,null,null,null,null,null,null,null,null,45035,45187,45035,-37,-189,-189]
[136,"DESENTRALIZADOS","ICCU - GESPROY GB","ALEXANDER RIVEROS / JEIMY FORERO","GIOVANY QUEVEDO",2019000050056,"MEJORAMIENTO DE LA VÍA QUE CONDUCE DEL MUNICIPIO DE NIMAIMA AL MUNICIPIO DE NOCAIMA, DEPARTAMENTO DE CUNDINAMARCA","TRANSPORTE",5082491569.8000002,4614214508,468277061.80000019,43748,"TERMINADO",1,0.87219999999999998,"x",null,null,null,null,null,null,null,null,null,44823,44706,44607,-518,-617,-401]
[137,"DESENTRALIZADOS","IDECUT","DIEGO TORRES / VALENTINA PORTILLO","MARTHA VANEGAS",2019000050059,"FORTALECIMIENTO A LAS ESCUELAS MUNICIPALES DE MÚSICA, DANZA, TEATRO Y ARTES PLÁSTICAS Y VISUALES EN EL DEPARTAMENTO DE CUNDINAMARCA","CULTURA ",1972606058,1972606058,0,43748,"CERRADO",1,0.96099999999999997,null,null,null,null,null,null,null,null,null,null,44915,44973,44706,-251,-518,-309]
[138,"DESENTRALIZADOS","ICCU - GESPROY GB","ALEXANDER RIVEROS / JEIMY FORERO","GIOVANY QUEVEDO",2019000050060,"ESTUDIOS Y DISEÑOS DE VÍAS PARA MEJORAR LA COMPETITIVIDAD DEL DEPARTAMENTO DE CUNDINAMARCA","TRANSPORTE",7089369627,7089369627,0,43714,"CERRADO",0.98650000000000004,0.95530000000000004,null,null,null,null,null,null,null,null,null,null,44973,45187,44980,-37,-244,-251]
[139,"CUNDINAMARCA","SECRETARIA DE MINAS, ENERGIA Y GAS","DIEGO TORRES / VALENTINA PORTILLO","MARIA PAULA GONZALEZ",2019000050073,"AMPLIACIÓN DE LA COBERTURA DEL SERVICIO DE GAS COMBUSTIBLE DOMICILIARIO A TRAVÉS DE LA FINANCIACIÓN DE LA CONEXIÓN Y LA RED INTERNA PARA USUARIOS DE BARRIOS PERIFÉRICOS, VEREDAS Y CENTROS POBLADOS DEL DEPARTAMENTO DE CUNDINAMARCA","MINAS Y ENERGÍA",12461377100,6651376060,5810001040,43805,"PARA CIERRE",0.93589999999999995,0.93589999999999995,null,null,null,null,null,null,null,null,null,null,45096,45096,45096,-128,-128,-128]
[140,"DESENTRALIZADOS","ICCU - GESPROY GB","ALEXANDER RIVEROS / JEIMY FORERO","GIOVANY QUEVEDO",2019000050075,"MEJORAMIENTO DE LA VÍA QUE CONDUCE DEL MUNICIPIO DE VIANI AL MUNICIPIO DE CHAGUANI, (DE LA Y DE SAN VICENTE A CHAGUANI), DEPARTAMENTO DE CUNDINAMARCA","TRANSPORTE",7504443091,7504443091,0,43819,"TERMINADO",1,0.9516,null,null,null,null,null,null,null,null,null,null,44973,44607,44980,-617,-244,-251]
[141,"DESENTRALIZADOS","ICCU - GESPROY GB","ALEXANDER RIVEROS / JEIMY FORERO","GIOVANY QUEVEDO",2019000050079,"MEJORAMIENTO DE LA VÍA SERREZUELA - EL TRIUNFO, MUNICIPIO DE LA CALERA, DEPARTAMENTO DE CUNDINAMARCA","TRANSPORTE",7614258187,7614258187,0,43748,"CERRADO",0.94289999999999996,0.87190000000000001,null,null,null,null,null,null,null,null,null,null,45035,45187,45035,-37,-189,-189]
[142,"DESENTRALIZADOS","ICCU - GESPROY GB","ALEXANDER RIVEROS / JEIMY FORERO","GIOVANY QUEVEDO",2019000050085,"MEJORAMIENTO DE LA VÍA QUE CONDUCE DEL MUNICIPIO DE LA MESA AL MUNICIPIO DE CACHIPAY, (DE LA INSPECCIÓN DE PEÑA NEGRA AL MUNICIPIO DE CACHIPAY), DEPARTAMENTO DE CUNDINAMARCA","TRANSPORTE",7019896083,7019896083,0,43852,"PARA CIERRE",0.71350000000000002,0.6774,null,null,null,null,null,null,null,null,null,null,44973,45155,45004,-69,-220,-251]
[143,"ENTIDAD APORTANTE RECURSOS","TV ANDINA","ALEXANDER RIVEROS","EDWIN",2019000050064,"PROTECCIÓN Y PRESERVACIÓN DEL PATRIMONIO AUDIOVISUAL COLOMBIANO QUE SE ENCUENTRA EN EL CANAL PÚBLICO TEVEANDINA LOCALIZADO EN EL DEPARTAMENTO DE  CUNDINAMARCA","CULTURA ",5923285198,"$ 5.597.840.098",325445100,43774,"CERRADO",1,0.99350000000000005,null,null,null,null,null,null,null,null,null,null,null,44706,44607,-518,-617,0]
[144,"ENTIDAD APORTANTE RECURSOS","UNAD","ALEXANDER RIVEROS","ANDRES ACOSTA",2019000050069,"MEJORAMIENTO DE INFRAESTRUCTURA FÍSICA, DOTACIÓN DE MOBILIARIO Y EQUIPAMIENTO TECNOLÓGICO DE LA UNIVERSIDAD NACIONAL ABIERTA Y A DISTANCIA EN MUNICIPIOS DEL DEPARTAMENTO DE CUNDINAMARCA","EDUCACIÓN",16011115461,16011115461,0,43774,"CERRADO",1,1,null,null,null,null,null,null,null,null,null,null,44760,44823,44607,-401,-617,-464]
[145,"ENTIDAD APORTANTE RECURSOS","U TECNOLOGICA DE PEREIRA","YAHIR ARCINIEGAS","LUIS MANUEL GONZALEZ",2019000100009,"FORMACIÓN DE CAPITAL HUMANO DE ALTO NIVEL UNIVERSIDAD TECNOLÓGICA DE PEREIRA  NACIONAL","CTEL",4360028215,3950208215,409820000,43781,"CONTRATADO EN EJECUCIÓN",0.83120000000000005,0.82589999999999997,null,null,null,null,null,null,null,null,null,null,45217,45001,45217,-223,-7,-7]
[146,"ENTIDAD APORTANTE RECURSOS","U EAN","YAHIR ARCINIEGAS","LUIS MANUEL GONZALEZ",2019000100015,"FORMACIÓN DE CAPITAL HUMANO DE ALTO NIVEL - UNIVERSIDAD EAN -  NACIONAL","CTEL",1294375000,1250000000,44375000,43830,"CONTRATADO EN EJECUCIÓN",0.83179999999999998,0.75839999999999996,null,null,null,null,null,null,null,null,null,null,45217,44635,45217,-589,-7,-7]
[147,"ENTIDAD APORTANTE RECURSOS","U CATOLICA","YAHIR ARCINIEGAS","LUIS MANUEL GONZALEZ",2019000100022,"FORMACIÓN DE CAPITAL HUMANO DE ALTO NIVEL - UNIVERSIDAD CATÓLICA DE COLOMBIA -  NACIONAL","CTEL",343595000,299220000,44375000,43812,"CONTRATADO EN EJECUCIÓN",0.86709999999999998,0.85809999999999997,null,null,null,null,null,null,null,null,null,null,45187,44607,45187,-617,-37,-37]
[148,"ENTIDAD APORTANTE RECURSOS","UNIVERSIDAD MILITAR NUEVA GRANADA","YAHIR ARCINIEGAS","LUIS MANUEL GONZALEZ",2019000100025,"FORMACIÓN DE CAPITAL HUMANO DE ALTO NIVEL UNIVERSIDAD MILITAR NUEVA GRANADA  NACIONAL","CTEL",294375000,250000000,44375000,43812,"CONTRATADO EN EJECUCIÓN",0.79879999999999995,0.73980000000000001,null,null,null,null,null,null,null,null,null,null,45155,44635,45217,-589,-7,-69]
[149,"ENTIDAD APORTANTE RECURSOS","UNIVERSIDAD NACIONAL DE COLOMBIA","YAHIR ARCINIEGAS","LUIS MANUEL GONZALEZ",2019000100026,"FORMACIÓN DE CAPITAL HUMANO DE ALTO NIVEL UNIVERSIDAD NACIONAL DE COLOMBIA   NACIONAL","CTEL",21162064500,20233937500,928127000,43781,"CONTRATADO EN EJECUCIÓN",0.75119999999999998,1.2075,null,null,null,null,null,null,null,null,null,null,45217,45065,45217,-159,-7,-7]
[150,"ENTIDAD APORTANTE RECURSOS","U DISTRITAL","YAHIR ARCINIEGAS","LUIS MANUEL GONZALEZ",2019000100027,"FORMACIÓN DE CAPITAL HUMANO DE ALTO NIVEL EN DOCTORADO PARA EL DESARROLLO REGIONAL, UNIVERSIDAD DISTRITAL FRANCISCO JOSÉ DE CALDAS, A NIVEL  NACIONAL","CTEL",1218668841,1113595753,105073088,43798,"CONTRATADO EN EJECUCIÓN",0.69399999999999995,0.65149999999999997,null,null,null,null,null,null,null,null,null,null,45217,44607,45217,-617,-7,-7]
[151,"ENTIDAD APORTANTE RECURSOS","U JAVERIANA","YAHIR ARCINIEGAS","LUIS MANUEL GONZALEZ",2019000100028,"FORMACIÓN DE CAPITAL HUMANO DE ALTO NIVEL PONTIFICIA UNIVERSIDAD JAVERIANA SEDE CENTRAL  NACIONAL","CTEL",6524500000,6524500000,0,43781,"CONTRATADO EN EJECUCIÓN",0.77790000000000004,0.77239999999999998,null,null,null,null,null,null,null,null,null,null,45187,44607,45187,-617,-37,-37]
[152,"ENTIDAD APORTANTE RECURSOS","U DE LOS ANDES","YAHIR ARCINIEGAS","LUIS MANUEL GONZALEZ",2019000100036,"FORMACIÓN  DE CAPITAL HUMANO DE ALTO NIVEL UNIVERSIDAD DE LOS ANDES   NACIONAL","CTEL",2814671307,2748000000,66671307,43798,"CONTRATADO EN EJECUCIÓN",0.87580000000000002,0.87609999999999999,null,null,null,null,null,null,null,null,null,null,45217,44635,45217,-589,-7,-7]
[153,"ENTIDAD APORTANTE RECURSOS","UNIVERSIDAD NACIONAL DE COLOMBIA","YAHIR ARCINIEGAS","LUIS MANUEL GONZALEZ",2019000100061,"FORTALECIMIENTO DE LA CAPACIDAD TECNOLÓGICA INSTALADA EN EL CENTRO AGROPECUARIO MARENGO PARA LA INVESTIGACIÓN EN LOS SISTEMAS AGROPRODUCTIVOS DEL TRÓPICO ALTO, BAJO EL EFECTO DE LA VARIABILIDAD Y CAMBIO CLIMÁTICO -  CUNDINAMARCA","CTEL",2521388540,1994146760,527241780,43830,"CONTRATADO EN EJECUCIÓN",0.9738,0.80669999999999997,null,null,null,null,null,null,null,null,null,null,45217,44635,45217,-589,-7,-7,null,2019000100061]
[154,"CUNDINAMARCA","SECRETARIA DE CIENCIA, TECNOLOGIA E INNOVACIÓN","ALEXANDER RIVEROS / VALENTINA PORTILLO","JUAN CARLOS BELTRAN",2020000100137,"FORTALECIMIENTO DE LAS CAPACIDADES DE INVESTIGACIÓN Y DESARROLLO PARA ATENDER PROBLEMÁTICAS ASOCIADAS CON AGENTES BIOLÓGICOS PARA LA SALUD PÚBLICA, A TRAVÉS DEL MEJORAMIENTO DEL LABORATORIO DE SALUD PÚBLICA DE CUNDINAMARCA","CTEL",4506359274,4048003426,458355848,43966,"CONTRATADO EN EJECUCIÓN",0.6764,0.61619999999999997,"x",null,null,null,null,null,null,null,null,null,45187,44636,45035,-588,-189,-37,null,2020000100137]
[155,"CUNDINAMARCA","SECRETARIA DE SALUD","DAYANA FERNANDEZ / LIYUGETH ALFONSO","OLGA LUCIA GARZON",2020000050003,"ADQUISICIÓN DE AMBULANCIAS,EQUIPOS BIOMÉDICOS, ELEMENTOS DE PROTECCIÓN PERSONAL, ASEO Y DESINFECCIÓN PARA LA ATENCIÓN DE LA CALAMIDAD SANITARIA POR COVID-19 EN LAS E.S.E DEL DEPARTAMENTO DE   CUNDINAMARCA","SALUD Y PROTECCIÓN SOCIAL",43433295564,43433295564,0,43986,"CERRADO",0.54379999999999995,0.54759999999999998,null,null,null,null,null,null,null,null,null,null,44740,45035,44607,-189,-617,-484,null,2020000050003]
[157,"CUNDINAMARCA","SECRETARIA DE EDUCACIÓN","ALEXANDER RIVEROS / JEIMY FORERO","GENNY PADILLA",2020000050019,"FORTALECIMIENTO A LA ESTRATEGIA DE ALIMENTACIÓN ESCOLAR PARA EL AÑO 2020, EN LOS MUNICIPIOS DEL DEPARTAMENTO DE CUNDINAMARCA ","EDUCACIÓN",26240955000,26240955000,0,44040,"CERRADO",1,0.995,null,null,null,null,null,null,null,null,null,null,null,44607,44607,-617,-617,0,null,2020000050012]
[158,"CUNDINAMARCA","SECRETARIA DE CIENCIA, TECNOLOGIA E INNOVACIÓN","ALEXANDER RIVEROS / VALENTINA PORTILLO","JUAN CARLOS BELTRAN",2020000100266,"GENERACIÓN DE ESPACIOS DE ENCUENTRO DE LA SOCIEDAD CON LA CIENCIA Y LA TECNOLOGÍA - UN VIAJE CON LA CIENCIA EN EL DEPARTAMENTO DE CUNDINAMARCA","CTEL",2241429590,2218862102,22567488,44111,"CONTRATADO EN EJECUCIÓN",0.79879999999999995,0.87839999999999996,null,null,null,null,null,null,null,null,null,null,45155,44760,45217,-464,-7,-69,null,2020000050019]
[159,"CUNDINAMARCA","SECRETARIA DE CIENCIA, TECNOLOGIA E INNOVACIÓN","ALEXANDER RIVEROS / VALENTINA PORTILLO","JUAN CARLOS BELTRAN",2020000100246,"FORTALECIMIENTO DE LA COMPETITIVIDAD DE LA CADENA PRODUCTIVA DE LA GUADUA POR MEDIO DEL DESARROLLO E IMPLEMENTACIÓN DE DOS (2) PAQUETES TECNOLÓGICOS PARA LA GENERACIÓN DE PRODUCTOS CON VALOR AGREGADO EN EL DEPARTAMENTO DE CUNDINAMARCA ","CTEL",3144525520,2294345776,850179744,44111,"CONTRATADO EN EJECUCIÓN",1,0.89849999999999997,null,null,null,null,null,null,null,null,null,null,45125,44607,45125,-617,-99,-99,null,2020000100266]
[160,"ENTIDAD APORTANTE RECURSOS","CONNECT BOGOTA REGIÓN","YAHIR ARCINIEGAS","LUIS MANUEL GONZALEZ",2020000100078,"DISEÑO E IMPLEMENTACIÓN DE UN MODELO DE GESTIÓN DE CONOCIMIENTO, INNOVACIÓN Y TRANSFERENCIA DE TECNOLOGÍA CON APLICACIÓN EN EL SECTOR AGROPECUARIO Y AGROINDUSTRIAL EN EL DEPARTAMENTO DE CUNDINAMARCA ","CTEL",3438832990.73,3028251016.23,410581974.5,44111,"CONTRATADO EN EJECUCIÓN",0.6371,0.67820000000000003,null,null,null,null,null,null,null,null,null,null,45217,44973,45217,-251,-7,-7,null,2020000100246]
[161,"ENTIDAD APORTANTE RECURSOS","FEDERACIÓN NACIONAL DE CAFETEROS","YAHIR ARCINIEGAS","LUIS MANUEL GONZALEZ",2020000100205,"TRASLADO DE TECNOLOGÍAS INNOVADORAS A CAFICULTORES CON IMPACTO SOBRE LA CALIDAD DEL CAFÉ Y LA GESTIÓN DEL RECURSO HÍDRICO DURANTE EL PROCESO DE BENEFICIO EN ZONA CAFETERA DEL DEPARTAMENTO DE CUNDINAMARCA ","CTEL",13783557324,12848931736,934625588,44111,"CONTRATADO EN EJECUCIÓN",0.47,0.39560000000000001,null,null,null,null,null,null,null,null,null,null,45217,44741,45217,-483,-7,-7,null,2020000100078]
[162,"ENTIDAD APORTANTE RECURSOS","AGROSAVIA","YAHIR ARCINIEGAS","LUIS MANUEL GONZALEZ",2020000100197,"DESARROLLO DE BIOPLAGUICIDAS POTENCIADOS DE NUEVA GENERACIÓN PARA EL MEJORAMIENTO DE LA PRODUCTIVIDAD E INOCUIDAD DEL CULTIVO DE TOMATE Y CRUCÍFERAS EN EL DEPARTAMENTO DE CUNDINAMARCA ","CTEL",4583970033,3282745260,1301224773,44111,"CONTRATADO EN EJECUCIÓN",0.48170000000000002,0.47670000000000001,null,null,null,null,null,null,null,null,null,null,45217,44635,45217,-589,-7,-7,null,2020000100205]
[163,"ENTIDAD APORTANTE RECURSOS","UNIVERSIDAD NACIONAL DE COLOMBIA","YAHIR ARCINIEGAS","LUIS MANUEL GONZALEZ",2020000100240,"ESTUDIO DE PREFACTIBILIDAD PARA LA CREACIÓN DE UN CENTRO DE INNOVACIÓN Y DE PRODUCTIVIDAD PARA EL SECTOR AGROPECUARIO DE SABANA OCCIDENTE DE CUNDINAMARCA ","CTEL",1896154229,1707430133,188724096,44111,"PARA CIERRE",1,0.99099999999999999,null,null,null,null,null,null,null,null,null,null,45125,45187,45125,-37,-99,-99,null,2020000100197]
[164,"ENTIDAD APORTANTE RECURSOS","UNIVERSIDAD DE CUNDINAMARCA","YAHIR ARCINIEGAS","LUIS MANUEL GONZALEZ",2020000100158,"FORTALECIMIENTO DE LA INFRAESTRUCTURA FÍSICA Y TECNOLÓGICA DEL CENTRO DE ESTUDIOS AGROAMBIENTALES DE LA UNIVERSIDAD DE CUNDINAMARCA AGROU CUNDINAMARCA ","CTEL",2024433669,1997753509,26680160,44111,"CONTRATADO EN EJECUCIÓN",0.71489999999999998,0.60780000000000001,null,null,null,null,null,null,null,null,null,null,45217,45065,45217,-159,-7,-7,null,2020000100240]
[165,"ENTIDAD APORTANTE RECURSOS","ZIPAQUIRA","YESID CASTAÑO / JEIMY FORERO",null,2020000050013,"Mejoramiento de la vía que comunica a los municipios de Zipaquirá y Tocancipá, tramo barandillas - la fuente, departamento de Cundinamarca","TRANSPORTE","6.788.620.869,00",{"$f":"I166","v":"6.788.620.869,00"},0,44152,"CONTRATADO EN EJECUCIÓN",0.60589999999999999,0.86439999999999995,null,null,null,null,null,null,null,null,null,null,45065,44823,45065,-401,-159,-159,null,2020000100158]
[166,"ENTIDAD APORTANTE RECURSOS","ZIPAQUIRA","YESID CASTAÑO / JEIMY FORERO",null,2020000050015,"MEJORAMIENTO DE LA VÍA ZIPAQUIRÁ - SAN JORGE - TABIO DEPARTAMENTO DE CUNDINAMARCA","TRANSPORTE",7458735075,{"$f":"I167","v":7458735075},0,44152,"CONTRATADO EN EJECUCIÓN",0.52110000000000001,0,null,null,null,null,null,null,null,null,null,null,44973,44635,45217,-589,-7,-251,null,2020000050013]
[167,"CUNDINAMARCA","SECRETARIA DE CIENCIA, TECNOLOGIA E INNOVACIÓN","ALEXANDER RIVEROS / VALENTINA PORTILLO","JUAN CARLOS BELTRAN",2020000100695,"DESARROLLO, TRANSFERENCIA DE TECNOLOGÍA Y CONOCIMIENTO PARA LA INNOVACIÓN QUE FORTALEZCAN CAPACIDADES COMUNITARIAS EN LA COMPRENSIÓN Y/O MITIGACIÓN DE LOS PROBLEMAS DE VIOLENCIAS BASADAS EN GÉNERO, DERIVADAS DE LA EMERGENCIA POR COVID 19, EN CUNDINAMARCA","CTEL",3100000000,3000000000,100000000,44183,"CONTRATADO EN EJECUCIÓN",0.74109999999999998,0.9204,null,null,null,null,null,null,null,null,null,null,45159,44740,45187,-484,-37,-65,null,2020000050015]
[168,"CUNDINAMARCA","SECRETARIA DE CIENCIA, TECNOLOGIA E INNOVACIÓN","ALEXANDER RIVEROS / VALENTINA PORTILLO","JUAN CARLOS BELTRAN",2020000100650,"FORTALECIMIENTO DE CAPACIDADES DE CTEI PARALA INNOVACION EDUCATIVA EN LOS NIVELES DE BÁSICA Y\nMEDIA, MEDIANTE USO DE TICS EN INSTITUCIONES EDUCATIVAS OFICIALES DE LOS MUNICIPIOS NO\nCERTIFICADOS DEL DEPARTAMENTO DE CUNDINAMARCA","CTEL",10804663122,9999728696,804934426,44183,"CONTRATADO EN EJECUCIÓN",0.36020000000000002,0.25559999999999999,null,null,null,null,null,null,null,null,null,null,45217,44607,45217,-617,-7,-7,null,2020000100695]
[169,"CUNDINAMARCA","SECRETARIA DE CIENCIA, TECNOLOGIA E INNOVACIÓN","ALEXANDER RIVEROS / VALENTINA PORTILLO","JUAN CARLOS BELTRAN",2020000100696,"FORTALECIMIENTO DE CAPACIDADES DE CTEI PARA LA REACTIVACIÓN ECONÓMICA Y LA TRANSFORMACIÓN\nPRODUCTIVA EN CUNDINAMARCA","CTEL",7370634083,6974290175,396343908,44183,"CONTRATADO EN EJECUCIÓN",0.9395,0.95660000000000001,null,null,null,null,null,null,null,null,null,null,45217,44635,45217,-589,-7,-7]
[170,"CUNDINAMARCA","SECRETARIA DE CIENCIA, TECNOLOGIA E INNOVACIÓN","ALEXANDER RIVEROS / VALENTINA PORTILLO","JUAN CARLOS BELTRAN",2020000100649,"FORTALECIMIENTO DE CAPACIDADES DE CTeI PARA EL RELACIONAMIENTO ESCUELA - CONTEXTO RURAL MEDIANTE LA APROPIACIÓN Y USO DE LAS TIC EN EL MUNICIPIO DE SIBATÉ, DEPARTAMENTO DE CUNDINAMARCA","CTEL",4292464018,2645464018,1647000000,44183,"CONTRATADO EN EJECUCIÓN",0.97219999999999995,0.80100000000000005,null,null,null,null,null,null,null,null,null,null,45217,44607,45217,-617,-7,-7,null,2020000100696]
[171,"ENTIDAD APORTANTE RECURSOS","FUNDACION UNIVERSIDAD DEL VALLE","YAHIR ARCINIEGAS","JOSE MARIA LEITON",2020000050044,"FORTALECIMIENTO DE LAS COMPETENCIAS COMUNICATIVAS EN INGLÉS DE LOS ESTUDIANTES DE LOS ESTABLECIMIENTOS EDUCATIVOS OFICIALES DEL DEPARTAMENTO CUNDINAMARCA","EDUCACIÓN",15011999229,14954799229,57200000,44195,"TERMINADO",1,0.95179999999999998,null,null,null,null,null,null,null,null,null,null,45217,45187,45187,-37,-37,-7,null,2020000100649]
[172,"ENTIDAD APORTANTE RECURSOS","UNAD","YAHIR ARCINIEGAS","LUIS MANUEL GONZALEZ",2020000100433,"Investigación de los compuestos volátiles orgánicos e inducidos para el manejo de moscas plagas en gulupa y granadilla en el departamento de  Cundinamarca","CTEL",3412874201,1999985660,{"$f":"I173-J173","v":1412888541},44159,"CONTRATADO EN EJECUCIÓN",0.72460000000000002,0.78069999999999995,null,null,null,null,null,null,null,null,null,null,45217,44635,45217,-589,-7,-7]
[173,"ENTIDAD APORTANTE RECURSOS","UNIVERSIDAD INDUSTRIAL DE SANTANDER","YAHIR ARCINIEGAS","LUIS MANUEL GONZALEZ",2020000100415,"Desarrollo de un sistema óptico  computacional para estimar el contenido de carbono orgánico de suelos agrícolas a través de imágenes espectrales e inteligencia artificial en cultivos de cítricos de   Santander","CTEL",2184125885.29,1972224989.29,211900896,44159,"CONTRATADO EN EJECUCIÓN",0.89739999999999998,0.82050000000000001,null,null,null,null,null,null,null,null,null,null,45217,44973,45217,-251,-7,-7]
[174,"ENTIDAD APORTANTE RECURSOS","UNIVERSIDAD INDUSTRIAL DE SANTANDER","YAHIR ARCINIEGAS","LUIS MANUEL GONZALEZ",2020000100375,"Conformación de una plataforma para estudios celulares avanzados in vivo en tiempo real para el análisis de la respuesta inmunometabólica ante la reexpresión de interferón tipo I kappa en esferoides de células tumorales de cuello uterino en  Santander","CTEL",3123997801,1998887911,1125109890,44159,"CONTRATADO EN EJECUCIÓN",0.84119999999999995,0.85240000000000005,null,null,null,null,null,null,null,null,null,null,45217,44635,45217,-589,-7,-7]
[175,"ENTIDAD APORTANTE RECURSOS","UNIVERSIDAD INDUSTRIAL DE SANTANDER","YAHIR ARCINIEGAS","LUIS MANUEL GONZALEZ",2020000100351,"Desarrollo de un prototipo selectivo y sensible para monitorear contenido de cadmio in situ en diversas matrices asociadas a la producción de granos de cacao en el departamento de  Santander","CTEL",2585800000,2000000000,585800000,44159,"CONTRATADO EN EJECUCIÓN",1,0.99909999999999999,null,null,null,null,null,null,null,null,null,null,45187,44635,45066,-589,-158,-37]
[176,"ENTIDAD APORTANTE RECURSOS","INSTITUTO SUPERIOR DE EDUCACION RURAL DE PAMPLONA","YAHIR ARCINIEGAS","LUIS MANUEL GONZALEZ",2020000100343,"Implementación laboratorio de calidad fisicoquímica de alimentos para el fortalecimiento competitivo y sostenible de lascadenas agroalimentarias del departamento de  Norte de Santander","CTEL",1097306327,999999999,97306328,44159,"CONTRATADO EN EJECUCIÓN",0.34179999999999999,0.33900000000000002,null,null,null,null,null,null,null,null,null,null,45217,44607,45217,-617,-7,-7,null,2020000100351]
[177,"ENTIDAD APORTANTE RECURSOS","UNIVERSIDAD NACIONAL DE COLOMBIA","YAHIR ARCINIEGAS","LUIS MANUEL GONZALEZ",2020000100342,"Estudio de potenciales insecticidas en matrices poliméricas para el control de plagas de granos almacenados basados en aceites esenciales provenientes de la biodiversidadflorística del departamento de  Cundinamarca","CTEL",2748237104,2000000000,748237104,44159,"CONTRATADO EN EJECUCIÓN",0.55420000000000003,0.68700000000000006,null,null,null,null,null,null,null,null,null,null,45217,44760,45217,-464,-7,-7,null,2020000100343]
[178,"ENTIDAD APORTANTE RECURSOS","UNIVERSIDAD MILITAR NUEVA GRANADA","YAHIR ARCINIEGAS","LUIS MANUEL GONZALEZ",2020000100728,"Generación y transferencia de conocimientos y tecnologías para elevar capacidades de CTel de pequeños productores de tomate para afrontar problemas derivados del COVID-19 asociadas a la Seg. Alimentaria en las Sab. Centro y Oriente  Cundinamarca","CTEL",4162541452,2123613452,2038928000,44183,"CONTRATADO EN EJECUCIÓN",0.84230000000000005,0.86550000000000005,null,null,null,null,null,null,null,null,null,null,45187,44635,45217,-589,-7,-37]
[179,"ENTIDAD APORTANTE RECURSOS","UNIVERSIDAD NACIONAL DE COLOMBIA","YAHIR ARCINIEGAS","LUIS MANUEL GONZALEZ",2020000100339,"Desarrollo de Nuevos Métodos No Destructivos para Monitoreo In Situ de Probabilidad de Ocurrencia de Falla en Tuberías en el Sector de Hidrocarburos en los Departamentos de  Bogotá Boyacá Santander","CTEL",2412084140,1999876300,412207840,44159,"CONTRATADO EN EJECUCIÓN",0.58550000000000002,0.79730000000000001,null,null,null,null,null,null,null,null,null,null,45217,44635,45126,-589,-98,-7]
[180,"ENTIDAD APORTANTE RECURSOS","UNIVERSIDAD MILITAR NUEVA GRANADA","YAHIR ARCINIEGAS","LUIS MANUEL GONZALEZ",2020000100216,"Innovación y transferencia tecnológica de UMNGBIO a productores de flores para el control biológico de Tetranychus urticae (Acari: Tetranychiidae) en cultivos de invernadero con el ácaro benéfico Neoseiulus californicus (Acari: Phytoseiidae)  Cundinamarca","CTEL",2431580000,1241580000,1190000000,44159,"CONTRATADO EN EJECUCIÓN",0.79220000000000002,0.80179999999999996,null,null,null,null,null,null,null,null,null,null,45187,44607,45217,-617,-7,-37,null,2020000100339]
[181,"CUNDINAMARCA","SECRETARIA DE COMPETITIVIDAD","ALEXANDER RIVEROS/JEIMY FORERO","FABIAN CUESTA",2019000050026,"Desarrollo de un programa productivo, amigable con el medio ambiente del sector ganadero en el Departamento de Cundinamarca Cundinamarca","AGRICULTURA ",11567711442,8302543371,3265168071,44187,"CONTRATADO EN EJECUCIÓN",0.91910000000000003,0.92469999999999997,null,null,null,null,null,null,null,null,null,null,45217,44635,45217,-589,-7,-7]
[182,"ENTIDAD APORTANTE RECURSOS","UNIVERSIDAD NACIONAL DE COLOMBIA","YAHIR ARCINIEGAS","LUIS MANUEL GONZALEZ",2020000100169,"Investigación Desarrollo, innovación y transferencia de conocimiento para el procesamiento de la semilla de Sacha Inchi en productos de valor agregado, como estrategia para mejorar la productividad del sector agroindustrial de la Región  Cundinamarca","CTEL",2757697312,1997700000.0999999,759997311.9000001,44078,"CONTRATADO EN EJECUCIÓN",0.85389999999999999,0.6159,null,null,null,null,null,null,null,null,null,null,45217,44973,45217,-251,-7,-7,null,2019000050026]
[183,"ENTIDAD APORTANTE RECURSOS","UPTC","YAHIR ARCINIEGAS","LUIS MANUEL GONZALEZ",2020000100114,"Fortalecimiento del ecosistema de investigación científica para CTeI en la universidad pedagógica y tecnológica de Colombia UPTC, I-SPACIO  Sogamoso","CTEL",2312299017.4499998,1967031046.1500001,345267971.29999971,44078,"CONTRATADO EN EJECUCIÓN",0.93069999999999997,0.89910000000000001,null,null,null,null,null,null,null,null,null,null,45187,44740,45217,-484,-7,-37]
[184,"ENTIDAD APORTANTE RECURSOS","UNIVERSIDAD DE ANTIOQUIA","YAHIR ARCINIEGAS","LUIS MANUEL GONZALEZ",2020000100079,"Fortalecimiento de la infraestructura tecnológica y equipamiento del ambiente de formación industrial para el aumento de las capacidades institucionales en CTeI de la ETITC  Bogotá","CTEL",1090608306,998808306,91800000,44078,"TERMINADO",1,0.99209999999999998,null,null,null,null,null,null,null,null,null,null,45187,45159,45159,-65,-65,-37]
[185,"ENTIDAD APORTANTE RECURSOS","UNIVERSIDAD NACIONAL DE COLOMBIA","YAHIR ARCINIEGAS","LUIS MANUEL GONZALEZ",2020000100075,"Aprovechamiento de la biodiversidad en agraz y papa para el desarrollo de cultivos promisorios en el departamento de   Santander","CTEL",3177259696,2000000000,1177259696,44078,"CONTRATADO EN EJECUCIÓN",0.31950000000000001,0.42459999999999998,null,null,null,null,null,null,null,null,null,null,45187,44635,45217,-589,-7,-37]
[186,"ENTIDAD APORTANTE RECURSOS","UNIVERSIDAD NACIONAL DE COLOMBIA","YAHIR ARCINIEGAS","LUIS MANUEL GONZALEZ",2020000100019,"Fortalecimiento de capacidades de investigación y desarrollo tecnológico de la Universidad Colegio Mayor de Cundinamarca a partir de tecnologías industria 4.0 para el diseño y construcción en   Bogotá","CTEL",2077571214,1930000000,147571214,44078,"PARA CIERRE",1,0.99390000000000001,null,null,null,null,null,null,null,null,null,null,45187,45187,45159,-37,-65,-37,null,2020000100075]
[187,"ENTIDAD APORTANTE RECURSOS","UNIVERSIDAD INDUSTRIAL DE SANTANDER","YAHIR ARCINIEGAS","LUIS MANUEL GONZALEZ",2020000100017,"Fortalecimiento DE LA CAPACIDAD INSTITUCIONAL DE INVESTIGACIÓN DE LA UNIVERSIDAD INDUSTRIAL DESANTANDER  Nacional","CTEL",2808520000,2000000000,808520000,44078,"CONTRATADO EN EJECUCIÓN",0.37480000000000002,0.3886,null,null,null,null,null,null,null,null,null,null,45217,44607,45217,-617,-7,-7,null,2020000100019]
[188,"ENTIDAD APORTANTE RECURSOS","UNIVERSIDAD MILITAR NUEVA GRANADA","YAHIR ARCINIEGAS","LUIS MANUEL GONZALEZ",2020000100103,"Fortalecimiento de capacidades instaladas de Ciencia y Tecnología del Laboratorio de Diagnóstico en el Campus de la Univ Militar Nueva Granada, para atender problemáticas asociadas con agentes biológicos de alto riesgo para la salud humana,  Cundinamarca","CTEL",5715742977,4168513565,1547229412,43966,"CONTRATADO EN EJECUCIÓN",0.59179999999999999,0.76139999999999997,null,null,null,null,null,null,null,null,null,null,45159,44607,45159,-617,-65,-65,null,2020000100017]
[189,"ENTIDAD APORTANTE RECURSOS","INSTITUTO UNIVERSITARIO DE LA PAZ – UNIPAZ","YAHIR ARCINIEGAS","LUIS MANUEL GONZALEZ",2020000100042,"Fortalecimiento de los procesos académicos en los programas ofrecidos por el Instituto Universitario de la Paz, UNIPAZ,   Barrancabermeja","CTEL",1178749590,996109590,182640000,43998,"PARA CIERRE",1,0.98870000000000002,null,null,null,null,null,null,null,null,null,null,45066,45187,45066,-37,-158,-158]
[190,"ENTIDAD APORTANTE RECURSOS","INSTITUTO UNIVERSITARIO DE LA PAZ – UNIPAZ","YAHIR ARCINIEGAS","LUIS MANUEL GONZALEZ",2020000100016,"Adecuación , DOTACIÓN E IMPLEMENTACIÓN DE UN LABORATORIO DE FABRICACIÓN DIGITAL PARA PROMOVER EL DESARROLLO DE LA CIENCIA, LAINNOVACIÓN Y EL EMPRENDIMIENTO EN LA UNIVERSIDAD FRANCISCO DE PAULA SANTANDER.  Cúcuta","CTEL",2921057589.04,1946843702.04,974213887,43950,"CERRADO",1,0.99470000000000003,null,null,null,null,null,null,null,null,null,null,45126,45159,45126,-65,-98,-98]
[191,"ENTIDAD APORTANTE RECURSOS","UNIVERSIDAD TECNOLOGICA DE SANTANDER","YAHIR ARCINIEGAS","LUIS MANUEL GONZALEZ",2020000100004,"Fortalecimiento y adecuación de equipos e infraestructura del Laboratorio de física del Departamento de Ciencias Básicas, para el mejoramiento de las capacidades institucionales y la investigación en las Unidades Tecnológicas de Santander -  Bucaramanga","CTEL",1511504755,980000000,531504755,43950,"CONTRATADO EN EJECUCIÓN",0.1719,0.15579999999999999,null,null,null,null,null,null,null,null,null,null,44973,44973,44973,-251,-251,-251]
[192,"CUNDINAMARCA","SECRETARIA DE EDUCACIÓN","ALEXANDER RIVEROS / JEIMY FORERO","GENNY PADILLA",2020000050037,"Dotación del mobiliario escolar para las instituciones educativas de los municipios no certificados del Departamento de Cundinamarca","EDUCACIÓN",10093038848,10093038848,0,44195,"CERRADO",1,0.84530000000000005,null,null,null,null,null,null,null,null,null,null,45005,44635,45005,-589,-219,-219]
[193,"ENTIDAD APORTANTE RECURSOS","UNIVERSIDAD DEL NORTE","YAHIR ARCINIEGAS","LUIS MANUEL GONZALEZ",2020000100287,"Formación de Capital Humano de Alto Nivel Universidad del Norte 2do Corte Nacional","CTEL",6920233499,6750000000,170233499,44330,"CONTRATADO EN EJECUCIÓN",0.43,0.4919,null,null,null,null,null,null,null,null,null,null,45187,45005,45217,-219,-7,-37,null,2020000050037]
[194,"ENTIDAD APORTANTE RECURSOS","UNIVERSIDAD DEL VALLE","YAHIR ARCINIEGAS","LUIS MANUEL GONZALEZ",2020000100345,"Formación de capital humano de alto Nivel segundo Corte Universidad del Valle Nacional","CTEL",5913070114,5335769261,577300853,44348,"CONTRATADO EN EJECUCIÓN",0.49320000000000003,0.49299999999999999,null,null,null,null,null,null,null,null,null,null,45217,45126,45217,-98,-7,-7,null,2020000100287]
[195,"ENTIDAD APORTANTE RECURSOS","UNIVERSIDAD NACIONAL DE COLOMBIA","YAHIR ARCINIEGAS","LUIS MANUEL GONZALEZ",2021000100003,"Formación de Capital Humano de Alto Nivel Universidad  Nacional de Colombia Corte II Nacionl","CTEL",18418143500,17635937500,{"$f":"I196-J196","v":782206000},44330,"CONTRATADO EN EJECUCIÓN",0.48399999999999999,0.51600000000000001,null,null,null,null,null,null,null,null,null,null,45217,44635,45217,{"$f":"IF(AA196=0,0,_xlfn.DAYS(AA196,TODAY()))","v":-589},-7,-7]
[196,"ENTIDAD APORTANTE RECURSOS","UNIVERSIDAD DE LA SABANA","YAHIR ARCINIEGAS","LUIS MANUEL GONZALEZ",2021000100004,"Formación de Capital Humano de Alto Nivel Universidad de La Sabana Core 2 Nacional","CTEL",1519950000,1309600000,210350000,44348,"CONTRATADO EN EJECUCIÓN",0.63009999999999999,0.83150000000000002,null,null,null,null,null,null,null,null,null,null,45187,44607,45217,-617,-7,{"$f":"IF(Z197=0,0,_xlfn.DAYS(Z197,TODAY()))","v":-37},null,2021000100003]
[197,"ENTIDAD APORTANTE RECURSOS","UNIVERSIDAD ANTONIO NARIÑO","YAHIR ARCINIEGAS","LUIS MANUEL GONZALEZ",2021000100014,"Formación de Capital Humano de Alto Nivel Universidad Antonio Nariño Core 2 Nacional","CTEL",4526652200,4250000000,276652200,44348,"CONTRATADO EN EJECUCIÓN",0.37219999999999998,0.26700000000000002,null,null,null,null,null,null,null,null,null,null,45187,44635,45217,-589,-7,-37]
[198,"ENTIDAD APORTANTE RECURSOS","UNIVERSIDAD EAN","YAHIR ARCINIEGAS","LUIS MANUEL GONZALEZ",2021000100025,"Formación DE CAPITAL HUMANO DE ALTO NIVEL UNIVERSIDAD EAN NACIONAL COHORTE II Nacional","CTEL",2044506416,1750000000,294506416,44368,"CONTRATADO EN EJECUCIÓN",0.54700000000000004,0.46839999999999998,"x",null,null,null,null,null,null,null,null,null,45159,44607,45159,-617,-65,-65,null,2021000100014]
[199,"ENTIDAD APORTANTE RECURSOS","UNIVERSIDAD MILITAR NUEVA GRANADA","YAHIR ARCINIEGAS","LUIS MANUEL GONZALEZ",2021000100026,"Formación de Capital Humano de Alto Nivel Universidad Militar Nueva Granada Segundo Corte Nacional","CTEL",751632481,650602304,101030177,44348,"CONTRATADO EN EJECUCIÓN",0.49759999999999999,0.42959999999999998,null,null,null,null,null,null,null,null,null,null,45097,44635,45217,-589,-7,-127]
[200,"ENTIDAD APORTANTE RECURSOS","PONIFICA UNIVERSIDAD JAVERIANA","YAHIR ARCINIEGAS","LUIS MANUEL GONZALEZ",2021000100027,"Formación de Capital Humano de Alto Nivel Pontificia Universidad Javeriana Sede Bogotá Corte II Nacional","CTEL",8577491761,7246312500,1331179261,44348,"CONTRATADO EN EJECUCIÓN",0.49580000000000002,0.46579999999999999,null,null,null,null,null,null,null,null,null,null,45187,44607,45217,-617,-7,-37,null,2021000100026]
[201,"ENTIDAD APORTANTE RECURSOS","UNIVERSIDAD DE CALDAS","YAHIR ARCINIEGAS","LUIS MANUEL GONZALEZ",2021000100028,"Formación de capital humano de alto nivel Corte 2 Universidad de Caldas - Nacional","CTEL",6358000000,6000000000,358000000,44348,"CONTRATADO EN EJECUCIÓN",0.57850000000000001,0.56910000000000005,null,null,null,null,null,null,null,null,null,null,45217,44607,45217,-617,-7,-7,null,2021000100027]
[202,"CUNDINAMARCA","SECRETARIA DE EDUCACIÓN","ALEXANDER RIVEROS / JEIMY FORERO","GENNY PADILLA",2021004250258,"Fortalecimiento a la Estrategia de Alimentación Escolar para el año 2021 en los municipios del Departamento de Cundinamarca","EDUCACIÓN",16289941201,16289941201,0,44432,"CERRADO",1,0.66559999999999997,null,null,null,null,null,null,null,null,null,null,45066,45187,45066,-37,-158,-158,null,2021000100028]
[203,"CUNDINAMARCA","SECRETARIA DE HABITAT Y VIVIENDA","ALEXANDER RIVEROS/JEIMY FORERO","FABIAN BACHILLER",2018000050050,"Mejoramiento vivienda rural mediante construcción de cocinas habitaciones y pisos en los municipios de Cundinamarca","AGRICULTURA ",5616585397,5616585397,0,44525,"CONTRATADO EN EJECUCIÓN",0.3483,4.4999999999999997E-3,null,null,null,null,null,null,null,null,null,null,45097,44973,45217,-251,-7,-127]
[204,"CUNDINAMARCA","SECRETARIA DE COMPETITIVIDAD","ALEXANDER RIVEROS/JEIMY FORERO","FABIAN CUESTA",2020000050035,"Fortalecimiento de los sistemas productivos a través de la reactivación del sector agrícola en el Departamento de Cundinamarca","AGRICULTURA ",9997098068,9997098068,0,44529,"CONTRATADO EN EJECUCIÓN",0,0,null,null,null,null,null,null,null,null,null,null,null,45217,45066,{"$f":"IF(AA205=0,0,_xlfn.DAYS(AA205,TODAY()))","v":-7},-158,0,null,2018000050050]
["205","CUNDINAMARCA","SECRETARIA DE MINAS, ENERGIA Y GAS","DIEGO TORRES / VALENTINA PORTILLO","MARIA PAULA GONZALEZ",2021004250686,"Construcción Del Centro De Formación E Innovación Minero Energético De Cundinamarca","GOBIERNO TERRITORIAL","$ 13.770.893.382,00","$ 6.928.967.103,00",6841926279,44561,"CONTRATADO EN EJECUCIÓN",8.1900000000000001E-2,1.4500000000000001E-2,null,null,null,null,null,null,null,null,null,null,45097,45020,45159,-204,-65,-127,null,2020000050035]
[206,"CUNDINAMARCA","UNIDAD ADMINISTRATIVA DE GESTIÓN DEL RIESGO.","DIEGO TORRES/VALENTINA PORTILLO","DAYAN HELENA MOLINA",2021004250690,"Fortalecimiento del sistema automotor para la gestión del riesgo de desastres del departamento de Cundinamarca","GOBIERNO TERRITORIAL",7299514100,7299514100,0,44547,"PARA CIERRE",1,0.93810000000000004,null,null,null,null,null,null,null,null,null,null,45005,45187,45005,-37,-219,-219,null,"2021004250686"]
[207,"CUNDINAMARCA","SECRETARIA DE COMPETITIVIDAD","ALEXANDER RIVEROS/JEIMY FORERO","FABIAN CUESTA",2020000050038,"Optimización de los sistemas Ganaderos bovinos de carne leche y doble propósito a partir de la implementación de mejoramiento genético productivo y entrega de maquinaria y equipos en municipios del Departamento de Cundinamarca","AGRICULTURA ",9732446243,9732446243,0,44561,"CONTRATADO EN EJECUCIÓN",2.0000000000000001E-4,0,null,null,null,null,null,null,null,null,null,null,45217,45217,45217,-7,-7,-7,null,2021004250690]
[208,"CUNDINAMARCA","SECRETARIA DE CIENCIA, TECNOLOGIA E INNOVACIÓN","ALEXANDER RIVEROS / VALENTINA PORTILLO","JUAN CARLOS BELTRAN",2021000100327,"Desarrollo de un sistema de producción lechero para la obtención de leches inocuas de alta calidad y con un perfil lipídico saludable en el Departamento de Cundinamarca","CTEL",3833042862,3044082702,788960160,44617,"CONTRATADO EN EJECUCIÓN",0.10979999999999999,0.24879999999999999,null,null,null,null,null,null,null,null,null,null,45217,44973,45217,-251,-7,-7,null,2020000050038]
[209,"CUNDINAMARCA","SECRETARIA DE CIENCIA, TECNOLOGIA E INNOVACIÓN","ALEXANDER RIVEROS / VALENTINA PORTILLO","JUAN CARLOS BELTRAN",2021000100208,"Fortalecimiento de los niveles de Apropiación social del Conocimiento de la CTeI en comunidades de las provincias de Almeidas y Ubaté del Departamento de Cundinamarca","CTEL",2191964751,1839764876,352199875,44615,"CONTRATADO EN EJECUCIÓN",0.94569999999999999,0.78510000000000002,null,null,null,null,null,null,null,null,null,null,45217,45035,45217,-189,-7,-7]
[210,"CUNDINAMARCA","SECRETARIA DE CIENCIA, TECNOLOGIA E INNOVACIÓN","ALEXANDER RIVEROS / VALENTINA PORTILLO","JUAN CARLOS BELTRAN",2021000100243,"Desarrollo participativo de una plataforma tecnológica de teledetección para la gestión sostenible de suelos en agroecosistemas del Departamento de Cundinamarca","CTEL",3042693625,2332094728,710598897,44617,"CONTRATADO EN EJECUCIÓN",0.29170000000000001,0.31119999999999998,null,null,null,null,null,null,null,null,null,null,45187,44974,45217,-250,-7,-37]
[211,"CUNDINAMARCA","SECRETARIA DE MINAS, ENERGIA Y GAS","DIEGO TORRES / VALENTINA PORTILLO","MARIA PAULA GONZALEZ",2021000050019,"Ampliación DE LA COBERTURA DEL SERVICIO DE GAS COMBUTIBLE POR REDES A TRAVES DE LA FINANCIACIÓN DEL CARGO POR CONEXIÓN Y LA RED INTERNA PARA USUARIOS DE BARRIOS PERIFÉRICOS VEREDAS Y CENTROS POBLADOS DE LOS MUNICIPIOS DE Cundinamarca","MINAS Y ENERGÍA",10613927436,6059727436,4554200000,44700,"CONTRATADO EN EJECUCIÓN",0.2341,0.21110000000000001,null,null,null,null,null,null,null,null,null,null,45187,44974,45159,-250,-65,-37]
[212,"CUNDINAMARCA","SECRETARIA DE EDUCACIÓN","ALEXANDER RIVEROS / JEIMY FORERO","GENNY PADILLA",2022000050007,"Fortalecimiento a la Estrategia de Alimentación Escolar en los municipios no certificados del Departamento de Cundinamarca para la vigencia 2022 Cundinamarca\t","EDUCACIÓN",42966037310,42966037310,0,44700,"TERMINADO",1,0.73550000000000004,null,null,null,null,null,null,null,null,null,null,45159,45217,45217,-7,-7,-65]
[213,"CUNDINAMARCA","SECRETARIA DE CIENCIA, TECNOLOGIA E INNOVACIÓN","ALEXANDER RIVEROS / VALENTINA PORTILLO","JUAN CARLOS BELTRAN",2021000100467,"Fortalecimiento de las capacidades institucionales para el desarrollo y gestión del Ecosistema Territorial de CTeI en todas las provincias del Departamento de Cundinamarca\n","CTEL",2801037429,2299692877,501344552,44664,"CONTRATADO EN EJECUCIÓN",0.46339999999999998,3.8699999999999998E-2,null,null,null,null,null,null,null,null,null,null,45187,44974,45190,-250,-34,-37]
[214,"CUNDINAMARCA","SECRETARIA DE CIENCIA, TECNOLOGIA E INNOVACIÓN","ALEXANDER RIVEROS / VALENTINA PORTILLO","JUAN CARLOS BELTRAN",2021000100276,"Desarrollo DE UN MODELO DE PROMOCIÓN TURÍSTICA SOSTENIBLE DESDE LA TECNOLOGÍA 4.0 EN LOS MUNICIPIOS DE LA PALMA Y YACOPI EN EL DEPARTAMENTO DE Cundinamarca\n","CTEL",2608055295,2401327735,206727560,44637,"CONTRATADO EN EJECUCIÓN",0.42759999999999998,0.28820000000000001,null,null,null,1,"Hoy o menos de un mes desde que se modifico",null,null,null,null,null,45217,45005,45217,-219,-7,-7]
[215,"CUNDINAMARCA","SECRETARIA DE CIENCIA, TECNOLOGIA E INNOVACIÓN","ALEXANDER RIVEROS / VALENTINA PORTILLO","JUAN CARLOS BELTRAN",2021000100523,"Desarrollo de Microredes y almacenamiento (ESS) prestadores de servicios complementarios para incrementar la cobertura eficiencia y confiabilidad del servicio en el departamento de Cundinamarca\n","CTEL",3942973233,3296088001,646885232,44685,"CONTRATADO EN EJECUCIÓN",9.2999999999999999E-2,3.9800000000000002E-2,null,null,null,1,"1 mes desde que no se modifica",null,null,null,null,null,45217,44915,45217,-309,-7,-7]
[216,"CUNDINAMARCA","SECRETARIA DE EDUCACIÓN","ALEXANDER RIVEROS / JEIMY FORERO","GENNY PADILLA",2022004250011,"Fortalecimiento a la Estrategia de subsidio de Transporte Escolar en municipios no certificados del Departamento de Cundinamarca para la vigencia 2022 Cundinamarca","EDUCACIÓN",24666685502,24666685502,0,44722,"CONTRATADO EN EJECUCIÓN",0.96140000000000003,0.99009999999999998,null,null,null,null,"2meses desde que no se modifica",null,null,null,null,null,45217,44974,45217,-250,-7,-7]
[217,"ENTIDAD APORTANTE RECURSOS","EMTEL","ALEXANDER RIVEROS/JEIMY FORERO","FABIAN CUESTA",2022004250006,"Implementación de una estrategia de reactivación económica para el progreso y la competitividad de micronegocios y unidades productivas en el Departamento de Cundinamarca","COMERCIO, INDUSTRIA Y TURISMO",16921563805,16921563805,0,44707,"CONTRATADO EN EJECUCIÓN",0.6956,0.79169999999999996,null,null,null,0.01,"3 meses desde que no se modifica",null,null,null,null,null,45187,44793,45217,-431,-7,-37]
[218,"CUNDINAMARCA","SECRETARIA DE AMBIENTE","ALEXANDER RIVEROS /  LIYUGETH ALFONSO","HERNAN CAMILO",2022004250025,"Fortalecimiento de la producción de material vegetal arbustivo y arbóreo para la recuperación de la cobertura arbórea en el departamento de Cundinamarca","AMBIENTE Y DESARROLLO SOSTENIBLE",3387966925,2857824455,530142470,44907,"CONTRATADO EN EJECUCIÓN",6.4999999999999997E-3,0,null,null,null,null,null,null,null,null,null,null,45073,45159,45217,-65,-7,-151]
[219,"DESENTRALIZADOS","ICCU - GESPROY GB","ALEXANDER RIVEROS / JEIMY FORERO","GIOVANY QUEVEDO",2022004250032,"Mejoramiento de la vía que comunica a los municipios de san Cayetano y Cogua tramo vereda cardonal vereda mortiño del municipio de san Cayetano departamento de Cundinamarca","TRANSPORTE",9976205175,9976205175,0,44909,"CONTRATADO EN EJECUCIÓN",7.3800000000000004E-2,0,null,null,null,null,null,null,null,null,null,null,44908,45159,45217,-65,-7,-316]
[220,"CUNDINAMARCA","UNIDAD ADMINISTRATIVA DE GESTIÓN DEL RIESGO.","DIEGO TORRES/VALENTINA PORTILLO","DAYAN HELENA MOLINA",2022004250031,"Construcción de obras para mitigar los riesgos que se presentan en la zonas aledañas a la urbanización Sasipa del municipio de Silvania Cundinamarca","GOBIERNO TERRITORIAL",3673954111,3673954111,0,44922,"SIN CONTRATAR",0,0,null,null,null,null,null,null,null,null,null,null,null,44974,44908,-250,-316,0]
[221,"ENTIDAD APORTANTE RECURSOS","UNIDAD ADMINISTRATIVA DE GESTIÓN DEL RIESGO.","DIEGO TORRES/VALENTINA PORTILLO","DAYAN HELENA MOLINA",2022004250036,"Construcción de obras de mitigación y estabilización en centro poblado de cuatro caminos del municipio de Paime departamento de Cundinamarca","GOBIERNO TERRITORIAL",3745004883.4099998,3745004883.4099998,0,44922,"CONTRATADO SIN ACTA DE INICIO",0,0.45550000000000002,null,null,null,null,null,null,null,null,null,null,45217,45217,44974,-7,-250,-7]
[222,"ENTIDAD APORTANTE RECURSOS","FUNDACION UNIVERSIDAD DEL VALLE","ALEXANDER RIVEROS/JEIMY FORERO","FABIAN CUESTA",2022004250028,"Fortalecimiento empresarial para el progreso y la competitividad de los micronegocios y unidades productivas en el departamento de Cundinamarca","COMERCIO, INDUSTRIA Y TURISMO ",16598832013,16598832013,0,44923,"CONTRATADO EN EJECUCIÓN",0.27539999999999998,0.39800000000000002,null,null,null,null,null,null,null,null,null,null,45187,44974,45217,-250,-7,-37]
[223,"CUNDINAMARCA","SECRETARIA DE AMBIENTE","ALEXANDER RIVEROS /  LIYUGETH ALFONSO","HERNAN CAMILO",20223201010038,"Implementacion de un proceso de restauración ecológica como medida de conservación de áreas ambientales estratégicas en la provincia de Gualiva Cundinamarca","AMBIENTE Y DESARROLLO SOSTENIBLE",2238923844," $ 2.238.923.844 ",0,"20/01/2023","SIN CONTRATAR",0,0,null,null,null,null,null,null,null,null,null,null,45066,45035,45159,-189,-65,-158]
[224,"CUNDINAMARCA","SECRETARIA DE EDUCACIÓN","ALEXANDER RIVEROS / JEIMY FORERO","GENNY PADILLA",2023000050006,"Fortalecimiento a la Estrategia de Alimentación Escolar en los municipios no certificados para la vigencia 2023 del Departamento de Cundinamarca","EDUCACIÓN",73467216989,73467216989,0,45063,"CONTRATADO EN EJECUCIÓN",0.49990000000000001,7.4999999999999997E-3,null,null,null,null,null,null,null,null,null,null,45187,45126,45217,-98,-7,-37]
[225,"CUNDINAMARCA","SECRETARIA DE EDUCACIÓN","ALEXANDER RIVEROS / JEIMY FORERO","GENNY PADILLA",2023004250024,"Fortalecimiento a la Estrategia de Subsidio de transporte escolar para la vigencia 2023 en municipios no certificados del Departamento de  Cundinamarca","EDUCACIÓN",26541498067,26541498067,0,45098,"CONTRATADO EN EJECUCIÓN",0.49609999999999999,1E-3,null,null,null,null,null,null,null,null,null,null,45217,45126,45217,-98,-7,-7]
[null,null,null,null,null,null,null,null,null,null,null,null,null,null,null,null,null,null,null,null,null,null,null,null,null,null,null,null,0,0,0]
[null,null,null,null,null,null,null,null,null,null,null,null,null,null,null,null,null,null,null,null,null,null,null,null,null,null,null,null,0,0,0]
[null,null,null,null,null,null,null,null,null,null,null,null,null,null,null,null,null,null,null,null,null,null,null,null,null,null,null,null,0,0,0]
[null,null,null,null,null,null,null,null,null,null,null,null,null,null,null,null,null,null,null,null,null,null,null,null,null,null,null,null,0,0,0]
[null,null,null,null,null,null,null,null,null,null,null,null,null,null,null,null,null,null,null,null,null,null,null,null,null,null,null,null,0,0,0]
[null,null,null,null,null,null,null,null,null,null,null,null,null,null,null,null,null,null,null,null,null,null,null,null,null,null,null,null,0,0,0]
[null,null,null,null,null,null,null,null,null,null,{"$f":"I233-J233","v":0},null,null,null,null,null,null,null,null,null,null,null,null,null,null,null,null,null,0,0,0]
[null,null,null,null,null,null,null,null,null,null,0,null,null,null,null,null,null,null,null,null,null,null,null,null,null,null,null,null,0,0,0]
[null,null,null,null,null,null,null,null,null,null,0,null,null,null,null,null,null,null,null,null,null,null,null,null,null,null,null,null,0,0,0]
[null,null,null,null,null,null,null,null,null,null,null,null,null,null,null,null,null,null,null,null,null,null,null,null,null,null,null,null,0,0,0]
[null,null,null,null,null,null,null,null,null,null,null,null,null,null,null,null,null,null,null,null,null,null,null,null,null,null,null,null,0,0,0]
[null,null,null,null,null,null,0,null,null,null,null,null,null,null,null,null,null,null,null,null,null,null,null,null,null,null,null,null,0,0,0]
[null,null,null,null,null,null,null,null,null,null,null,null,null,null,null,null,null,null,null,null,null,null,null,null,null,null,null,null,0,0,0]
[null,null,null,null,null,null,null,null,null,null,null,null,null,null,null,null,null,null,null,null,null,null,null,null,null,null,null,null,0,0,0]
[null,null,null,null,null,null,null,null,null,null,null,null,null,null,null,null,null,null,null,null,null,null,null,null,null,null,null,null,0,0,0]
[null,null,null,null,null,null,null,null,null,null,null,null,null,null,null,null,null,null,null,null,null,null,null,null,null,null,null,null,0,0,0]
[null,null,null,null,null,null,null,null,null,null,null,null,null,null,null,null,null,null,null,null,null,null,null,null,null,null,null,null,0,0,0]
[null,null,null,null,null,null,null,null,null,null,null,null,null,null,null,null,null,null,null,null,null,null,null,null,null,null,null,null,0,0,0]
[null,null,null,null,null,null,null,null,null,null,null,null,null,null,null,null,null,null,null,null,null,null,null,null,null,null,null,null,0,0,0]
[null,null,null,null,null,null,null,null,null,null,null,null,null,null,null,null,null,null,null,null,null,null,null,null,null,null,null,null,0,0,0]
[null,null,null,null,null,null,null,null,null,null,null,null,null,null,null,null,null,null,null,null,null,null,null,null,null,null,null,null,0,0,0]
[null,null,null,null,null,null,null,null,null,null,null,null,null,null,null,null,null,null,null,null,null,null,null,null,null,null,null,null,0,0,0]
[null,null,null,null,null,null,null,null,null,null,null,null,null,null,null,null,null,null,null,null,null,null,null,null,null,null,null,null,0,0,0]
[null,null,null,null,null,null,null,null,null,null,null,null,null,null,null,null,null,null,null,null,null,null,null,null,null,null,null,null,0,0,0]
[null,null,null,null,null,null,null,null,null,null,null,null,null,null,null,null,null,null,null,null,null,null,null,null,null,null,null,null,0,0,0]
[null,null,null,null,null,null,null,null,null,null,null,null,null,null,null,null,null,null,null,null,null,null,null,null,null,null,null,null,0,0,0]
[null,null,null,null,null,null,null,null,null,null,null,null,null,null,null,null,null,null,null,null,null,null,null,null,null,null,null,null,0,0,0]
[null,null,null,null,null,null,null,null,null,null,null,null,null,null,null,null,null,null,null,null,null,null,null,null,null,null,null,null,0,0,0]
[null,null,null,null,null,null,null,null,null,null,null,null,null,null,null,null,null,null,null,null,null,null,null,null,null,null,null,null,0,0,0]
[null,null,null,null,null,null,null,null,null,null,null,null,null,null,null,null,null,null,null,null,null,null,null,null,null,null,null,null,0,0,0]
[null,null,null,null,null,null,null,null,null,null,null,null,null,null,null,null,null,null,null,null,null,null,null,null,null,null,null,null,0,0,0]
[null,null,null,null,null,null,null,null,null,null,null,null,null,null,null,null,null,null,null,null,null,null,null,null,null,null,null,null,0,0,0]
[null,null,null,null,null,null,null,null,null,null,null,null,null,null,null,null,null,null,null,null,null,null,null,null,null,null,null,null,{"$f":"IF(AA259=0,0,_xlfn.DAYS(AA259,TODAY()))","v":0},0,0]
[null,null,null,null,null,null,null,null,null,null,null,null,null,null,null,null,null,null,null,null,null,null,null,null,null,null,null,null,0,0,0]
[null,null,null,null,null,null,null,null,null,null,null,null,null,null,null,null,null,null,null,null,null,null,null,null,null,null,null,null,0,0,{"$f":"IF(Z261=0,0,_xlfn.DAYS(Z261,TODAY()))","v":0}]
[null,null,null,null,null,null,null,null,null,null,null,null,null,null,null,null,null,null,null,null,null,null,null,null,null,null,null,null,0,0,0]
[null,null,null,null,null,null,null,null,null,null,null,null,null,null,null,null,null,null,null,null,null,null,null,null,null,null,null,null,0,0,0]
[null,null,null,null,null,null,null,null,null,null,null,null,null,null,null,null,null,null,null,null,null,null,null,null,null,null,null,null,0,0,0]
[null,null,null,null,null,null,null,null,null,null,null,null,null,null,null,null,null,null,null,null,null,null,null,null,null,null,null,null,0,0,0]
[null,null,null,null,null,null,null,null,null,null,null,null,null,null,null,null,null,null,null,null,null,null,null,null,null,null,null,null,0,0,0]
[null,null,null,null,null,null,null,null,null,null,null,null,null,null,null,null,null,null,null,null,null,null,null,null,null,null,null,null,0,0,0]
[null,null,null,null,null,null,null,null,null,null,null,null,null,null,null,null,null,null,null,null,null,null,null,null,null,null,null,null,0,0,0]
[null,null,null,null,null,null,null,null,null,null,null,null,null,null,null,null,null,null,null,null,null,null,null,null,null,null,null,null,0,0,0]
[null,null,null,null,null,null,null,null,null,null,null,null,null,null,null,null,null,null,null,null,null,null,null,null,null,null,null,null,0,0,0]
[null,null,null,null,null,null,null,null,null,null,null,null,null,null,null,null,null,null,null,null,null,null,null,null,null,null,null,null,0,0,0]
[null,null,null,null,null,null,null,null,null,null,null,null,null,null,null,null,null,null,null,null,null,null,null,null,null,null,null,null,0,0,0]
[null,null,null,null,null,null,null,null,null,null,null,null,null,null,null,null,null,null,null,null,null,null,null,null,null,null,null,null,0,0,0]
[null,null,null,null,null,null,null,null,null,null,null,null,null,null,null,null,null,null,null,null,null,null,null,null,null,null,null,null,0,0,0]
[null,null,null,null,null,null,null,null,null,null,null,null,null,null,null,null,null,null,null,null,null,null,null,null,null,null,null,null,0,0,0]
[null,null,null,null,null,null,null,null,null,null,null,null,null,null,null,null,null,null,null,null,null,null,null,null,null,null,null,null,0,0,0]
[null,null,null,null,null,null,null,null,null,null,null,null,null,null,null,null,null,null,null,null,null,null,null,null,null,null,null,null,0,0,0]
[null,null,null,null,null,null,null,null,null,null,null,null,null,null,null,null,null,null,null,null,null,null,null,null,null,null,null,null,0,0,0]
[null,null,null,null,null,null,null,null,null,null,null,null,null,null,null,null,null,null,null,null,null,null,null,null,null,null,null,null,0,0,0]
[null,null,null,null,null,null,null,null,null,null,null,null,null,null,null,null,null,null,null,null,null,null,null,null,null,null,null,null,0,0,0]
[null,null,null,null,null,null,null,null,null,null,null,null,null,null,null,null,null,null,null,null,null,null,null,null,null,null,null,null,0,0,0]
[null,null,null,null,null,null,null,null,null,null,null,null,null,null,null,null,null,null,null,null,null,null,null,null,null,null,null,null,0,0,0]
[null,null,null,null,null,null,null,null,null,null,null,null,null,null,null,null,null,null,null,null,null,null,null,null,null,null,null,null,0,0,0]
[null,null,null,null,null,null,null,null,null,null,null,null,null,null,null,null,null,null,null,null,null,null,null,null,null,null,null,null,0,0,0]
[null,null,null,null,null,null,null,null,null,null,null,null,null,null,null,null,null,null,null,null,null,null,null,null,null,null,null,null,0,0,0]
[null,null,null,null,null,null,null,null,null,null,null,null,null,null,null,null,null,null,null,null,null,null,null,null,null,null,null,null,0,0,0]
[null,null,null,null,null,null,null,null,null,null,null,null,null,null,null,null,null,null,null,null,null,null,null,null,null,null,null,null,0,0,0]
[null,null,null,null,null,null,null,null,null,null,null,null,null,null,null,null,null,null,null,null,null,null,null,null,null,null,null,null,0,0,0]
[null,null,null,null,null,null,null,null,null,null,null,null,null,null,null,null,null,null,null,null,null,null,null,null,null,null,null,null,0,0,0]
[null,null,null,null,null,null,null,null,null,null,null,null,null,null,null,null,null,null,null,null,null,null,null,null,null,null,null,null,0,0,0]
[null,null,null,null,null,null,null,null,null,null,null,null,null,null,null,null,null,null,null,null,null,null,null,null,null,null,null,null,0,0,0]
[null,null,null,null,null,null,null,null,null,null,null,null,null,null,null,null,null,null,null,null,null,null,null,null,null,null,null,null,0,0,0]
[null,null,null,null,null,null,null,null,null,null,null,null,null,null,null,null,null,null,null,null,null,null,null,null,null,null,null,null,0,0,0]
[null,null,null,null,null,null,null,null,null,null,null,null,null,null,null,null,null,null,null,null,null,null,null,null,null,null,null,null,0,0,0]
[null,null,null,null,null,null,null,null,null,null,null,null,null,null,null,null,null,null,null,null,null,null,null,null,null,null,null,null,0,0,0]
[null,null,null,null,null,null,null,null,null,null,null,null,null,null,null,null,null,null,null,null,null,null,null,null,null,null,null,null,0,0,0]
[null,null,null,null,null,null,null,null,null,null,null,null,null,null,null,null,null,null,null,null,null,null,null,null,null,null,null,null,0,0,0]
[null,null,null,null,null,null,null,null,null,null,null,null,null,null,null,null,null,null,null,null,null,null,null,null,null,null,null,null,0,0,0]
[null,null,null,null,null,null,null,null,null,null,null,null,null,null,null,null,null,null,null,null,null,null,null,null,null,null,null,null,0,0,0]
[null,null,null,null,null,null,null,null,null,null,null,null,null,null,null,null,null,null,null,null,null,null,null,null,null,null,null,null,0,0,0]
[null,null,null,null,null,null,null,null,null,null,null,null,null,null,null,null,null,null,null,null,null,null,null,null,null,null,null,null,0,0,0]
[null,null,null,null,null,null,null,null,null,null,null,null,null,null,null,null,null,null,null,null,null,null,null,null,null,null,null,null,0,0,0]
[null,null,null,null,null,null,null,null,null,null,null,null,null,null,null,null,null,null,null,null,null,null,null,null,null,null,null,null,0,0,0]
[null,null,null,null,null,null,null,null,null,null,null,null,null,null,null,null,null,null,null,null,null,null,null,null,null,null,null,null,0,0,0]
[null,null,null,null,null,null,null,null,null,null,null,null,null,null,null,null,null,null,null,null,null,null,null,null,null,null,null,null,0,0,0]
[null,null,null,null,null,null,null,null,null,null,null,null,null,null,null,null,null,null,null,null,null,null,null,null,null,null,null,null,0,0,0]
[null,null,null,null,null,null,null,null,null,null,null,null,null,null,null,null,null,null,null,null,null,null,null,null,null,null,null,null,0,0,0]
[null,null,null,null,null,null,null,null,null,null,null,null,null,null,null,null,null,null,null,null,null,null,null,null,null,null,null,null,0,0,0]
[null,null,null,null,null,null,null,null,null,null,null,null,null,null,null,null,null,null,null,null,null,null,null,null,null,null,null,null,0,0,0]
[null,null,null,null,null,null,null,null,null,null,null,null,null,null,null,null,null,null,null,null,null,null,null,null,null,null,null,null,0,0,0]
[null,null,null,null,null,null,null,null,null,null,null,null,null,null,null,null,null,null,null,null,null,null,null,null,null,null,null,null,0,0,0]
[null,null,null,null,null,null,null,null,null,null,null,null,null,null,null,null,null,null,null,null,null,null,null,null,null,null,null,null,0,0,0]
[null,null,null,null,null,null,null,null,null,null,null,null,null,null,null,null,null,null,null,null,null,null,null,null,null,null,null,null,0,0,0]
[null,null,null,null,null,null,null,null,null,null,null,null,null,null,null,null,null,null,null,null,null,null,null,null,null,null,null,null,0,0,0]
[null,null,null,null,null,null,null,null,null,null,null,null,null,null,null,null,null,null,null,null,null,null,null,null,null,null,null,null,0,0,0]
[null,null,null,null,null,null,null,null,null,null,null,null,null,null,null,null,null,null,null,null,null,null,null,null,null,null,null,null,0,0,0]
[null,null,null,null,null,null,null,null,null,null,null,null,null,null,null,null,null,null,null,null,null,null,null,null,null,null,null,null,0,0,0]
[null,null,null,null,null,null,null,null,null,null,null,null,null,null,null,null,null,null,null,null,null,null,null,null,null,null,null,null,0,0,0]
[null,null,null,null,null,null,null,null,null,null,null,null,null,null,null,null,null,null,null,null,null,null,null,null,null,null,null,null,0,0,0]
[null,null,null,null,null,null,null,null,null,null,null,null,null,null,null,null,null,null,null,null,null,null,null,null,null,null,null,null,0,0,0]
[null,null,null,null,null,null,null,null,null,null,null,null,null,null,null,null,null,null,null,null,null,null,null,null,null,null,null,null,0,0,0]
[null,null,null,null,null,null,null,null,null,null,null,null,null,null,null,null,null,null,null,null,null,null,null,null,null,null,null,null,0,0,0]
[null,null,null,null,null,null,null,null,null,null,null,null,null,null,null,null,null,null,null,null,null,null,null,null,null,null,null,null,{"$f":"IF(AA323=0,0,_xlfn.DAYS(AA323,TODAY()))","v":0},0,0]
[null,null,null,null,null,null,null,null,null,null,null,null,null,null,null,null,null,null,null,null,null,null,null,null,null,null,null,null,0,0,0]
[null,null,null,null,null,null,null,null,null,null,null,null,null,null,null,null,null,null,null,null,null,null,null,null,null,null,null,null,0,0,{"$f":"IF(Z325=0,0,_xlfn.DAYS(Z325,TODAY()))","v":0}]
[null,null,null,null,null,null,null,null,null,null,null,null,null,null,null,null,null,null,null,null,null,null,null,null,null,null,null,null,0,0,0]
[null,null,null,null,null,null,null,null,null,null,null,null,null,null,null,null,null,null,null,null,null,null,null,null,null,null,null,null,0,0,0]
[null,null,null,null,null,null,null,null,null,null,null,null,null,null,null,null,null,null,null,null,null,null,null,null,null,null,null,null,0,0,0]
[null,null,null,null,null,null,null,null,null,null,null,null,null,null,null,null,null,null,null,null,null,null,null,null,null,null,null,null,0,0,0]
[null,null,null,null,null,null,null,null,null,null,null,null,null,null,null,null,null,null,null,null,null,null,null,null,null,null,null,null,0,0,0]
[null,null,null,null,null,null,null,null,null,null,null,null,null,null,null,null,null,null,null,null,null,null,null,null,null,null,null,null,0,0,0]
[null,null,null,null,null,null,null,null,null,null,null,null,null,null,null,null,null,null,null,null,null,null,null,null,null,null,null,null,0,0,0]
[null,null,null,null,null,null,null,null,null,null,null,null,null,null,null,null,null,null,null,null,null,null,null,null,null,null,null,null,0,0,0]
[null,null,null,null,null,null,null,null,null,null,null,null,null,null,null,null,null,null,null,null,null,null,null,null,null,null,null,null,0,0,0]
[null,null,null,null,null,null,null,null,null,null,null,null,null,null,null,null,null,null,null,null,null,null,null,null,null,null,null,null,0,0,0]
[null,null,null,null,null,null,null,null,null,null,null,null,null,null,null,null,null,null,null,null,null,null,null,null,null,null,null,null,0,0,0]
[null,null,null,null,null,null,null,null,null,null,null,null,null,null,null,null,null,null,null,null,null,null,null,null,null,null,null,null,0,0,0]
[null,null,null,null,null,null,null,null,null,null,null,null,null,null,null,null,null,null,null,null,null,null,null,null,null,null,null,null,0,0,0]
[null,null,null,null,null,null,null,null,null,null,null,null,null,null,null,null,null,null,null,null,null,null,null,null,null,null,null,null,0,0,0]
[null,null,null,null,null,null,null,null,null,null,null,null,null,null,null,null,null,null,null,null,null,null,null,null,null,null,null,null,0,0,0]
[null,null,null,null,null,null,null,null,null,null,null,null,null,null,null,null,null,null,null,null,null,null,null,null,null,null,null,null,0,0,0]
[null,null,null,null,null,null,null,null,null,null,null,null,null,null,null,null,null,null,null,null,null,null,null,null,null,null,null,null,0,0,0]
[null,null,null,null,null,null,null,null,null,null,null,null,null,null,null,null,null,null,null,null,null,null,null,null,null,null,null,null,0,0,0]
[null,null,null,null,null,null,null,null,null,null,null,null,null,null,null,null,null,null,null,null,null,null,null,null,null,null,null,null,0,0,0]
[null,null,null,null,null,null,null,null,null,null,null,null,null,null,null,null,null,null,null,null,null,null,null,null,null,null,null,null,0,0,0]
[null,null,null,null,null,null,null,null,null,null,null,null,null,null,null,null,null,null,null,null,null,null,null,null,null,null,null,null,0,0,0]
[null,null,null,null,null,null,null,null,null,null,null,null,null,null,null,null,null,null,null,null,null,null,null,null,null,null,null,null,0,0,0]
[null,null,null,null,null,null,null,null,null,null,null,null,null,null,null,null,null,null,null,null,null,null,null,null,null,null,null,null,0,0,0]
[null,null,null,null,null,null,null,null,null,null,null,null,null,null,null,null,null,null,null,null,null,null,null,null,null,null,null,null,0,0,0]
[null,null,null,null,null,null,null,null,null,null,null,null,null,null,null,null,null,null,null,null,null,null,null,null,null,null,null,null,0,0,0]
[null,null,null,null,null,null,null,null,null,null,null,null,null,null,null,null,null,null,null,null,null,null,null,null,null,null,null,null,0,0,0]
[null,null,null,null,null,null,null,null,null,null,null,null,null,null,null,null,null,null,null,null,null,null,null,null,null,null,null,null,0,0,0]
[null,null,null,null,null,null,null,null,null,null,null,null,null,null,null,null,null,null,null,null,null,null,null,null,null,null,null,null,0,0,0]
[null,null,null,null,null,null,null,null,null,null,null,null,null,null,null,null,null,null,null,null,null,null,null,null,null,null,null,null,0,0,0]
[null,null,null,null,null,null,null,null,null,null,null,null,null,null,null,null,null,null,null,null,null,null,null,null,null,null,null,null,0,0,0]
[null,null,null,null,null,null,null,null,null,null,null,null,null,null,null,null,null,null,null,null,null,null,null,null,null,null,null,null,0,0,0]
[null,null,null,null,null,null,null,null,null,null,null,null,null,null,null,null,null,null,null,null,null,null,null,null,null,null,null,null,0,0,0]
[null,null,null,null,null,null,null,null,null,null,null,null,null,null,null,null,null,null,null,null,null,null,null,null,null,null,null,null,0,0,0]
[null,null,null,null,null,null,null,null,null,null,null,null,null,null,null,null,null,null,null,null,null,null,null,null,null,null,null,null,0,0,0]
[null,null,null,null,null,null,null,null,null,null,null,null,null,null,null,null,null,null,null,null,null,null,null,null,null,null,null,null,0,0,0]
[null,null,null,null,null,null,null,null,null,null,null,null,null,null,null,null,null,null,null,null,null,null,null,null,null,null,null,null,0,0,0]
[null,null,null,null,null,null,null,null,null,null,null,null,null,null,null,null,null,null,null,null,null,null,null,null,null,null,null,null,0,0,0]
[null,null,null,null,null,null,null,null,null,null,null,null,null,null,null,null,null,null,null,null,null,null,null,null,null,null,null,null,0,0,0]
[null,null,null,null,null,null,null,null,null,null,null,null,null,null,null,null,null,null,null,null,null,null,null,null,null,null,null,null,0,0,0]
[null,null,null,null,null,null,null,null,null,null,null,null,null,null,null,null,null,null,null,null,null,null,null,null,null,null,null,null,0,0,0]
[null,null,null,null,null,null,null,null,null,null,null,null,null,null,null,null,null,null,null,null,null,null,null,null,null,null,null,null,0,0,0]
[null,null,null,null,null,null,null,null,null,null,null,null,null,null,null,null,null,null,null,null,null,null,null,null,null,null,null,null,0,0,0]
[null,null,null,null,null,null,null,null,null,null,null,null,null,null,null,null,null,null,null,null,null,null,null,null,null,null,null,null,0,0,0]
[null,null,null,null,null,null,null,null,null,null,null,null,null,null,null,null,null,null,null,null,null,null,null,null,null,null,null,null,0,0,0]
[null,null,null,null,null,null,null,null,null,null,null,null,null,null,null,null,null,null,null,null,null,null,null,null,null,null,null,null,0,0,0]
[null,null,null,null,null,null,null,null,null,null,null,null,null,null,null,null,null,null,null,null,null,null,null,null,null,null,null,null,0,0,0]
[null,null,null,null,null,null,null,null,null,null,null,null,null,null,null,null,null,null,null,null,null,null,null,null,null,null,null,null,0,0,0]
[null,null,null,null,null,null,null,null,null,null,null,null,null,null,null,null,null,null,null,null,null,null,null,null,null,null,null,null,0,0,0]
[null,null,null,null,null,null,null,null,null,null,null,null,null,null,null,null,null,null,null,null,null,null,null,null,null,null,null,null,0,0,0]
[null,null,null,null,null,null,null,null,null,null,null,null,null,null,null,null,null,null,null,null,null,null,null,null,null,null,null,null,0,0,0]
[null,null,null,null,null,null,null,null,null,null,null,null,null,null,null,null,null,null,null,null,null,null,null,null,null,null,null,null,0,0,0]
[null,null,null,null,null,null,null,null,null,null,null,null,null,null,null,null,null,null,null,null,null,null,null,null,null,null,null,null,0,0,0]
[null,null,null,null,null,null,null,null,null,null,null,null,null,null,null,null,null,null,null,null,null,null,null,null,null,null,null,null,0,0,0]
[null,null,null,null,null,null,null,null,null,null,null,null,null,null,null,null,null,null,null,null,null,null,null,null,null,null,null,null,0,0,0]
[null,null,null,null,null,null,null,null,null,null,null,null,null,null,null,null,null,null,null,null,null,null,null,null,null,null,null,null,0,0,0]
[null,null,null,null,null,null,null,null,null,null,null,null,null,null,null,null,null,null,null,null,null,null,null,null,null,null,null,null,0,0,0]
[null,null,null,null,null,null,null,null,null,null,null,null,null,null,null,null,null,null,null,null,null,null,null,null,null,null,null,null,{"$f":"IF(AA382=0,0,_xlfn.DAYS(AA382,TODAY()))","v":0},0,{"$f":"IF(Z382=0,0,_xlfn.DAYS(Z382,TODAY()))","v":0}]
[null,null,null,null,null,null,null,null,null,null,null,null,null,null,null,null,null,null,null,null,null,null,null,null,null,null,null,null,0,0,{"$f":"IF(Z383=0,0,_xlfn.DAYS(Z383,TODAY()))","v":0}]
[null,null,null,null,null,null,null,null,null,null,null,null,null,null,null,null,null,null,null,null,null,null,null,null,null,null,null,null,0,0,{"$f":"IF(Z384=0,0,_xlfn.DAYS(Z384,TODAY()))","v":0}]
[null,null,null,null,null,null,null,null,null,null,null,null,null,null,null,null,null,null,null,null,null,null,null,null,null,null,null,null,0,0,{"$f":"IF(Z385=0,0,_xlfn.DAYS(Z385,TODAY()))","v":0}]
[null,null,null,null,null,null,null,null,null,null,null,null,null,null,null,null,null,null,null,null,null,null,null,null,null,null,null,null,{"$f":"IF(AA386=0,0,_xlfn.DAYS(AA386,TODAY()))","v":0},0,{"$f":"IF(Z386=0,0,_xlfn.DAYS(Z386,TODAY()))","v":0}]
[null,null,null,null,null,null,null,null,null,null,null,null,null,null,null,null,null,null,null,null,null,null,null,null,null,null,null,null,0,0,{"$f":"IF(Z387=0,0,_xlfn.DAYS(Z387,TODAY()))","v":0}]
[null,null,null,null,null,null,null,null,null,null,null,null,null,null,null,null,null,null,null,null,null,null,null,null,null,null,null,null,0,0,0]
[null,null,null,null,null,null,null,null,null,null,null,null,null,null,null,null,null,null,null,null,null,null,null,null,null,null,null,null,0,0,0]
[null,null,null,null,null,null,null,null,null,null,null,null,null,null,null,null,null,null,null,null,null,null,null,null,null,null,null,null,0,0,0]
[null,null,null,null,null,null,null,null,null,null,null,null,null,null,null,null,null,null,null,null,null,null,null,null,null,null,null,null,0,0,0]
[null,null,null,null,null,null,null,null,null,null,null,null,null,null,null,null,null,null,null,null,null,null,null,null,null,null,null,null,0,0,0]
[null,null,null,null,null,null,null,null,null,null,null,null,null,null,null,null,null,null,null,null,null,null,null,null,null,null,null,null,0,0,0]
[null,null,null,null,null,null,null,null,null,null,null,null,null,null,null,null,null,null,null,null,null,null,null,null,null,null,null,null,0,0,0]
[null,null,null,null,null,null,null,null,null,null,null,null,null,null,null,null,null,null,null,null,null,null,null,null,null,null,null,null,0,0,0]
[null,null,null,null,null,null,null,null,null,null,null,null,null,null,null,null,null,null,null,null,null,null,null,null,null,null,null,null,0,0,0]
[null,null,null,null,null,null,null,null,null,null,null,null,null,null,null,null,null,null,null,null,null,null,null,null,null,null,null,null,0,0,0]
[null,null,null,null,null,null,null,null,null,null,null,null,null,null,null,null,null,null,null,null,null,null,null,null,null,null,null,null,0,0,0]
[null,null,null,null,null,null,null,null,null,null,null,null,null,null,null,null,null,null,null,null,null,null,null,null,null,null,null,null,0,0,0]
[null,null,null,null,null,null,null,null,null,null,null,null,null,null,null,null,null,null,null,null,null,null,null,null,null,null,null,null,0,0,0]
[null,null,null,null,null,null,null,null,null,null,null,null,null,null,null,null,null,null,null,null,null,null,null,null,null,null,null,null,0,0,0]
[null,null,null,null,null,null,null,null,null,null,null,null,null,null,null,null,null,null,null,null,null,null,null,null,null,null,null,null,0,0,0]
[null,null,null,null,null,null,null,null,null,null,null,null,null,null,null,null,null,null,null,null,null,null,null,null,null,null,null,null,0,0,0]
[null,null,null,null,null,null,null,null,null,null,null,null,null,null,null,null,null,null,null,null,null,null,null,null,null,null,null,null,0,0,0]
[null,null,null,null,null,null,null,null,null,null,null,null,null,null,null,null,null,null,null,null,null,null,null,null,null,null,null,null,0,0,0]
[null,null,null,null,null,null,null,null,null,null,null,null,null,null,null,null,null,null,null,null,null,null,null,null,null,null,null,null,0,0,0]
[null,null,null,null,null,null,null,null,null,null,null,null,null,null,null,null,null,null,null,null,null,null,null,null,null,null,null,null,0,0,0]
[null,null,null,null,null,null,null,null,null,null,null,null,null,null,null,null,null,null,null,null,null,null,null,null,null,null,null,null,0,0,0]
[null,null,null,null,null,null,null,null,null,null,null,null,null,null,null,null,null,null,null,null,null,null,null,null,null,null,null,null,0,0,0]
[null,null,null,null,null,null,null,null,null,null,null,null,null,null,null,null,null,null,null,null,null,null,null,null,null,null,null,null,0,0,0]
[null,null,null,null,null,null,null,null,null,null,null,null,null,null,null,null,null,null,null,null,null,null,null,null,null,null,null,null,0,0,0]
[null,null,null,null,null,null,null,null,null,null,null,null,null,null,null,null,null,null,null,null,null,null,null,null,null,null,null,null,0,0,0]
[null,null,null,null,null,null,null,null,null,null,null,null,null,null,null,null,null,null,null,null,null,null,null,null,null,null,null,null,0,0,0]
[null,null,null,null,null,null,null,null,null,null,null,null,null,null,null,null,null,null,null,null,null,null,null,null,null,null,null,null,0,0,0]
[null,null,null,null,null,null,null,null,null,null,null,null,null,null,null,null,null,null,null,null,null,null,null,null,null,null,null,null,0,0,0]
[null,null,null,null,null,null,null,null,null,null,null,null,null,null,null,null,null,null,null,null,null,null,null,null,null,null,null,null,0,0,0]
[null,null,null,null,null,null,null,null,null,null,null,null,null,null,null,null,null,null,null,null,null,null,null,null,null,null,null,null,0,0,0]
[null,null,null,null,null,null,null,null,null,null,null,null,null,null,null,null,null,null,null,null,null,null,null,null,null,null,null,null,0,0,0]
[null,null,null,null,null,null,null,null,null,null,null,null,null,null,null,null,null,null,null,null,null,null,null,null,null,null,null,null,0,0,0]
[null,null,null,null,null,null,null,null,null,null,null,null,null,null,null,null,null,null,null,null,null,null,null,null,null,null,null,null,0,0,0]
[null,null,null,null,null,null,null,null,null,null,null,null,null,null,null,null,null,null,null,null,null,null,null,null,null,null,null,null,0,0,0]
[null,null,null,null,null,null,null,null,null,null,null,null,null,null,null,null,null,null,null,null,null,null,null,null,null,null,null,null,0,0,0]
[null,null,null,null,null,null,null,null,null,null,null,null,null,null,null,null,null,null,null,null,null,null,null,null,null,null,null,null,0,0,0]
[null,null,null,null,null,null,null,null,null,null,null,null,null,null,null,null,null,null,null,null,null,null,null,null,null,null,null,null,0,0,0]
[null,null,null,null,null,null,null,null,null,null,null,null,null,null,null,null,null,null,null,null,null,null,null,null,null,null,null,null,0,0,0]
[null,null,null,null,null,null,null,null,null,null,null,null,null,null,null,null,null,null,null,null,null,null,null,null,null,null,null,null,0,0,0]
[null,null,null,null,null,null,null,null,null,null,null,null,null,null,null,null,null,null,null,null,null,null,null,null,null,null,null,null,0,0,0]
[null,null,null,null,null,null,null,null,null,null,null,null,null,null,null,null,null,null,null,null,null,null,null,null,null,null,null,null,0,0,0]
[null,null,null,null,null,null,null,null,null,null,null,null,null,null,null,null,null,null,null,null,null,null,null,null,null,null,null,null,0,0,0]
[null,null,null,null,null,null,null,null,null,null,null,null,null,null,null,null,null,null,null,null,null,null,null,null,null,null,null,null,0,0,0]
[null,null,null,null,null,null,null,null,null,null,null,null,null,null,null,null,null,null,null,null,null,null,null,null,null,null,null,null,0,0,0]
[null,null,null,null,null,null,null,null,null,null,null,null,null,null,null,null,null,null,null,null,null,null,null,null,null,null,null,null,0,0,0]
[null,null,null,null,null,null,null,null,null,null,null,null,null,null,null,null,null,null,null,null,null,null,null,null,null,null,null,null,0,0,0]
[null,null,null,null,null,null,null,null,null,null,null,null,null,null,null,null,null,null,null,null,null,null,null,null,null,null,null,null,0,0,0]
[null,null,null,null,null,null,null,null,null,null,null,null,null,null,null,null,null,null,null,null,null,null,null,null,null,null,null,null,0,0,0]
[null,null,null,null,null,null,null,null,null,null,null,null,null,null,null,null,null,null,null,null,null,null,null,null,null,null,null,null,0,0,0]
[null,null,null,null,null,null,null,null,null,null,null,null,null,null,null,null,null,null,null,null,null,null,null,null,null,null,null,null,0,0,0]
[null,null,null,null,null,null,null,null,null,null,null,null,null,null,null,null,null,null,null,null,null,null,null,null,null,null,null,null,0,0,0]
[null,null,null,null,null,null,null,null,null,null,null,null,null,null,null,null,null,null,null,null,null,null,null,null,null,null,null,null,0,0,0]
[null,null,null,null,null,null,null,null,null,null,null,null,null,null,null,null,null,null,null,null,null,null,null,null,null,null,null,null,0,0,0]
[null,null,null,null,null,null,null,null,null,null,null,null,null,null,null,null,null,null,null,null,null,null,null,null,null,null,null,null,0,0,0]
[null,null,null,null,null,null,null,null,null,null,null,null,null,null,null,null,null,null,null,null,null,null,null,null,null,null,null,null,0,0,0]
[null,null,null,null,null,null,null,null,null,null,null,null,null,null,null,null,null,null,null,null,null,null,null,null,null,null,null,null,0,0,0]
[null,null,null,null,null,null,null,null,null,null,null,null,null,null,null,null,null,null,null,null,null,null,null,null,null,null,null,null,0,0,0]
[null,null,null,null,null,null,null,null,null,null,null,null,null,null,null,null,null,null,null,null,null,null,null,null,null,null,null,null,0,0,0]
[null,null,null,null,null,null,null,null,null,null,null,null,null,null,null,null,null,null,null,null,null,null,null,null,null,null,null,null,0,0,0]
[null,null,null,null,null,null,null,null,null,null,null,null,null,null,null,null,null,null,null,null,null,null,null,null,null,null,null,null,0,0,0]
[null,null,null,null,null,null,null,null,null,null,null,null,null,null,null,null,null,null,null,null,null,null,null,null,null,null,null,null,0,0,0]
[null,null,null,null,null,null,null,null,null,null,null,null,null,null,null,null,null,null,null,null,null,null,null,null,null,null,null,null,0,0,0]
[null,null,null,null,null,null,null,null,null,null,null,null,null,null,null,null,null,null,null,null,null,null,null,null,null,null,null,null,{"$f":"IF(AA450=0,0,_xlfn.DAYS(AA450,TODAY()))","v":0},0,0]
[null,null,null,null,null,null,null,null,null,null,null,null,null,null,null,null,null,null,null,null,null,null,null,null,null,null,null,null,0,0,{"$f":"IF(Z451=0,0,_xlfn.DAYS(Z451,TODAY()))","v":0}]
[null,null,null,null,null,null,null,null,null,null,null,null,null,null,null,null,null,null,null,null,null,null,null,null,null,null,null,null,0,0,0]
[null,null,null,null,null,null,null,null,null,null,null,null,null,null,null,null,null,null,null,null,null,null,null,null,null,null,null,null,0,0,0]
[null,null,null,null,null,null,null,null,null,null,null,null,null,null,null,null,null,null,null,null,null,null,null,null,null,null,null,null,0,0,0]
[null,null,null,null,null,null,null,null,null,null,null,null,null,null,null,null,null,null,null,null,null,null,null,null,null,null,null,null,0,0,0]
[null,null,null,null,null,null,null,null,null,null,null,null,null,null,null,null,null,null,null,null,null,null,null,null,null,null,null,null,0,0,0]
[null,null,null,null,null,null,null,null,null,null,null,null,null,null,null,null,null,null,null,null,null,null,null,null,null,null,null,null,0,0,0]
[null,null,null,null,null,null,null,null,null,null,null,null,null,null,null,null,null,null,null,null,null,null,null,null,null,null,null,null,0,0,0]
[null,null,null,null,null,null,null,null,null,null,null,null,null,null,null,null,null,null,null,null,null,null,null,null,null,null,null,null,0,0,0]
[null,null,null,null,null,null,null,null,null,null,null,null,null,null,null,null,null,null,null,null,null,null,null,null,null,null,null,null,0,0,0]
[null,null,null,null,null,null,null,null,null,null,null,null,null,null,null,null,null,null,null,null,null,null,null,null,null,null,null,null,0,0,0]
[null,null,null,null,null,null,null,null,null,null,null,null,null,null,null,null,null,null,null,null,null,null,null,null,null,null,null,null,0,0,0]
[null,null,null,null,null,null,null,null,null,null,null,null,null,null,null,null,null,null,null,null,null,null,null,null,null,null,null,null,0,0,0]
[null,null,null,null,null,null,null,null,null,null,null,null,null,null,null,null,null,null,null,null,null,null,null,null,null,null,null,null,0,0,0]
[null,null,null,null,null,null,null,null,null,null,null,null,null,null,null,null,null,null,null,null,null,null,null,null,null,null,null,null,0,0,0]
[null,null,null,null,null,null,null,null,null,null,null,null,null,null,null,null,null,null,null,null,null,null,null,null,null,null,null,null,0,0,0]
[null,null,null,null,null,null,null,null,null,null,null,null,null,null,null,null,null,null,null,null,null,null,null,null,null,null,null,null,0,0,0]
[null,null,null,null,null,null,null,null,null,null,null,null,null,null,null,null,null,null,null,null,null,null,null,null,null,null,null,null,0,0,0]
[null,null,null,null,null,null,null,null,null,null,null,null,null,null,null,null,null,null,null,null,null,null,null,null,null,null,null,null,0,0,0]
[null,null,null,null,null,null,null,null,null,null,null,null,null,null,null,null,null,null,null,null,null,null,null,null,null,null,null,null,0,0,0]
[null,null,null,null,null,null,null,null,null,null,null,null,null,null,null,null,null,null,null,null,null,null,null,null,null,null,null,null,0,0,0]
[null,null,null,null,null,null,null,null,null,null,null,null,null,null,null,null,null,null,null,null,null,null,null,null,null,null,null,null,0,0,0]
[null,null,null,null,null,null,null,null,null,null,null,null,null,null,null,null,null,null,null,null,null,null,null,null,null,null,null,null,0,0,0]
[null,null,null,null,null,null,null,null,null,null,null,null,null,null,null,null,null,null,null,null,null,null,null,null,null,null,null,null,0,0,0]
[null,null,null,null,null,null,null,null,null,null,null,null,null,null,null,null,null,null,null,null,null,null,null,null,null,null,null,null,0,0,0]
[null,null,null,null,null,null,null,null,null,null,null,null,null,null,null,null,null,null,null,null,null,null,null,null,null,null,null,null,0,0,0]
[null,null,null,null,null,null,null,null,null,null,null,null,null,null,null,null,null,null,null,null,null,null,null,null,null,null,null,null,0,0,0]
[null,null,null,null,null,null,null,null,null,null,null,null,null,null,null,null,null,null,null,null,null,null,null,null,null,null,null,null,0,0,0]
[null,null,null,null,null,null,null,null,null,null,null,null,null,null,null,null,null,null,null,null,null,null,null,null,null,null,null,null,0,0,0]
[null,null,null,null,null,null,null,null,null,null,null,null,null,null,null,null,null,null,null,null,null,null,null,null,null,null,null,null,0,0,0]
[null,null,null,null,null,null,null,null,null,null,null,null,null,null,null,null,null,null,null,null,null,null,null,null,null,null,null,null,0,0,0]
[null,null,null,null,null,null,null,null,null,null,null,null,null,null,null,null,null,null,null,null,null,null,null,null,null,null,null,null,0,0,0]
[null,null,null,null,null,null,null,null,null,null,null,null,null,null,null,null,null,null,null,null,null,null,null,null,null,null,null,null,0,0,0]
[null,null,null,null,null,null,null,null,null,null,null,null,null,null,null,null,null,null,null,null,null,null,null,null,null,null,null,null,0,0,0]
[null,null,null,null,null,null,null,null,null,null,null,null,null,null,null,null,null,null,null,null,null,null,null,null,null,null,null,null,0,0,0]
[null,null,null,null,null,null,null,null,null,null,null,null,null,null,null,null,null,null,null,null,null,null,null,null,null,null,null,null,0,0,0]
[null,null,null,null,null,null,null,null,null,null,null,null,null,null,null,null,null,null,null,null,null,null,null,null,null,null,null,null,0,0,0]
[null,null,null,null,null,null,null,null,null,null,null,null,null,null,null,null,null,null,null,null,null,null,null,null,null,null,null,null,0,0,0]
[null,null,null,null,null,null,null,null,null,null,null,null,null,null,null,null,null,null,null,null,null,null,null,null,null,null,null,null,0,0,0]
[null,null,null,null,null,null,null,null,null,null,null,null,null,null,null,null,null,null,null,null,null,null,null,null,null,null,null,null,0,0,0]
[null,null,null,null,null,null,null,null,null,null,null,null,null,null,null,null,null,null,null,null,null,null,null,null,null,null,null,null,0,0,0]
[null,null,null,null,null,null,null,null,null,null,null,null,null,null,null,null,null,null,null,null,null,null,null,null,null,null,null,null,0,0,0]
[null,null,null,null,null,null,null,null,null,null,null,null,null,null,null,null,null,null,null,null,null,null,null,null,null,null,null,null,0,0,0]
[null,null,null,null,null,null,null,null,null,null,null,null,null,null,null,null,null,null,null,null,null,null,null,null,null,null,null,null,0,0,0]
[null,null,null,null,null,null,null,null,null,null,null,null,null,null,null,null,null,null,null,null,null,null,null,null,null,null,null,null,0,0,0]
[null,null,null,null,null,null,null,null,null,null,null,null,null,null,null,null,null,null,null,null,null,null,null,null,null,null,null,null,0,0,0]
[null,null,null,null,null,null,null,null,null,null,null,null,null,null,null,null,null,null,null,null,null,null,null,null,null,null,null,null,0,0,0]
[null,null,null,null,null,null,null,null,null,null,null,null,null,null,null,null,null,null,null,null,null,null,null,null,null,null,null,null,0,0,0]
[null,null,null,null,null,null,null,null,null,null,null,null,null,null,null,null,null,null,null,null,null,null,null,null,null,null,null,null,0,0,0]
[null,null,null,null,null,null,null,null,null,null,null,null,null,null,null,null,null,null,null,null,null,null,null,null,null,null,null,null,0,0,0]
[null,null,null,null,null,null,null,null,null,null,null,null,null,null,null,null,null,null,null,null,null,null,null,null,null,null,null,null,0,0,0]
[null,null,null,null,null,null,null,null,null,null,null,null,null,null,null,null,null,null,null,null,null,null,null,null,null,null,null,null,0,0,0]
[null,null,null,null,null,null,null,null,null,null,null,null,null,null,null,null,null,null,null,null,null,null,null,null,null,null,null,null,0,0,0]
[null,null,null,null,null,null,null,null,null,null,null,null,null,null,null,null,null,null,null,null,null,null,null,null,null,null,null,null,0,0,0]
[null,null,null,null,null,null,null,null,null,null,null,null,null,null,null,null,null,null,null,null,null,null,null,null,null,null,null,null,0,0,0]
[null,null,null,null,null,null,null,null,null,null,null,null,null,null,null,null,null,null,null,null,null,null,null,null,null,null,null,null,0,0,0]
[null,null,null,null,null,null,null,null,null,null,null,null,null,null,null,null,null,null,null,null,null,null,null,null,null,null,null,null,0,0,0]
[null,null,null,null,null,null,null,null,null,null,null,null,null,null,null,null,null,null,null,null,null,null,null,null,null,null,null,null,0,0,0]
[null,null,null,null,null,null,null,null,null,null,null,null,null,null,null,null,null,null,null,null,null,null,null,null,null,null,null,null,0,0,0]
[null,null,null,null,null,null,null,null,null,null,null,null,null,null,null,null,null,null,null,null,null,null,null,null,null,null,null,null,0,0,0]
[null,null,null,null,null,null,null,null,null,null,null,null,null,null,null,null,null,null,null,null,null,null,null,null,null,null,null,null,0,0,0]
[null,null,null,null,null,null,null,null,null,null,null,null,null,null,null,null,null,null,null,null,null,null,null,null,null,null,null,null,0,0,0]
[null,null,null,null,null,null,null,null,null,null,null,null,null,null,null,null,null,null,null,null,null,null,null,null,null,null,null,null,0,0,0]
[null,null,null,null,null,null,null,null,null,null,null,null,null,null,null,null,null,null,null,null,null,null,null,null,null,null,null,null,{"$f":"IF(AA514=0,0,_xlfn.DAYS(AA514,TODAY()))","v":0},0,0]
[null,null,null,null,null,null,null,null,null,null,null,null,null,null,null,null,null,null,null,null,null,null,null,null,null,null,null,null,0,0,{"$f":"IF(Z515=0,0,_xlfn.DAYS(Z515,TODAY()))","v":0}]
[null,null,null,null,null,null,null,null,null,null,null,null,null,null,null,null,null,null,null,null,null,null,null,null,null,null,null,null,0,0,0]
[null,null,null,null,null,null,null,null,null,null,null,null,null,null,null,null,null,null,null,null,null,null,null,null,null,null,null,null,0,0,0]
[null,null,null,null,null,null,null,null,null,null,null,null,null,null,null,null,null,null,null,null,null,null,null,null,null,null,null,null,0,0,0]
[null,null,null,null,null,null,null,null,null,null,null,null,null,null,null,null,null,null,null,null,null,null,null,null,null,null,null,null,0,0,0]
[null,null,null,null,null,null,null,null,null,null,null,null,null,null,null,null,null,null,null,null,null,null,null,null,null,null,null,null,0,0,0]
[null,null,null,null,null,null,null,null,null,null,null,null,null,null,null,null,null,null,null,null,null,null,null,null,null,null,null,null,0,0,0]
[null,null,null,null,null,null,null,null,null,null,null,null,null,null,null,null,null,null,null,null,null,null,null,null,null,null,null,null,0,0,0]
[null,null,null,null,null,null,null,null,null,null,null,null,null,null,null,null,null,null,null,null,null,null,null,null,null,null,null,null,0,0,0]
[null,null,null,null,null,null,null,null,null,null,null,null,null,null,null,null,null,null,null,null,null,null,null,null,null,null,null,null,0,0,0]
[null,null,null,null,null,null,null,null,null,null,null,null,null,null,null,null,null,null,null,null,null,null,null,null,null,null,null,null,0,0,0]
[null,null,null,null,null,null,null,null,null,null,null,null,null,null,null,null,null,null,null,null,null,null,null,null,null,null,null,null,0,0,0]
[null,null,null,null,null,null,null,null,null,null,null,null,null,null,null,null,null,null,null,null,null,null,null,null,null,null,null,null,0,0,0]
[null,null,null,null,null,null,null,null,null,null,null,null,null,null,null,null,null,null,null,null,null,null,null,null,null,null,null,null,0,0,0]
[null,null,null,null,null,null,null,null,null,null,null,null,null,null,null,null,null,null,null,null,null,null,null,null,null,null,null,null,0,0,0]
[null,null,null,null,null,null,null,null,null,null,null,null,null,null,null,null,null,null,null,null,null,null,null,null,null,null,null,null,0,0,0]
[null,null,null,null,null,null,null,null,null,null,null,null,null,null,null,null,null,null,null,null,null,null,null,null,null,null,null,null,0,0,0]
[null,null,null,null,null,null,null,null,null,null,null,null,null,null,null,null,null,null,null,null,null,null,null,null,null,null,null,null,0,0,0]
[null,null,null,null,null,null,null,null,null,null,null,null,null,null,null,null,null,null,null,null,null,null,null,null,null,null,null,null,0,0,0]
[null,null,null,null,null,null,null,null,null,null,null,null,null,null,null,null,null,null,null,null,null,null,null,null,null,null,null,null,0,0]
[null,null,null,null,null,null,null,null,null,null,null,null,null,null,null,null,null,null,null,null,null,null,null,null,null,null,null,null,0,0]
[null,null,null,null,null,null,null,null,null,null,null,null,null,null,null,null,null,null,null,null,null,null,null,null,null,null,null,null,0,0]
[null,null,null,null,null,null,null,null,null,null,null,null,null,null,null,null,null,null,null,null,null,null,null,null,null,null,null,null,0,0]
[null,null,null,null,null,null,null,null,null,null,null,null,null,null,null,null,null,null,null,null,null,null,null,null,null,null,null,null,0,0]
[null,null,null,null,null,null,null,null,null,null,null,null,null,null,null,null,null,null,null,null,null,null,null,null,null,null,null,null,{"$f":"IF(AA539=0,0,_xlfn.DAYS(AA539,TODAY()))","v":0},0]
[null,null,null,null,null,null,null,null,null,null,null,null,null,null,null,null,null,null,null,null,null,null,null,null,null,null,null,null,0,0]
[null,null,null,null,null,null,null,null,null,null,null,null,null,null,null,null,null,null,null,null,null,null,null,null,null,null,null,null,0,0]
[null,null,null,null,null,null,null,null,null,null,null,null,null,null,null,null,null,null,null,null,null,null,null,null,null,null,null,null,0,0]
[null,null,null,null,null,null,null,null,null,null,null,null,null,null,null,null,null,null,null,null,null,null,null,null,null,null,null,null,0,{"$f":"IF(AB543=0,0,_xlfn.DAYS(AB543,TODAY()))","v":0}]
[null,null,null,null,null,null,null,null,null,null,null,null,null,null,null,null,null,null,null,null,null,null,null,null,null,null,null,null,0,0]
[null,null,null,null,null,null,null,null,null,null,null,null,null,null,null,null,null,null,null,null,null,null,null,null,null,null,null,null,0,0]
[null,null,null,null,null,null,null,null,null,null,null,null,null,null,null,null,null,null,null,null,null,null,null,null,null,null,null,null,0,0]
[null,null,null,null,null,null,null,null,null,null,null,null,null,null,null,null,null,null,null,null,null,null,null,null,null,null,null,null,0,0]
[null,null,null,null,null,null,null,null,null,null,null,null,null,null,null,null,null,null,null,null,null,null,null,null,null,null,null,null,0,0]
[null,null,null,null,null,null,null,null,null,null,null,null,null,null,null,null,null,null,null,null,null,null,null,null,null,null,null,null,0,0]
[null,null,null,null,null,null,null,null,null,null,null,null,null,null,null,null,null,null,null,null,null,null,null,null,null,null,null,null,0,0]
[null,null,null,null,null,null,null,null,null,null,null,null,null,null,null,null,null,null,null,null,null,null,null,null,null,null,null,null,0,0]
[null,null,null,null,null,null,null,null,null,null,null,null,null,null,null,null,null,null,null,null,null,null,null,null,null,null,null,null,0,0]
[null,null,null,null,null,null,null,null,null,null,null,null,null,null,null,null,null,null,null,null,null,null,null,null,null,null,null,null,0,0]
[null,null,null,null,null,null,null,null,null,null,null,null,null,null,null,null,null,null,null,null,null,null,null,null,null,null,null,null,0,0]
[null,null,null,null,null,null,null,null,null,null,null,null,null,null,null,null,null,null,null,null,null,null,null,null,null,null,null,null,0,0]
[null,null,null,null,null,null,null,null,null,null,null,null,null,null,null,null,null,null,null,null,null,null,null,null,null,null,null,null,0,0]
[null,null,null,null,null,null,null,null,null,null,null,null,null,null,null,null,null,null,null,null,null,null,null,null,null,null,null,null,0,0]
[null,null,null,null,null,null,null,null,null,null,null,null,null,null,null,null,null,null,null,null,null,null,null,null,null,null,null,null,0,0]
[null,null,null,null,null,null,null,null,null,null,null,null,null,null,null,null,null,null,null,null,null,null,null,null,null,null,null,null,0,0]
[null,null,null,null,null,null,null,null,null,null,null,null,null,null,null,null,null,null,null,null,null,null,null,null,null,null,null,null,0,0]
[null,null,null,null,null,null,null,null,null,null,null,null,null,null,null,null,null,null,null,null,null,null,null,null,null,null,null,null,0,0]
[null,null,null,null,null,null,null,null,null,null,null,null,null,null,null,null,null,null,null,null,null,null,null,null,null,null,null,null,0,0]
[null,null,null,null,null,null,null,null,null,null,null,null,null,null,null,null,null,null,null,null,null,null,null,null,null,null,null,null,0,0]
[null,null,null,null,null,null,null,null,null,null,null,null,null,null,null,null,null,null,null,null,null,null,null,null,null,null,null,null,0,0]
[null,null,null,null,null,null,null,null,null,null,null,null,null,null,null,null,null,null,null,null,null,null,null,null,null,null,null,null,0,0]
[null,null,null,null,null,null,null,null,null,null,null,null,null,null,null,null,null,null,null,null,null,null,null,null,null,null,null,null,0,0]
[null,null,null,null,null,null,null,null,null,null,null,null,null,null,null,null,null,null,null,null,null,null,null,null,null,null,null,null,0,0]
[null,null,null,null,null,null,null,null,null,null,null,null,null,null,null,null,null,null,null,null,null,null,null,null,null,null,null,null,0,0]
[null,null,null,null,null,null,null,null,null,null,null,null,null,null,null,null,null,null,null,null,null,null,null,null,null,null,null,null,0,0]
[null,null,null,null,null,null,null,null,null,null,null,null,null,null,null,null,null,null,null,null,null,null,null,null,null,null,null,null,0,0]
[null,null,null,null,null,null,null,null,null,null,null,null,null,null,null,null,null,null,null,null,null,null,null,null,null,null,null,null,0,0]
[null,null,null,null,null,null,null,null,null,null,null,null,null,null,null,null,null,null,null,null,null,null,null,null,null,null,null,null,0,0]
[null,null,null,null,null,null,null,null,null,null,null,null,null,null,null,null,null,null,null,null,null,null,null,null,null,null,null,null,0,0]
[null,null,null,null,null,null,null,null,null,null,null,null,null,null,null,null,null,null,null,null,null,null,null,null,null,null,null,null,0,0]
[null,null,null,null,null,null,null,null,null,null,null,null,null,null,null,null,null,null,null,null,null,null,null,null,null,null,null,null,0,0]
[null,null,null,null,null,null,null,null,null,null,null,null,null,null,null,null,null,null,null,null,null,null,null,null,null,null,null,null,0,0]
[null,null,null,null,null,null,null,null,null,null,null,null,null,null,null,null,null,null,null,null,null,null,null,null,null,null,null,null,0,0]
[null,null,null,null,null,null,null,null,null,null,null,null,null,null,null,null,null,null,null,null,null,null,null,null,null,null,null,null,{"$f":"IF(AA578=0,0,_xlfn.DAYS(AA578,TODAY()))","v":0},{"$f":"IF(AB578=0,0,_xlfn.DAYS(AB578,TODAY()))","v":0}]
[null,null,null,null,null,null,null,null,null,null,null,null,null,null,null,null,null,null,null,null,null,null,null,null,null,null,null,null,0,0]
[null,null,null,null,null,null,null,null,null,null,null,null,null,null,null,null,null,null,null,null,null,null,null,null,null,null,null,null,0,0]
[null,null,null,null,null,null,null,null,null,null,null,null,null,null,null,null,null,null,null,null,null,null,null,null,null,null,null,null,0,0]
[null,null,null,null,null,null,null,null,null,null,null,null,null,null,null,null,null,null,null,null,null,null,null,null,null,null,null,null,0,0]
[null,null,null,null,null,null,null,null,null,null,null,null,null,null,null,null,null,null,null,null,null,null,null,null,null,null,null,null,0,0]
[null,null,null,null,null,null,null,null,null,null,null,null,null,null,null,null,null,null,null,null,null,null,null,null,null,null,null,null,0,0]
[null,null,null,null,null,null,null,null,null,null,null,null,null,null,null,null,null,null,null,null,null,null,null,null,null,null,null,null,0,0]
[null,null,null,null,null,null,null,null,null,null,null,null,null,null,null,null,null,null,null,null,null,null,null,null,null,null,null,null,0,0]
[null,null,null,null,null,null,null,null,null,null,null,null,null,null,null,null,null,null,null,null,null,null,null,null,null,null,null,null,0,0]
[null,null,null,null,null,null,null,null,null,null,null,null,null,null,null,null,null,null,null,null,null,null,null,null,null,null,null,null,0,0]
[null,null,null,null,null,null,null,null,null,null,null,null,null,null,null,null,null,null,null,null,null,null,null,null,null,null,null,null,0,0]
[null,null,null,null,null,null,null,null,null,null,null,null,null,null,null,null,null,null,null,null,null,null,null,null,null,null,null,null,0,0]
[null,null,null,null,null,null,null,null,null,null,null,null,null,null,null,null,null,null,null,null,null,null,null,null,null,null,null,null,0,0]
[null,null,null,null,null,null,null,null,null,null,null,null,null,null,null,null,null,null,null,null,null,null,null,null,null,null,null,null,0,0]
[null,null,null,null,null,null,null,null,null,null,null,null,null,null,null,null,null,null,null,null,null,null,null,null,null,null,null,null,0,0]
[null,null,null,null,null,null,null,null,null,null,null,null,null,null,null,null,null,null,null,null,null,null,null,null,null,null,null,null,0,0]
[null,null,null,null,null,null,null,null,null,null,null,null,null,null,null,null,null,null,null,null,null,null,null,null,null,null,null,null,0,0]
[null,null,null,null,null,null,null,null,null,null,null,null,null,null,null,null,null,null,null,null,null,null,null,null,null,null,null,null,0,0]
[null,null,null,null,null,null,null,null,null,null,null,null,null,null,null,null,null,null,null,null,null,null,null,null,null,null,null,null,0,0]
[null,null,null,null,null,null,null,null,null,null,null,null,null,null,null,null,null,null,null,null,null,null,null,null,null,null,null,null,0,0]
[null,null,null,null,null,null,null,null,null,null,null,null,null,null,null,null,null,null,null,null,null,null,null,null,null,null,null,null,0,0]
[null,null,null,null,null,null,null,null,null,null,null,null,null,null,null,null,null,null,null,null,null,null,null,null,null,null,null,null,0,0]
[null,null,null,null,null,null,null,null,null,null,null,null,null,null,null,null,null,null,null,null,null,null,null,null,null,null,null,null,0,0]
[null,null,null,null,null,null,null,null,null,null,null,null,null,null,null,null,null,null,null,null,null,null,null,null,null,null,null,null,0,0]
[null,null,null,null,null,null,null,null,null,null,null,null,null,null,null,null,null,null,null,null,null,null,null,null,null,null,null,null,0,0]
[null,null,null,null,null,null,null,null,null,null,null,null,null,null,null,null,null,null,null,null,null,null,null,null,null,null,null,null,0,0]
[null,null,null,null,null,null,null,null,null,null,null,null,null,null,null,null,null,null,null,null,null,null,null,null,null,null,null,null,0,0]
[null,null,null,null,null,null,null,null,null,null,null,null,null,null,null,null,null,null,null,null,null,null,null,null,null,null,null,null,0,0]
[null,null,null,null,null,null,null,null,null,null,null,null,null,null,null,null,null,null,null,null,null,null,null,null,null,null,null,null,0,0]
[null,null,null,null,null,null,null,null,null,null,null,null,null,null,null,null,null,null,null,null,null,null,null,null,null,null,null,null,0,0]
[null,null,null,null,null,null,null,null,null,null,null,null,null,null,null,null,null,null,null,null,null,null,null,null,null,null,null,null,0,0]
[null,null,null,null,null,null,null,null,null,null,null,null,null,null,null,null,null,null,null,null,null,null,null,null,null,null,null,null,0,0]
[null,null,null,null,null,null,null,null,null,null,null,null,null,null,null,null,null,null,null,null,null,null,null,null,null,null,null,null,0,0]
[null,null,null,null,null,null,null,null,null,null,null,null,null,null,null,null,null,null,null,null,null,null,null,null,null,null,null,null,0,0]
[null,null,null,null,null,null,null,null,null,null,null,null,null,null,null,null,null,null,null,null,null,null,null,null,null,null,null,null,0,0]
[null,null,null,null,null,null,null,null,null,null,null,null,null,null,null,null,null,null,null,null,null,null,null,null,null,null,null,null,0,0]
[null,null,null,null,null,null,null,null,null,null,null,null,null,null,null,null,null,null,null,null,null,null,null,null,null,null,null,null,0,0]
[null,null,null,null,null,null,null,null,null,null,null,null,null,null,null,null,null,null,null,null,null,null,null,null,null,null,null,null,0,0]
[null,null,null,null,null,null,null,null,null,null,null,null,null,null,null,null,null,null,null,null,null,null,null,null,null,null,null,null,0,0]
[null,null,null,null,null,null,null,null,null,null,null,null,null,null,null,null,null,null,null,null,null,null,null,null,null,null,null,null,0,0]
[null,null,null,null,null,null,null,null,null,null,null,null,null,null,null,null,null,null,null,null,null,null,null,null,null,null,null,null,0,0]
[null,null,null,null,null,null,null,null,null,null,null,null,null,null,null,null,null,null,null,null,null,null,null,null,null,null,null,null,0,0]
[null,null,null,null,null,null,null,null,null,null,null,null,null,null,null,null,null,null,null,null,null,null,null,null,null,null,null,null,0,0]
[null,null,null,null,null,null,null,null,null,null,null,null,null,null,null,null,null,null,null,null,null,null,null,null,null,null,null,null,0,0]
[null,null,null,null,null,null,null,null,null,null,null,null,null,null,null,null,null,null,null,null,null,null,null,null,null,null,null,null,0,0]
[null,null,null,null,null,null,null,null,null,null,null,null,null,null,null,null,null,null,null,null,null,null,null,null,null,null,null,null,0,0]
[null,null,null,null,null,null,null,null,null,null,null,null,null,null,null,null,null,null,null,null,null,null,null,null,null,null,null,null,0,0]
[null,null,null,null,null,null,null,null,null,null,null,null,null,null,null,null,null,null,null,null,null,null,null,null,null,null,null,null,0,0]
[null,null,null,null,null,null,null,null,null,null,null,null,null,null,null,null,null,null,null,null,null,null,null,null,null,null,null,null,0,0]
[null,null,null,null,null,null,null,null,null,null,null,null,null,null,null,null,null,null,null,null,null,null,null,null,null,null,null,null,0,0]
[null,null,null,null,null,null,null,null,null,null,null,null,null,null,null,null,null,null,null,null,null,null,null,null,null,null,null,null,0,0]
[null,null,null,null,null,null,null,null,null,null,null,null,null,null,null,null,null,null,null,null,null,null,null,null,null,null,null,null,0,0]
[null,null,null,null,null,null,null,null,null,null,null,null,null,null,null,null,null,null,null,null,null,null,null,null,null,null,null,null,0,0]
[null,null,null,null,null,null,null,null,null,null,null,null,null,null,null,null,null,null,null,null,null,null,null,null,null,null,null,null,0,0]
[null,null,null,null,null,null,null,null,null,null,null,null,null,null,null,null,null,null,null,null,null,null,null,null,null,null,null,null,0,0]
[null,null,null,null,null,null,null,null,null,null,null,null,null,null,null,null,null,null,null,null,null,null,null,null,null,null,null,null,0,0]
[null,null,null,null,null,null,null,null,null,null,null,null,null,null,null,null,null,null,null,null,null,null,null,null,null,null,null,null,0,0]
[null,null,null,null,null,null,null,null,null,null,null,null,null,null,null,null,null,null,null,null,null,null,null,null,null,null,null,null,0,0]
[null,null,null,null,null,null,null,null,null,null,null,null,null,null,null,null,null,null,null,null,null,null,null,null,null,null,null,null,0,0]
[null,null,null,null,null,null,null,null,null,null,null,null,null,null,null,null,null,null,null,null,null,null,null,null,null,null,null,null,0,0]
[null,null,null,null,null,null,null,null,null,null,null,null,null,null,null,null,null,null,null,null,null,null,null,null,null,null,null,null,0,0]
[null,null,null,null,null,null,null,null,null,null,null,null,null,null,null,null,null,null,null,null,null,null,null,null,null,null,null,null,0,0]
[null,null,null,null,null,null,null,null,null,null,null,null,null,null,null,null,null,null,null,null,null,null,null,null,null,null,null,null,0,0]
[null,null,null,null,null,null,null,null,null,null,null,null,null,null,null,null,null,null,null,null,null,null,null,null,null,null,null,null,{"$f":"IF(AA642=0,0,_xlfn.DAYS(AA642,TODAY()))","v":0},{"$f":"IF(AB642=0,0,_xlfn.DAYS(AB642,TODAY()))","v":0}]
[null,null,null,null,null,null,null,null,null,null,null,null,null,null,null,null,null,null,null,null,null,null,null,null,null,null,null,null,0,0]
[null,null,null,null,null,null,null,null,null,null,null,null,null,null,null,null,null,null,null,null,null,null,null,null,null,null,null,null,0,0]
[null,null,null,null,null,null,null,null,null,null,null,null,null,null,null,null,null,null,null,null,null,null,null,null,null,null,null,null,0,0]
[null,null,null,null,null,null,null,null,null,null,null,null,null,null,null,null,null,null,null,null,null,null,null,null,null,null,null,null,0,0]
[null,null,null,null,null,null,null,null,null,null,null,null,null,null,null,null,null,null,null,null,null,null,null,null,null,null,null,null,0,0]
[null,null,null,null,null,null,null,null,null,null,null,null,null,null,null,null,null,null,null,null,null,null,null,null,null,null,null,null,0,0]
[null,null,null,null,null,null,null,null,null,null,null,null,null,null,null,null,null,null,null,null,null,null,null,null,null,null,null,null,0,0]
[null,null,null,null,null,null,null,null,null,null,null,null,null,null,null,null,null,null,null,null,null,null,null,null,null,null,null,null,0,0]
[null,null,null,null,null,null,null,null,null,null,null,null,null,null,null,null,null,null,null,null,null,null,null,null,null,null,null,null,0,0]
[null,null,null,null,null,null,null,null,null,null,null,null,null,null,null,null,null,null,null,null,null,null,null,null,null,null,null,null,0,0]
[null,null,null,null,null,null,null,null,null,null,null,null,null,null,null,null,null,null,null,null,null,null,null,null,null,null,null,null,0,0]
[null,null,null,null,null,null,null,null,null,null,null,null,null,null,null,null,null,null,null,null,null,null,null,null,null,null,null,null,0,0]
[null,null,null,null,null,null,null,null,null,null,null,null,null,null,null,null,null,null,null,null,null,null,null,null,null,null,null,null,0,0]
[null,null,null,null,null,null,null,null,null,null,null,null,null,null,null,null,null,null,null,null,null,null,null,null,null,null,null,null,0,0]
[null,null,null,null,null,null,null,null,null,null,null,null,null,null,null,null,null,null,null,null,null,null,null,null,null,null,null,null,0,0]
[null,null,null,null,null,null,null,null,null,null,null,null,null,null,null,null,null,null,null,null,null,null,null,null,null,null,null,null,0,0]
[null,null,null,null,null,null,null,null,null,null,null,null,null,null,null,null,null,null,null,null,null,null,null,null,null,null,null,null,0,0]
[null,null,null,null,null,null,null,null,null,null,null,null,null,null,null,null,null,null,null,null,null,null,null,null,null,null,null,null,0,0]
[null,null,null,null,null,null,null,null,null,null,null,null,null,null,null,null,null,null,null,null,null,null,null,null,null,null,null,null,0,0]
[null,null,null,null,null,null,null,null,null,null,null,null,null,null,null,null,null,null,null,null,null,null,null,null,null,null,null,null,0,0]
[null,null,null,null,null,null,null,null,null,null,null,null,null,null,null,null,null,null,null,null,null,null,null,null,null,null,null,null,0,0]
[null,null,null,null,null,null,null,null,null,null,null,null,null,null,null,null,null,null,null,null,null,null,null,null,null,null,null,null,0,0]
[null,null,null,null,null,null,null,null,null,null,null,null,null,null,null,null,null,null,null,null,null,null,null,null,null,null,null,null,0,0]
[null,null,null,null,null,null,null,null,null,null,null,null,null,null,null,null,null,null,null,null,null,null,null,null,null,null,null,null,0,0]
[null,null,null,null,null,null,null,null,null,null,null,null,null,null,null,null,null,null,null,null,null,null,null,null,null,null,null,null,0,0]
[null,null,null,null,null,null,null,null,null,null,null,null,null,null,null,null,null,null,null,null,null,null,null,null,null,null,null,null,0,0]
[null,null,null,null,null,null,null,null,null,null,null,null,null,null,null,null,null,null,null,null,null,null,null,null,null,null,null,null,0,0]
[null,null,null,null,null,null,null,null,null,null,null,null,null,null,null,null,null,null,null,null,null,null,null,null,null,null,null,null,0,0]
[null,null,null,null,null,null,null,null,null,null,null,null,null,null,null,null,null,null,null,null,null,null,null,null,null,null,null,null,0,0]
[null,null,null,null,null,null,null,null,null,null,null,null,null,null,null,null,null,null,null,null,null,null,null,null,null,null,null,null,0,0]
[null,null,null,null,null,null,null,null,null,null,null,null,null,null,null,null,null,null,null,null,null,null,null,null,null,null,null,null,0,0]
[null,null,null,null,null,null,null,null,null,null,null,null,null,null,null,null,null,null,null,null,null,null,null,null,null,null,null,null,0,0]
[null,null,null,null,null,null,null,null,null,null,null,null,null,null,null,null,null,null,null,null,null,null,null,null,null,null,null,null,0,0]
[null,null,null,null,null,null,null,null,null,null,null,null,null,null,null,null,null,null,null,null,null,null,null,null,null,null,null,null,0,0]
[null,null,null,null,null,null,null,null,null,null,null,null,null,null,null,null,null,null,null,null,null,null,null,null,null,null,null,null,0,0]
[null,null,null,null,null,null,null,null,null,null,null,null,null,null,null,null,null,null,null,null,null,null,null,null,null,null,null,null,0,0]
[null,null,null,null,null,null,null,null,null,null,null,null,null,null,null,null,null,null,null,null,null,null,null,null,null,null,null,null,0,0]
[null,null,null,null,null,null,null,null,null,null,null,null,null,null,null,null,null,null,null,null,null,null,null,null,null,null,null,null,0,0]
[null,null,null,null,null,null,null,null,null,null,null,null,null,null,null,null,null,null,null,null,null,null,null,null,null,null,null,null,0,0]
[null,null,null,null,null,null,null,null,null,null,null,null,null,null,null,null,null,null,null,null,null,null,null,null,null,null,null,null,0,0]
[null,null,null,null,null,null,null,null,null,null,null,null,null,null,null,null,null,null,null,null,null,null,null,null,null,null,null,null,0,0]
[null,null,null,null,null,null,null,null,null,null,null,null,null,null,null,null,null,null,null,null,null,null,null,null,null,null,null,null,0,0]
[null,null,null,null,null,null,null,null,null,null,null,null,null,null,null,null,null,null,null,null,null,null,null,null,null,null,null,null,0,0]
[null,null,null,null,null,null,null,null,null,null,null,null,null,null,null,null,null,null,null,null,null,null,null,null,null,null,null,null,0,0]
[null,null,null,null,null,null,null,null,null,null,null,null,null,null,null,null,null,null,null,null,null,null,null,null,null,null,null,null,0,0]
[null,null,null,null,null,null,null,null,null,null,null,null,null,null,null,null,null,null,null,null,null,null,null,null,null,null,null,null,0,0]
[null,null,null,null,null,null,null,null,null,null,null,null,null,null,null,null,null,null,null,null,null,null,null,null,null,null,null,null,0,0]
[null,null,null,null,null,null,null,null,null,null,null,null,null,null,null,null,null,null,null,null,null,null,null,null,null,null,null,null,0,0]
[null,null,null,null,null,null,null,null,null,null,null,null,null,null,null,null,null,null,null,null,null,null,null,null,null,null,null,null,0,0]
[null,null,null,null,null,null,null,null,null,null,null,null,null,null,null,null,null,null,null,null,null,null,null,null,null,null,null,null,0,0]
[null,null,null,null,null,null,null,null,null,null,null,null,null,null,null,null,null,null,null,null,null,null,null,null,null,null,null,null,0,0]
[null,null,null,null,null,null,null,null,null,null,null,null,null,null,null,null,null,null,null,null,null,null,null,null,null,null,null,null,0,0]
[null,null,null,null,null,null,null,null,null,null,null,null,null,null,null,null,null,null,null,null,null,null,null,null,null,null,null,null,0,0]
[null,null,null,null,null,null,null,null,null,null,null,null,null,null,null,null,null,null,null,null,null,null,null,null,null,null,null,null,0,0]
[null,null,null,null,null,null,null,null,null,null,null,null,null,null,null,null,null,null,null,null,null,null,null,null,null,null,null,null,0,0]
[null,null,null,null,null,null,null,null,null,null,null,null,null,null,null,null,null,null,null,null,null,null,null,null,null,null,null,null,0,0]
[null,null,null,null,null,null,null,null,null,null,null,null,null,null,null,null,null,null,null,null,null,null,null,null,null,null,null,null,0,0]
[null,null,null,null,null,null,null,null,null,null,null,null,null,null,null,null,null,null,null,null,null,null,null,null,null,null,null,null,0,0]
[null,null,null,null,null,null,null,null,null,null,null,null,null,null,null,null,null,null,null,null,null,null,null,null,null,null,null,null,0,0]
[null,null,null,null,null,null,null,null,null,null,null,null,null,null,null,null,null,null,null,null,null,null,null,null,null,null,null,null,0,0]
[null,null,null,null,null,null,null,null,null,null,null,null,null,null,null,null,null,null,null,null,null,null,null,null,null,null,null,null,0,0]
[null,null,null,null,null,null,null,null,null,null,null,null,null,null,null,null,null,null,null,null,null,null,null,null,null,null,null,null,0,0]
[null,null,null,null,null,null,null,null,null,null,null,null,null,null,null,null,null,null,null,null,null,null,null,null,null,null,null,null,0,0]
[null,null,null,null,null,null,null,null,null,null,null,null,null,null,null,null,null,null,null,null,null,null,null,null,null,null,null,null,{"$f":"IF(AA706=0,0,_xlfn.DAYS(AA706,TODAY()))","v":0},{"$f":"IF(AB706=0,0,_xlfn.DAYS(AB706,TODAY()))","v":0}]
[null,null,null,null,null,null,null,null,null,null,null,null,null,null,null,null,null,null,null,null,null,null,null,null,null,null,null,null,0,0]
[null,null,null,null,null,null,null,null,null,null,null,null,null,null,null,null,null,null,null,null,null,null,null,null,null,null,null,null,0,0]
[null,null,null,null,null,null,null,null,null,null,null,null,null,null,null,null,null,null,null,null,null,null,null,null,null,null,null,null,0,0]
[null,null,null,null,null,null,null,null,null,null,null,null,null,null,null,null,null,null,null,null,null,null,null,null,null,null,null,null,0,0]
[null,null,null,null,null,null,null,null,null,null,null,null,null,null,null,null,null,null,null,null,null,null,null,null,null,null,null,null,0,0]
[null,null,null,null,null,null,null,null,null,null,null,null,null,null,null,null,null,null,null,null,null,null,null,null,null,null,null,null,0,0]
[null,null,null,null,null,null,null,null,null,null,null,null,null,null,null,null,null,null,null,null,null,null,null,null,null,null,null,null,0,0]
[null,null,null,null,null,null,null,null,null,null,null,null,null,null,null,null,null,null,null,null,null,null,null,null,null,null,null,null,0,0]
[null,null,null,null,null,null,null,null,null,null,null,null,null,null,null,null,null,null,null,null,null,null,null,null,null,null,null,null,0,0]
[null,null,null,null,null,null,null,null,null,null,null,null,null,null,null,null,null,null,null,null,null,null,null,null,null,null,null,null,0,0]
[null,null,null,null,null,null,null,null,null,null,null,null,null,null,null,null,null,null,null,null,null,null,null,null,null,null,null,null,0,0]
[null,null,null,null,null,null,null,null,null,null,null,null,null,null,null,null,null,null,null,null,null,null,null,null,null,null,null,null,0,0]
[null,null,null,null,null,null,null,null,null,null,null,null,null,null,null,null,null,null,null,null,null,null,null,null,null,null,null,null,0,0]
[null,null,null,null,null,null,null,null,null,null,null,null,null,null,null,null,null,null,null,null,null,null,null,null,null,null,null,null,0,0]
[null,null,null,null,null,null,null,null,null,null,null,null,null,null,null,null,null,null,null,null,null,null,null,null,null,null,null,null,0,0]
[null,null,null,null,null,null,null,null,null,null,null,null,null,null,null,null,null,null,null,null,null,null,null,null,null,null,null,null,0,0]
[null,null,null,null,null,null,null,null,null,null,null,null,null,null,null,null,null,null,null,null,null,null,null,null,null,null,null,null,0,0]
[null,null,null,null,null,null,null,null,null,null,null,null,null,null,null,null,null,null,null,null,null,null,null,null,null,null,null,null,0,0]
[null,null,null,null,null,null,null,null,null,null,null,null,null,null,null,null,null,null,null,null,null,null,null,null,null,null,null,null,0,0]
[null,null,null,null,null,null,null,null,null,null,null,null,null,null,null,null,null,null,null,null,null,null,null,null,null,null,null,null,0,0]
[null,null,null,null,null,null,null,null,null,null,null,null,null,null,null,null,null,null,null,null,null,null,null,null,null,null,null,null,0,0]
[null,null,null,null,null,null,null,null,null,null,null,null,null,null,null,null,null,null,null,null,null,null,null,null,null,null,null,null,0,0]
[null,null,null,null,null,null,null,null,null,null,null,null,null,null,null,null,null,null,null,null,null,null,null,null,null,null,null,null,0,0]
[null,null,null,null,null,null,null,null,null,null,null,null,null,null,null,null,null,null,null,null,null,null,null,null,null,null,null,null,0,0]
[null,null,null,null,null,null,null,null,null,null,null,null,null,null,null,null,null,null,null,null,null,null,null,null,null,null,null,null,0,0]
[null,null,null,null,null,null,null,null,null,null,null,null,null,null,null,null,null,null,null,null,null,null,null,null,null,null,null,null,0,0]
[null,null,null,null,null,null,null,null,null,null,null,null,null,null,null,null,null,null,null,null,null,null,null,null,null,null,null,null,0,0]
[null,null,null,null,null,null,null,null,null,null,null,null,null,null,null,null,null,null,null,null,null,null,null,null,null,null,null,null,0,0]
[null,null,null,null,null,null,null,null,null,null,null,null,null,null,null,null,null,null,null,null,null,null,null,null,null,null,null,null,0,0]
[null,null,null,null,null,null,null,null,null,null,null,null,null,null,null,null,null,null,null,null,null,null,null,null,null,null,null,null,0,0]
[null,null,null,null,null,null,null,null,null,null,null,null,null,null,null,null,null,null,null,null,null,null,null,null,null,null,null,null,0,0]
[null,null,null,null,null,null,null,null,null,null,null,null,null,null,null,null,null,null,null,null,null,null,null,null,null,null,null,null,0,0]
[null,null,null,null,null,null,null,null,null,null,null,null,null,null,null,null,null,null,null,null,null,null,null,null,null,null,null,null,0,0]
[null,null,null,null,null,null,null,null,null,null,null,null,null,null,null,null,null,null,null,null,null,null,null,null,null,null,null,null,0,0]
[null,null,null,null,null,null,null,null,null,null,null,null,null,null,null,null,null,null,null,null,null,null,null,null,null,null,null,null,0,0]
[null,null,null,null,null,null,null,null,null,null,null,null,null,null,null,null,null,null,null,null,null,null,null,null,null,null,null,null,0,0]
[null,null,null,null,null,null,null,null,null,null,null,null,null,null,null,null,null,null,null,null,null,null,null,null,null,null,null,null,0,0]
[null,null,null,null,null,null,null,null,null,null,null,null,null,null,null,null,null,null,null,null,null,null,null,null,null,null,null,null,0,0]
[null,null,null,null,null,null,null,null,null,null,null,null,null,null,null,null,null,null,null,null,null,null,null,null,null,null,null,null,0,0]
[null,null,null,null,null,null,null,null,null,null,null,null,null,null,null,null,null,null,null,null,null,null,null,null,null,null,null,null,0,0]
[null,null,null,null,null,null,null,null,null,null,null,null,null,null,null,null,null,null,null,null,null,null,null,null,null,null,null,null,0,0]
[null,null,null,null,null,null,null,null,null,null,null,null,null,null,null,null,null,null,null,null,null,null,null,null,null,null,null,null,0,0]
[null,null,null,null,null,null,null,null,null,null,null,null,null,null,null,null,null,null,null,null,null,null,null,null,null,null,null,null,0,0]
[null,null,null,null,null,null,null,null,null,null,null,null,null,null,null,null,null,null,null,null,null,null,null,null,null,null,null,null,0,0]
[null,null,null,null,null,null,null,null,null,null,null,null,null,null,null,null,null,null,null,null,null,null,null,null,null,null,null,null,0,0]
[null,null,null,null,null,null,null,null,null,null,null,null,null,null,null,null,null,null,null,null,null,null,null,null,null,null,null,null,0,0]
[null,null,null,null,null,null,null,null,null,null,null,null,null,null,null,null,null,null,null,null,null,null,null,null,null,null,null,null,0,0]
[null,null,null,null,null,null,null,null,null,null,null,null,null,null,null,null,null,null,null,null,null,null,null,null,null,null,null,null,0,0]
[null,null,null,null,null,null,null,null,null,null,null,null,null,null,null,null,null,null,null,null,null,null,null,null,null,null,null,null,0,0]
[null,null,null,null,null,null,null,null,null,null,null,null,null,null,null,null,null,null,null,null,null,null,null,null,null,null,null,null,0,0]
[null,null,null,null,null,null,null,null,null,null,null,null,null,null,null,null,null,null,null,null,null,null,null,null,null,null,null,null,0,0]
[null,null,null,null,null,null,null,null,null,null,null,null,null,null,null,null,null,null,null,null,null,null,null,null,null,null,null,null,0,0]
[null,null,null,null,null,null,null,null,null,null,null,null,null,null,null,null,null,null,null,null,null,null,null,null,null,null,null,null,0,0]
[null,null,null,null,null,null,null,null,null,null,null,null,null,null,null,null,null,null,null,null,null,null,null,null,null,null,null,null,0,0]
[null,null,null,null,null,null,null,null,null,null,null,null,null,null,null,null,null,null,null,null,null,null,null,null,null,null,null,null,0,0]
[null,null,null,null,null,null,null,null,null,null,null,null,null,null,null,null,null,null,null,null,null,null,null,null,null,null,null,null,0,0]
[null,null,null,null,null,null,null,null,null,null,null,null,null,null,null,null,null,null,null,null,null,null,null,null,null,null,null,null,0,0]
[null,null,null,null,null,null,null,null,null,null,null,null,null,null,null,null,null,null,null,null,null,null,null,null,null,null,null,null,0,0]
[null,null,null,null,null,null,null,null,null,null,null,null,null,null,null,null,null,null,null,null,null,null,null,null,null,null,null,null,0,0]
[null,null,null,null,null,null,null,null,null,null,null,null,null,null,null,null,null,null,null,null,null,null,null,null,null,null,null,null,0,0]
[null,null,null,null,null,null,null,null,null,null,null,null,null,null,null,null,null,null,null,null,null,null,null,null,null,null,null,null,0,0]
[null,null,null,null,null,null,null,null,null,null,null,null,null,null,null,null,null,null,null,null,null,null,null,null,null,null,null,null,0,0]
[null,null,null,null,null,null,null,null,null,null,null,null,null,null,null,null,null,null,null,null,null,null,null,null,null,null,null,null,0,0]
[null,null,null,null,null,null,null,null,null,null,null,null,null,null,null,null,null,null,null,null,null,null,null,null,null,null,null,null,{"$f":"IF(AA770=0,0,_xlfn.DAYS(AA770,TODAY()))","v":0},{"$f":"IF(AB770=0,0,_xlfn.DAYS(AB770,TODAY()))","v":0}]
[null,null,null,null,null,null,null,null,null,null,null,null,null,null,null,null,null,null,null,null,null,null,null,null,null,null,null,null,0,0]
[null,null,null,null,null,null,null,null,null,null,null,null,null,null,null,null,null,null,null,null,null,null,null,null,null,null,null,null,0,0]
[null,null,null,null,null,null,null,null,null,null,null,null,null,null,null,null,null,null,null,null,null,null,null,null,null,null,null,null,0,0]
[null,null,null,null,null,null,null,null,null,null,null,null,null,null,null,null,null,null,null,null,null,null,null,null,null,null,null,null,0,0]
[null,null,null,null,null,null,null,null,null,null,null,null,null,null,null,null,null,null,null,null,null,null,null,null,null,null,null,null,0,0]
[null,null,null,null,null,null,null,null,null,null,null,null,null,null,null,null,null,null,null,null,null,null,null,null,null,null,null,null,0,0]
[null,null,null,null,null,null,null,null,null,null,null,null,null,null,null,null,null,null,null,null,null,null,null,null,null,null,null,null,0,0]
[null,null,null,null,null,null,null,null,null,null,null,null,null,null,null,null,null,null,null,null,null,null,null,null,null,null,null,null,0,0]
[null,null,null,null,null,null,null,null,null,null,null,null,null,null,null,null,null,null,null,null,null,null,null,null,null,null,null,null,0,0]
[null,null,null,null,null,null,null,null,null,null,null,null,null,null,null,null,null,null,null,null,null,null,null,null,null,null,null,null,0,0]
[null,null,null,null,null,null,null,null,null,null,null,null,null,null,null,null,null,null,null,null,null,null,null,null,null,null,null,null,0,0]
[null,null,null,null,null,null,null,null,null,null,null,null,null,null,null,null,null,null,null,null,null,null,null,null,null,null,null,null,0,0]
[null,null,null,null,null,null,null,null,null,null,null,null,null,null,null,null,null,null,null,null,null,null,null,null,null,null,null,null,0,0]
[null,null,null,null,null,null,null,null,null,null,null,null,null,null,null,null,null,null,null,null,null,null,null,null,null,null,null,null,0,0]
[null,null,null,null,null,null,null,null,null,null,null,null,null,null,null,null,null,null,null,null,null,null,null,null,null,null,null,null,0,0]
[null,null,null,null,null,null,null,null,null,null,null,null,null,null,null,null,null,null,null,null,null,null,null,null,null,null,null,null,0,0]
[null,null,null,null,null,null,null,null,null,null,null,null,null,null,null,null,null,null,null,null,null,null,null,null,null,null,null,null,0,0]
[null,null,null,null,null,null,null,null,null,null,null,null,null,null,null,null,null,null,null,null,null,null,null,null,null,null,null,null,0,0]
[null,null,null,null,null,null,null,null,null,null,null,null,null,null,null,null,null,null,null,null,null,null,null,null,null,null,null,null,0,0]
[null,null,null,null,null,null,null,null,null,null,null,null,null,null,null,null,null,null,null,null,null,null,null,null,null,null,null,null,0,0]
[null,null,null,null,null,null,null,null,null,null,null,null,null,null,null,null,null,null,null,null,null,null,null,null,null,null,null,null,0,0]
[null,null,null,null,null,null,null,null,null,null,null,null,null,null,null,null,null,null,null,null,null,null,null,null,null,null,null,null,0,0]
[null,null,null,null,null,null,null,null,null,null,null,null,null,null,null,null,null,null,null,null,null,null,null,null,null,null,null,null,0,0]
[null,null,null,null,null,null,null,null,null,null,null,null,null,null,null,null,null,null,null,null,null,null,null,null,null,null,null,null,0,0]
[null,null,null,null,null,null,null,null,null,null,null,null,null,null,null,null,null,null,null,null,null,null,null,null,null,null,null,null,0,0]
[null,null,null,null,null,null,null,null,null,null,null,null,null,null,null,null,null,null,null,null,null,null,null,null,null,null,null,null,0,0]
[null,null,null,null,null,null,null,null,null,null,null,null,null,null,null,null,null,null,null,null,null,null,null,null,null,null,null,null,0,0]
[null,null,null,null,null,null,null,null,null,null,null,null,null,null,null,null,null,null,null,null,null,null,null,null,null,null,null,null,0,0]
[null,null,null,null,null,null,null,null,null,null,null,null,null,null,null,null,null,null,null,null,null,null,null,null,null,null,null,null,0,0]
[null,null,null,null,null,null,null,null,null,null,null,null,null,null,null,null,null,null,null,null,null,null,null,null,null,null,null,null,0,0]
[null,null,null,null,null,null,null,null,null,null,null,null,null,null,null,null,null,null,null,null,null,null,null,null,null,null,null,null,0,0]
[null,null,null,null,null,null,null,null,null,null,null,null,null,null,null,null,null,null,null,null,null,null,null,null,null,null,null,null,0,0]
[null,null,null,null,null,null,null,null,null,null,null,null,null,null,null,null,null,null,null,null,null,null,null,null,null,null,null,null,0,0]
[null,null,null,null,null,null,null,null,null,null,null,null,null,null,null,null,null,null,null,null,null,null,null,null,null,null,null,null,0,0]
[null,null,null,null,null,null,null,null,null,null,null,null,null,null,null,null,null,null,null,null,null,null,null,null,null,null,null,null,0,0]
[null,null,null,null,null,null,null,null,null,null,null,null,null,null,null,null,null,null,null,null,null,null,null,null,null,null,null,null,0,0]
[null,null,null,null,null,null,null,null,null,null,null,null,null,null,null,null,null,null,null,null,null,null,null,null,null,null,null,null,0,0]
[null,null,null,null,null,null,null,null,null,null,null,null,null,null,null,null,null,null,null,null,null,null,null,null,null,null,null,null,0,0]
[null,null,null,null,null,null,null,null,null,null,null,null,null,null,null,null,null,null,null,null,null,null,null,null,null,null,null,null,0,0]
[null,null,null,null,null,null,null,null,null,null,null,null,null,null,null,null,null,null,null,null,null,null,null,null,null,null,null,null,0,0]
[null,null,null,null,null,null,null,null,null,null,null,null,null,null,null,null,null,null,null,null,null,null,null,null,null,null,null,null,0,0]
[null,null,null,null,null,null,null,null,null,null,null,null,null,null,null,null,null,null,null,null,null,null,null,null,null,null,null,null,0,0]
[null,null,null,null,null,null,null,null,null,null,null,null,null,null,null,null,null,null,null,null,null,null,null,null,null,null,null,null,0,0]
[null,null,null,null,null,null,null,null,null,null,null,null,null,null,null,null,null,null,null,null,null,null,null,null,null,null,null,null,0,0]
[null,null,null,null,null,null,null,null,null,null,null,null,null,null,null,null,null,null,null,null,null,null,null,null,null,null,null,null,0,0]
[null,null,null,null,null,null,null,null,null,null,null,null,null,null,null,null,null,null,null,null,null,null,null,null,null,null,null,null,0,0]
[null,null,null,null,null,null,null,null,null,null,null,null,null,null,null,null,null,null,null,null,null,null,null,null,null,null,null,null,0,0]
[null,null,null,null,null,null,null,null,null,null,null,null,null,null,null,null,null,null,null,null,null,null,null,null,null,null,null,null,0,0]
[null,null,null,null,null,null,null,null,null,null,null,null,null,null,null,null,null,null,null,null,null,null,null,null,null,null,null,null,0,0]
[null,null,null,null,null,null,null,null,null,null,null,null,null,null,null,null,null,null,null,null,null,null,null,null,null,null,null,null,0,0]
[null,null,null,null,null,null,null,null,null,null,null,null,null,null,null,null,null,null,null,null,null,null,null,null,null,null,null,null,0,0]
[null,null,null,null,null,null,null,null,null,null,null,null,null,null,null,null,null,null,null,null,null,null,null,null,null,null,null,null,0,0]
[null,null,null,null,null,null,null,null,null,null,null,null,null,null,null,null,null,null,null,null,null,null,null,null,null,null,null,null,0,0]
[null,null,null,null,null,null,null,null,null,null,null,null,null,null,null,null,null,null,null,null,null,null,null,null,null,null,null,null,0,0]
[null,null,null,null,null,null,null,null,null,null,null,null,null,null,null,null,null,null,null,null,null,null,null,null,null,null,null,null,0,0]
[null,null,null,null,null,null,null,null,null,null,null,null,null,null,null,null,null,null,null,null,null,null,null,null,null,null,null,null,0,0]
[null,null,null,null,null,null,null,null,null,null,null,null,null,null,null,null,null,null,null,null,null,null,null,null,null,null,null,null,0,0]
[null,null,null,null,null,null,null,null,null,null,null,null,null,null,null,null,null,null,null,null,null,null,null,null,null,null,null,null,0,0]
[null,null,null,null,null,null,null,null,null,null,null,null,null,null,null,null,null,null,null,null,null,null,null,null,null,null,null,null,0,0]
[null,null,null,null,null,null,null,null,null,null,null,null,null,null,null,null,null,null,null,null,null,null,null,null,null,null,null,null,0,0]
[null,null,null,null,null,null,null,null,null,null,null,null,null,null,null,null,null,null,null,null,null,null,null,null,null,null,null,null,0,0]
[null,null,null,null,null,null,null,null,null,null,null,null,null,null,null,null,null,null,null,null,null,null,null,null,null,null,null,null,0,0]
[null,null,null,null,null,null,null,null,null,null,null,null,null,null,null,null,null,null,null,null,null,null,null,null,null,null,null,null,0,0]
[null,null,null,null,null,null,null,null,null,null,null,null,null,null,null,null,null,null,null,null,null,null,null,null,null,null,null,null,{"$f":"IF(AA834=0,0,_xlfn.DAYS(AA834,TODAY()))","v":0},{"$f":"IF(AB834=0,0,_xlfn.DAYS(AB834,TODAY()))","v":0}]
[null,null,null,null,null,null,null,null,null,null,null,null,null,null,null,null,null,null,null,null,null,null,null,null,null,null,null,null,0,0]
[null,null,null,null,null,null,null,null,null,null,null,null,null,null,null,null,null,null,null,null,null,null,null,null,null,null,null,null,0,0]
[null,null,null,null,null,null,null,null,null,null,null,null,null,null,null,null,null,null,null,null,null,null,null,null,null,null,null,null,0,0]
[null,null,null,null,null,null,null,null,null,null,null,null,null,null,null,null,null,null,null,null,null,null,null,null,null,null,null,null,0,0]
[null,null,null,null,null,null,null,null,null,null,null,null,null,null,null,null,null,null,null,null,null,null,null,null,null,null,null,null,0,0]
[null,null,null,null,null,null,null,null,null,null,null,null,null,null,null,null,null,null,null,null,null,null,null,null,null,null,null,null,0,0]
[null,null,null,null,null,null,null,null,null,null,null,null,null,null,null,null,null,null,null,null,null,null,null,null,null,null,null,null,0,0]
[null,null,null,null,null,null,null,null,null,null,null,null,null,null,null,null,null,null,null,null,null,null,null,null,null,null,null,null,0,0]
[null,null,null,null,null,null,null,null,null,null,null,null,null,null,null,null,null,null,null,null,null,null,null,null,null,null,null,null,0,0]
[null,null,null,null,null,null,null,null,null,null,null,null,null,null,null,null,null,null,null,null,null,null,null,null,null,null,null,null,0,0]
[null,null,null,null,null,null,null,null,null,null,null,null,null,null,null,null,null,null,null,null,null,null,null,null,null,null,null,null,0,0]
[null,null,null,null,null,null,null,null,null,null,null,null,null,null,null,null,null,null,null,null,null,null,null,null,null,null,null,null,0,0]
[null,null,null,null,null,null,null,null,null,null,null,null,null,null,null,null,null,null,null,null,null,null,null,null,null,null,null,null,0,0]
[null,null,null,null,null,null,null,null,null,null,null,null,null,null,null,null,null,null,null,null,null,null,null,null,null,null,null,null,0,0]
[null,null,null,null,null,null,null,null,null,null,null,null,null,null,null,null,null,null,null,null,null,null,null,null,null,null,null,null,0,0]
[null,null,null,null,null,null,null,null,null,null,null,null,null,null,null,null,null,null,null,null,null,null,null,null,null,null,null,null,0,0]
[null,null,null,null,null,null,null,null,null,null,null,null,null,null,null,null,null,null,null,null,null,null,null,null,null,null,null,null,0,0]
[null,null,null,null,null,null,null,null,null,null,null,null,null,null,null,null,null,null,null,null,null,null,null,null,null,null,null,null,0,0]
[null,null,null,null,null,null,null,null,null,null,null,null,null,null,null,null,null,null,null,null,null,null,null,null,null,null,null,null,0,0]
[null,null,null,null,null,null,null,null,null,null,null,null,null,null,null,null,null,null,null,null,null,null,null,null,null,null,null,null,0,0]
[null,null,null,null,null,null,null,null,null,null,null,null,null,null,null,null,null,null,null,null,null,null,null,null,null,null,null,null,0,0]
[null,null,null,null,null,null,null,null,null,null,null,null,null,null,null,null,null,null,null,null,null,null,null,null,null,null,null,null,0,0]
[null,null,null,null,null,null,null,null,null,null,null,null,null,null,null,null,null,null,null,null,null,null,null,null,null,null,null,null,0,0]
[null,null,null,null,null,null,null,null,null,null,null,null,null,null,null,null,null,null,null,null,null,null,null,null,null,null,null,null,0,0]
[null,null,null,null,null,null,null,null,null,null,null,null,null,null,null,null,null,null,null,null,null,null,null,null,null,null,null,null,0,0]
[null,null,null,null,null,null,null,null,null,null,null,null,null,null,null,null,null,null,null,null,null,null,null,null,null,null,null,null,0,0]
[null,null,null,null,null,null,null,null,null,null,null,null,null,null,null,null,null,null,null,null,null,null,null,null,null,null,null,null,0,0]
[null,null,null,null,null,null,null,null,null,null,null,null,null,null,null,null,null,null,null,null,null,null,null,null,null,null,null,null,0,0]
[null,null,null,null,null,null,null,null,null,null,null,null,null,null,null,null,null,null,null,null,null,null,null,null,null,null,null,null,0,0]
[null,null,null,null,null,null,null,null,null,null,null,null,null,null,null,null,null,null,null,null,null,null,null,null,null,null,null,null,0,0]
[null,null,null,null,null,null,null,null,null,null,null,null,null,null,null,null,null,null,null,null,null,null,null,null,null,null,null,null,0,0]
[null,null,null,null,null,null,null,null,null,null,null,null,null,null,null,null,null,null,null,null,null,null,null,null,null,null,null,null,0,0]
[null,null,null,null,null,null,null,null,null,null,null,null,null,null,null,null,null,null,null,null,null,null,null,null,null,null,null,null,0,0]
[null,null,null,null,null,null,null,null,null,null,null,null,null,null,null,null,null,null,null,null,null,null,null,null,null,null,null,null,0,0]
[null,null,null,null,null,null,null,null,null,null,null,null,null,null,null,null,null,null,null,null,null,null,null,null,null,null,null,null,0,0]
[null,null,null,null,null,null,null,null,null,null,null,null,null,null,null,null,null,null,null,null,null,null,null,null,null,null,null,null,0,0]
[null,null,null,null,null,null,null,null,null,null,null,null,null,null,null,null,null,null,null,null,null,null,null,null,null,null,null,null,0,0]
[null,null,null,null,null,null,null,null,null,null,null,null,null,null,null,null,null,null,null,null,null,null,null,null,null,null,null,null,0,0]
[null,null,null,null,null,null,null,null,null,null,null,null,null,null,null,null,null,null,null,null,null,null,null,null,null,null,null,null,0,0]
[null,null,null,null,null,null,null,null,null,null,null,null,null,null,null,null,null,null,null,null,null,null,null,null,null,null,null,null,0,0]
[null,null,null,null,null,null,null,null,null,null,null,null,null,null,null,null,null,null,null,null,null,null,null,null,null,null,null,null,0,0]
[null,null,null,null,null,null,null,null,null,null,null,null,null,null,null,null,null,null,null,null,null,null,null,null,null,null,null,null,0,0]
[null,null,null,null,null,null,null,null,null,null,null,null,null,null,null,null,null,null,null,null,null,null,null,null,null,null,null,null,0,0]
[null,null,null,null,null,null,null,null,null,null,null,null,null,null,null,null,null,null,null,null,null,null,null,null,null,null,null,null,0,0]
[null,null,null,null,null,null,null,null,null,null,null,null,null,null,null,null,null,null,null,null,null,null,null,null,null,null,null,null,0,0]
[null,null,null,null,null,null,null,null,null,null,null,null,null,null,null,null,null,null,null,null,null,null,null,null,null,null,null,null,0,0]
[null,null,null,null,null,null,null,null,null,null,null,null,null,null,null,null,null,null,null,null,null,null,null,null,null,null,null,null,0,0]
[null,null,null,null,null,null,null,null,null,null,null,null,null,null,null,null,null,null,null,null,null,null,null,null,null,null,null,null,0,0]
[null,null,null,null,null,null,null,null,null,null,null,null,null,null,null,null,null,null,null,null,null,null,null,null,null,null,null,null,0,0]
[null,null,null,null,null,null,null,null,null,null,null,null,null,null,null,null,null,null,null,null,null,null,null,null,null,null,null,null,0,0]
[null,null,null,null,null,null,null,null,null,null,null,null,null,null,null,null,null,null,null,null,null,null,null,null,null,null,null,null,0,0]
[null,null,null,null,null,null,null,null,null,null,null,null,null,null,null,null,null,null,null,null,null,null,null,null,null,null,null,null,0,0]
[null,null,null,null,null,null,null,null,null,null,null,null,null,null,null,null,null,null,null,null,null,null,null,null,null,null,null,null,0,0]
[null,null,null,null,null,null,null,null,null,null,null,null,null,null,null,null,null,null,null,null,null,null,null,null,null,null,null,null,0,0]
[null,null,null,null,null,null,null,null,null,null,null,null,null,null,null,null,null,null,null,null,null,null,null,null,null,null,null,null,0,0]
[null,null,null,null,null,null,null,null,null,null,null,null,null,null,null,null,null,null,null,null,null,null,null,null,null,null,null,null,0,0]
[null,null,null,null,null,null,null,null,null,null,null,null,null,null,null,null,null,null,null,null,null,null,null,null,null,null,null,null,0,0]
[null,null,null,null,null,null,null,null,null,null,null,null,null,null,null,null,null,null,null,null,null,null,null,null,null,null,null,null,0,0]
[null,null,null,null,null,null,null,null,null,null,null,null,null,null,null,null,null,null,null,null,null,null,null,null,null,null,null,null,0,0]
[null,null,null,null,null,null,null,null,null,null,null,null,null,null,null,null,null,null,null,null,null,null,null,null,null,null,null,null,0,0]
[null,null,null,null,null,null,null,null,null,null,null,null,null,null,null,null,null,null,null,null,null,null,null,null,null,null,null,null,0,0]
[null,null,null,null,null,null,null,null,null,null,null,null,null,null,null,null,null,null,null,null,null,null,null,null,null,null,null,null,0,0]
[null,null,null,null,null,null,null,null,null,null,null,null,null,null,null,null,null,null,null,null,null,null,null,null,null,null,null,null,0,0]
[null,null,null,null,null,null,null,null,null,null,null,null,null,null,null,null,null,null,null,null,null,null,null,null,null,null,null,null,{"$f":"IF(AA898=0,0,_xlfn.DAYS(AA898,TODAY()))","v":0},{"$f":"IF(AB898=0,0,_xlfn.DAYS(AB898,TODAY()))","v":0}]
[null,null,null,null,null,null,null,null,null,null,null,null,null,null,null,null,null,null,null,null,null,null,null,null,null,null,null,null,0,0]
[null,null,null,null,null,null,null,null,null,null,null,null,null,null,null,null,null,null,null,null,null,null,null,null,null,null,null,null,0,0]
[null,null,null,null,null,null,null,null,null,null,null,null,null,null,null,null,null,null,null,null,null,null,null,null,null,null,null,null,0,0]
[null,null,null,null,null,null,null,null,null,null,null,null,null,null,null,null,null,null,null,null,null,null,null,null,null,null,null,null,0,0]
[null,null,null,null,null,null,null,null,null,null,null,null,null,null,null,null,null,null,null,null,null,null,null,null,null,null,null,null,0,0]
[null,null,null,null,null,null,null,null,null,null,null,null,null,null,null,null,null,null,null,null,null,null,null,null,null,null,null,null,0,0]
[null,null,null,null,null,null,null,null,null,null,null,null,null,null,null,null,null,null,null,null,null,null,null,null,null,null,null,null,0,0]
[null,null,null,null,null,null,null,null,null,null,null,null,null,null,null,null,null,null,null,null,null,null,null,null,null,null,null,null,0,0]
[null,null,null,null,null,null,null,null,null,null,null,null,null,null,null,null,null,null,null,null,null,null,null,null,null,null,null,null,0,0]
[null,null,null,null,null,null,null,null,null,null,null,null,null,null,null,null,null,null,null,null,null,null,null,null,null,null,null,null,0,0]
[null,null,null,null,null,null,null,null,null,null,null,null,null,null,null,null,null,null,null,null,null,null,null,null,null,null,null,null,0,0]
[null,null,null,null,null,null,null,null,null,null,null,null,null,null,null,null,null,null,null,null,null,null,null,null,null,null,null,null,0,0]
[null,null,null,null,null,null,null,null,null,null,null,null,null,null,null,null,null,null,null,null,null,null,null,null,null,null,null,null,0,0]
[null,null,null,null,null,null,null,null,null,null,null,null,null,null,null,null,null,null,null,null,null,null,null,null,null,null,null,null,0,0]
[null,null,null,null,null,null,null,null,null,null,null,null,null,null,null,null,null,null,null,null,null,null,null,null,null,null,null,null,0,0]
[null,null,null,null,null,null,null,null,null,null,null,null,null,null,null,null,null,null,null,null,null,null,null,null,null,null,null,null,0,0]
[null,null,null,null,null,null,null,null,null,null,null,null,null,null,null,null,null,null,null,null,null,null,null,null,null,null,null,null,0,0]
[null,null,null,null,null,null,null,null,null,null,null,null,null,null,null,null,null,null,null,null,null,null,null,null,null,null,null,null,0,0]
[null,null,null,null,null,null,null,null,null,null,null,null,null,null,null,null,null,null,null,null,null,null,null,null,null,null,null,null,0,0]
[null,null,null,null,null,null,null,null,null,null,null,null,null,null,null,null,null,null,null,null,null,null,null,null,null,null,null,null,0,0]
[null,null,null,null,null,null,null,null,null,null,null,null,null,null,null,null,null,null,null,null,null,null,null,null,null,null,null,null,0,0]
[null,null,null,null,null,null,null,null,null,null,null,null,null,null,null,null,null,null,null,null,null,null,null,null,null,null,null,null,0,0]
[null,null,null,null,null,null,null,null,null,null,null,null,null,null,null,null,null,null,null,null,null,null,null,null,null,null,null,null,0,0]
[null,null,null,null,null,null,null,null,null,null,null,null,null,null,null,null,null,null,null,null,null,null,null,null,null,null,null,null,0,0]
[null,null,null,null,null,null,null,null,null,null,null,null,null,null,null,null,null,null,null,null,null,null,null,null,null,null,null,null,0,0]
[null,null,null,null,null,null,null,null,null,null,null,null,null,null,null,null,null,null,null,null,null,null,null,null,null,null,null,null,0,0]
[null,null,null,null,null,null,null,null,null,null,null,null,null,null,null,null,null,null,null,null,null,null,null,null,null,null,null,null,0,0]
[null,null,null,null,null,null,null,null,null,null,null,null,null,null,null,null,null,null,null,null,null,null,null,null,null,null,null,null,0,0]
[null,null,null,null,null,null,null,null,null,null,null,null,null,null,null,null,null,null,null,null,null,null,null,null,null,null,null,null,0,0]
[null,null,null,null,null,null,null,null,null,null,null,null,null,null,null,null,null,null,null,null,null,null,null,null,null,null,null,null,0,0]
[null,null,null,null,null,null,null,null,null,null,null,null,null,null,null,null,null,null,null,null,null,null,null,null,null,null,null,null,0,0]
[null,null,null,null,null,null,null,null,null,null,null,null,null,null,null,null,null,null,null,null,null,null,null,null,null,null,null,null,0,0]
[null,null,null,null,null,null,null,null,null,null,null,null,null,null,null,null,null,null,null,null,null,null,null,null,null,null,null,null,0,0]
[null,null,null,null,null,null,null,null,null,null,null,null,null,null,null,null,null,null,null,null,null,null,null,null,null,null,null,null,0,0]
[null,null,null,null,null,null,null,null,null,null,null,null,null,null,null,null,null,null,null,null,null,null,null,null,null,null,null,null,0,0]
[null,null,null,null,null,null,null,null,null,null,null,null,null,null,null,null,null,null,null,null,null,null,null,null,null,null,null,null,0,0]
[null,null,null,null,null,null,null,null,null,null,null,null,null,null,null,null,null,null,null,null,null,null,null,null,null,null,null,null,0,0]
[null,null,null,null,null,null,null,null,null,null,null,null,null,null,null,null,null,null,null,null,null,null,null,null,null,null,null,null,0,0]
[null,null,null,null,null,null,null,null,null,null,null,null,null,null,null,null,null,null,null,null,null,null,null,null,null,null,null,null,0,0]
[null,null,null,null,null,null,null,null,null,null,null,null,null,null,null,null,null,null,null,null,null,null,null,null,null,null,null,null,0,0]
[null,null,null,null,null,null,null,null,null,null,null,null,null,null,null,null,null,null,null,null,null,null,null,null,null,null,null,null,0,0]
[null,null,null,null,null,null,null,null,null,null,null,null,null,null,null,null,null,null,null,null,null,null,null,null,null,null,null,null,0,0]
[null,null,null,null,null,null,null,null,null,null,null,null,null,null,null,null,null,null,null,null,null,null,null,null,null,null,null,null,0,0]
[null,null,null,null,null,null,null,null,null,null,null,null,null,null,null,null,null,null,null,null,null,null,null,null,null,null,null,null,0,0]
[null,null,null,null,null,null,null,null,null,null,null,null,null,null,null,null,null,null,null,null,null,null,null,null,null,null,null,null,0,0]
[null,null,null,null,null,null,null,null,null,null,null,null,null,null,null,null,null,null,null,null,null,null,null,null,null,null,null,null,0,0]
[null,null,null,null,null,null,null,null,null,null,null,null,null,null,null,null,null,null,null,null,null,null,null,null,null,null,null,null,0,0]
[null,null,null,null,null,null,null,null,null,null,null,null,null,null,null,null,null,null,null,null,null,null,null,null,null,null,null,null,0,0]
[null,null,null,null,null,null,null,null,null,null,null,null,null,null,null,null,null,null,null,null,null,null,null,null,null,null,null,null,0,0]
[null,null,null,null,null,null,null,null,null,null,null,null,null,null,null,null,null,null,null,null,null,null,null,null,null,null,null,null,0,0]
[null,null,null,null,null,null,null,null,null,null,null,null,null,null,null,null,null,null,null,null,null,null,null,null,null,null,null,null,0,0]
[null,null,null,null,null,null,null,null,null,null,null,null,null,null,null,null,null,null,null,null,null,null,null,null,null,null,null,null,0,0]
[null,null,null,null,null,null,null,null,null,null,null,null,null,null,null,null,null,null,null,null,null,null,null,null,null,null,null,null,0,0]
[null,null,null,null,null,null,null,null,null,null,null,null,null,null,null,null,null,null,null,null,null,null,null,null,null,null,null,null,0,0]
[null,null,null,null,null,null,null,null,null,null,null,null,null,null,null,null,null,null,null,null,null,null,null,null,null,null,null,null,0,0]
[null,null,null,null,null,null,null,null,null,null,null,null,null,null,null,null,null,null,null,null,null,null,null,null,null,null,null,null,0,0]
[null,null,null,null,null,null,null,null,null,null,null,null,null,null,null,null,null,null,null,null,null,null,null,null,null,null,null,null,0,0]
[null,null,null,null,null,null,null,null,null,null,null,null,null,null,null,null,null,null,null,null,null,null,null,null,null,null,null,null,0,0]
[null,null,null,null,null,null,null,null,null,null,null,null,null,null,null,null,null,null,null,null,null,null,null,null,null,null,null,null,0,0]
[null,null,null,null,null,null,null,null,null,null,null,null,null,null,null,null,null,null,null,null,null,null,null,null,null,null,null,null,0,0]
[null,null,null,null,null,null,null,null,null,null,null,null,null,null,null,null,null,null,null,null,null,null,null,null,null,null,null,null,0,0]
[null,null,null,null,null,null,null,null,null,null,null,null,null,null,null,null,null,null,null,null,null,null,null,null,null,null,null,null,0,0]
[null,null,null,null,null,null,null,null,null,null,null,null,null,null,null,null,null,null,null,null,null,null,null,null,null,null,null,null,0,0]
[null,null,null,null,null,null,null,null,null,null,null,null,null,null,null,null,null,null,null,null,null,null,null,null,null,null,null,null,{"$f":"IF(AA962=0,0,_xlfn.DAYS(AA962,TODAY()))","v":0},{"$f":"IF(AB962=0,0,_xlfn.DAYS(AB962,TODAY()))","v":0}]
[null,null,null,null,null,null,null,null,null,null,null,null,null,null,null,null,null,null,null,null,null,null,null,null,null,null,null,null,0,0]
[null,null,null,null,null,null,null,null,null,null,null,null,null,null,null,null,null,null,null,null,null,null,null,null,null,null,null,null,0,0]
[null,null,null,null,null,null,null,null,null,null,null,null,null,null,null,null,null,null,null,null,null,null,null,null,null,null,null,null,0,0]
[null,null,null,null,null,null,null,null,null,null,null,null,null,null,null,null,null,null,null,null,null,null,null,null,null,null,null,null,0,0]
[null,null,null,null,null,null,null,null,null,null,null,null,null,null,null,null,null,null,null,null,null,null,null,null,null,null,null,null,0,0]
[null,null,null,null,null,null,null,null,null,null,null,null,null,null,null,null,null,null,null,null,null,null,null,null,null,null,null,null,0,0]
[null,null,null,null,null,null,null,null,null,null,null,null,null,null,null,null,null,null,null,null,null,null,null,null,null,null,null,null,0,0]
[null,null,null,null,null,null,null,null,null,null,null,null,null,null,null,null,null,null,null,null,null,null,null,null,null,null,null,null,0,0]
[null,null,null,null,null,null,null,null,null,null,null,null,null,null,null,null,null,null,null,null,null,null,null,null,null,null,null,null,0,0]
[null,null,null,null,null,null,null,null,null,null,null,null,null,null,null,null,null,null,null,null,null,null,null,null,null,null,null,null,0,0]
[null,null,null,null,null,null,null,null,null,null,null,null,null,null,null,null,null,null,null,null,null,null,null,null,null,null,null,null,0,0]
[null,null,null,null,null,null,null,null,null,null,null,null,null,null,null,null,null,null,null,null,null,null,null,null,null,null,null,null,0,0]
[null,null,null,null,null,null,null,null,null,null,null,null,null,null,null,null,null,null,null,null,null,null,null,null,null,null,null,null,0,0]
[null,null,null,null,null,null,null,null,null,null,null,null,null,null,null,null,null,null,null,null,null,null,null,null,null,null,null,null,0,0]
[null,null,null,null,null,null,null,null,null,null,null,null,null,null,null,null,null,null,null,null,null,null,null,null,null,null,null,null,0,0]
[null,null,null,null,null,null,null,null,null,null,null,null,null,null,null,null,null,null,null,null,null,null,null,null,null,null,null,null,0,0]
[null,null,null,null,null,null,null,null,null,null,null,null,null,null,null,null,null,null,null,null,null,null,null,null,null,null,null,null,0,0]
[null,null,null,null,null,null,null,null,null,null,null,null,null,null,null,null,null,null,null,null,null,null,null,null,null,null,null,null,0,0]
[null,null,null,null,null,null,null,null,null,null,null,null,null,null,null,null,null,null,null,null,null,null,null,null,null,null,null,null,0,0]
[null,null,null,null,null,null,null,null,null,null,null,null,null,null,null,null,null,null,null,null,null,null,null,null,null,null,null,null,0,0]
[null,null,null,null,null,null,null,null,null,null,null,null,null,null,null,null,null,null,null,null,null,null,null,null,null,null,null,null,0,0]
[null,null,null,null,null,null,null,null,null,null,null,null,null,null,null,null,null,null,null,null,null,null,null,null,null,null,null,null,0,0]
[null,null,null,null,null,null,null,null,null,null,null,null,null,null,null,null,null,null,null,null,null,null,null,null,null,null,null,null,0,0]
[null,null,null,null,null,null,null,null,null,null,null,null,null,null,null,null,null,null,null,null,null,null,null,null,null,null,null,null,0,0]
[null,null,null,null,null,null,null,null,null,null,null,null,null,null,null,null,null,null,null,null,null,null,null,null,null,null,null,null,0,0]
[null,null,null,null,null,null,null,null,null,null,null,null,null,null,null,null,null,null,null,null,null,null,null,null,null,null,null,null,0,0]
[null,null,null,null,null,null,null,null,null,null,null,null,null,null,null,null,null,null,null,null,null,null,null,null,null,null,null,null,0,0]
[null,null,null,null,null,null,null,null,null,null,null,null,null,null,null,null,null,null,null,null,null,null,null,null,null,null,null,null,0,0]
[null,null,null,null,null,null,null,null,null,null,null,null,null,null,null,null,null,null,null,null,null,null,null,null,null,null,null,null,0,0]
[null,null,null,null,null,null,null,null,null,null,null,null,null,null,null,null,null,null,null,null,null,null,null,null,null,null,null,null,0,0]
[null,null,null,null,null,null,null,null,null,null,null,null,null,null,null,null,null,null,null,null,null,null,null,null,null,null,null,null,0,0]
[null,null,null,null,null,null,null,null,null,null,null,null,null,null,null,null,null,null,null,null,null,null,null,null,null,null,null,null,0,0]
[null,null,null,null,null,null,null,null,null,null,null,null,null,null,null,null,null,null,null,null,null,null,null,null,null,null,null,null,0,0]
[null,null,null,null,null,null,null,null,null,null,null,null,null,null,null,null,null,null,null,null,null,null,null,null,null,null,null,null,0,0]
[null,null,null,null,null,null,null,null,null,null,null,null,null,null,null,null,null,null,null,null,null,null,null,null,null,null,null,null,0,0]
[null,null,null,null,null,null,null,null,null,null,null,null,null,null,null,null,null,null,null,null,null,null,null,null,null,null,null,null,0,0]
[null,null,null,null,null,null,null,null,null,null,null,null,null,null,null,null,null,null,null,null,null,null,null,null,null,null,null,null,0,0]
[null,null,null,null,null,null,null,null,null,null,null,null,null,null,null,null,null,null,null,null,null,null,null,null,null,null,null,null,0,0]
[null,null,null,null,null,null,null,null,null,null,null,null,null,null,null,null,null,null,null,null,null,null,null,null,null,null,null,null,0,0]
[null,null,null,null,null,null,null,null,null,null,null,null,null,null,null,null,null,null,null,null,null,null,null,null,null,null,null,null,0,0]
[null,null,null,null,null,null,null,null,null,null,null,null,null,null,null,null,null,null,null,null,null,null,null,null,null,null,null,null,0,0]
[null,null,null,null,null,null,null,null,null,null,null,null,null,null,null,null,null,null,null,null,null,null,null,null,null,null,null,null,0,0]
[null,null,null,null,null,null,null,null,null,null,null,null,null,null,null,null,null,null,null,null,null,null,null,null,null,null,null,null,0,0]
[null,null,null,null,null,null,null,null,null,null,null,null,null,null,null,null,null,null,null,null,null,null,null,null,null,null,null,null,0,0]
[null,null,null,null,null,null,null,null,null,null,null,null,null,null,null,null,null,null,null,null,null,null,null,null,null,null,null,null,0,0]
[null,null,null,null,null,null,null,null,null,null,null,null,null,null,null,null,null,null,null,null,null,null,null,null,null,null,null,null,0,0]
[null,null,null,null,null,null,null,null,null,null,null,null,null,null,null,null,null,null,null,null,null,null,null,null,null,null,null,null,0,0]
[null,null,null,null,null,null,null,null,null,null,null,null,null,null,null,null,null,null,null,null,null,null,null,null,null,null,null,null,0,0]
[null,null,null,null,null,null,null,null,null,null,null,null,null,null,null,null,null,null,null,null,null,null,null,null,null,null,null,null,0,0]
[null,null,null,null,null,null,null,null,null,null,null,null,null,null,null,null,null,null,null,null,null,null,null,null,null,null,null,null,0,0]
[null,null,null,null,null,null,null,null,null,null,null,null,null,null,null,null,null,null,null,null,null,null,null,null,null,null,null,null,0,0]
[null,null,null,null,null,null,null,null,null,null,null,null,null,null,null,null,null,null,null,null,null,null,null,null,null,null,null,null,0,0]
[null,null,null,null,null,null,null,null,null,null,null,null,null,null,null,null,null,null,null,null,null,null,null,null,null,null,null,null,0,0]
[null,null,null,null,null,null,null,null,null,null,null,null,null,null,null,null,null,null,null,null,null,null,null,null,null,null,null,null,0,0]
[null,null,null,null,null,null,null,null,null,null,null,null,null,null,null,null,null,null,null,null,null,null,null,null,null,null,null,null,0,0]
[null,null,null,null,null,null,null,null,null,null,null,null,null,null,null,null,null,null,null,null,null,null,null,null,null,null,null,null,0,0]
[null,null,null,null,null,null,null,null,null,null,null,null,null,null,null,null,null,null,null,null,null,null,null,null,null,null,null,null,0,0]
[null,null,null,null,null,null,null,null,null,null,null,null,null,null,null,null,null,null,null,null,null,null,null,null,null,null,null,null,0,0]
[null,null,null,null,null,null,null,null,null,null,null,null,null,null,null,null,null,null,null,null,null,null,null,null,null,null,null,null,0,0]
[null,null,null,null,null,null,null,null,null,null,null,null,null,null,null,null,null,null,null,null,null,null,null,null,null,null,null,null,0,0]
[null,null,null,null,null,null,null,null,null,null,null,null,null,null,null,null,null,null,null,null,null,null,null,null,null,null,null,null,0,0]
[null,null,null,null,null,null,null,null,null,null,null,null,null,null,null,null,null,null,null,null,null,null,null,null,null,null,null,null,0,0]
[null,null,null,null,null,null,null,null,null,null,null,null,null,null,null,null,null,null,null,null,null,null,null,null,null,null,null,null,0,0]
[null,null,null,null,null,null,null,null,null,null,null,null,null,null,null,null,null,null,null,null,null,null,null,null,null,null,null,null,{"$f":"IF(AA1026=0,0,_xlfn.DAYS(AA1026,TODAY()))","v":0},{"$f":"IF(AB1026=0,0,_xlfn.DAYS(AB1026,TODAY()))","v":0}]
[null,null,null,null,null,null,null,null,null,null,null,null,null,null,null,null,null,null,null,null,null,null,null,null,null,null,null,null,0,0]
[null,null,null,null,null,null,null,null,null,null,null,null,null,null,null,null,null,null,null,null,null,null,null,null,null,null,null,null,0,0]
[null,null,null,null,null,null,null,null,null,null,null,null,null,null,null,null,null,null,null,null,null,null,null,null,null,null,null,null,0,0]
[null,null,null,null,null,null,null,null,null,null,null,null,null,null,null,null,null,null,null,null,null,null,null,null,null,null,null,null,0,0]
[null,null,null,null,null,null,null,null,null,null,null,null,null,null,null,null,null,null,null,null,null,null,null,null,null,null,null,null,0,0]
[null,null,null,null,null,null,null,null,null,null,null,null,null,null,null,null,null,null,null,null,null,null,null,null,null,null,null,null,0,0]
[null,null,null,null,null,null,null,null,null,null,null,null,null,null,null,null,null,null,null,null,null,null,null,null,null,null,null,null,0,0]
[null,null,null,null,null,null,null,null,null,null,null,null,null,null,null,null,null,null,null,null,null,null,null,null,null,null,null,null,0,0]
[null,null,null,null,null,null,null,null,null,null,null,null,null,null,null,null,null,null,null,null,null,null,null,null,null,null,null,null,0,0]
[null,null,null,null,null,null,null,null,null,null,null,null,null,null,null,null,null,null,null,null,null,null,null,null,null,null,null,null,0,0]
[null,null,null,null,null,null,null,null,null,null,null,null,null,null,null,null,null,null,null,null,null,null,null,null,null,null,null,null,0,0]
[null,null,null,null,null,null,null,null,null,null,null,null,null,null,null,null,null,null,null,null,null,null,null,null,null,null,null,null,0,0]
[null,null,null,null,null,null,null,null,null,null,null,null,null,null,null,null,null,null,null,null,null,null,null,null,null,null,null,null,0,0]
[null,null,null,null,null,null,null,null,null,null,null,null,null,null,null,null,null,null,null,null,null,null,null,null,null,null,null,null,0,0]
[null,null,null,null,null,null,null,null,null,null,null,null,null,null,null,null,null,null,null,null,null,null,null,null,null,null,null,null,0,0]
[null,null,null,null,null,null,null,null,null,null,null,null,null,null,null,null,null,null,null,null,null,null,null,null,null,null,null,null,0,0]
[null,null,null,null,null,null,null,null,null,null,null,null,null,null,null,null,null,null,null,null,null,null,null,null,null,null,null,null,0,0]
[null,null,null,null,null,null,null,null,null,null,null,null,null,null,null,null,null,null,null,null,null,null,null,null,null,null,null,null,0,0]
[null,null,null,null,null,null,null,null,null,null,null,null,null,null,null,null,null,null,null,null,null,null,null,null,null,null,null,null,0,0]
[null,null,null,null,null,null,null,null,null,null,null,null,null,null,null,null,null,null,null,null,null,null,null,null,null,null,null,null,0,0]
[null,null,null,null,null,null,null,null,null,null,null,null,null,null,null,null,null,null,null,null,null,null,null,null,null,null,null,null,0,0]
[null,null,null,null,null,null,null,null,null,null,null,null,null,null,null,null,null,null,null,null,null,null,null,null,null,null,null,null,0,0]
[null,null,null,null,null,null,null,null,null,null,null,null,null,null,null,null,null,null,null,null,null,null,null,null,null,null,null,null,0,0]
[null,null,null,null,null,null,null,null,null,null,null,null,null,null,null,null,null,null,null,null,null,null,null,null,null,null,null,null,0,0]
[null,null,null,null,null,null,null,null,null,null,null,null,null,null,null,null,null,null,null,null,null,null,null,null,null,null,null,null,0,0]
[null,null,null,null,null,null,null,null,null,null,null,null,null,null,null,null,null,null,null,null,null,null,null,null,null,null,null,null,0,0]
[null,null,null,null,null,null,null,null,null,null,null,null,null,null,null,null,null,null,null,null,null,null,null,null,null,null,null,null,0,0]
[null,null,null,null,null,null,null,null,null,null,null,null,null,null,null,null,null,null,null,null,null,null,null,null,null,null,null,null,0,0]
[null,null,null,null,null,null,null,null,null,null,null,null,null,null,null,null,null,null,null,null,null,null,null,null,null,null,null,null,0,0]
[null,null,null,null,null,null,null,null,null,null,null,null,null,null,null,null,null,null,null,null,null,null,null,null,null,null,null,null,0,0]
[null,null,null,null,null,null,null,null,null,null,null,null,null,null,null,null,null,null,null,null,null,null,null,null,null,null,null,null,0,0]
[null,null,null,null,null,null,null,null,null,null,null,null,null,null,null,null,null,null,null,null,null,null,null,null,null,null,null,null,0,0]
[null,null,null,null,null,null,null,null,null,null,null,null,null,null,null,null,null,null,null,null,null,null,null,null,null,null,null,null,0,0]
[null,null,null,null,null,null,null,null,null,null,null,null,null,null,null,null,null,null,null,null,null,null,null,null,null,null,null,null,0,0]
[null,null,null,null,null,null,null,null,null,null,null,null,null,null,null,null,null,null,null,null,null,null,null,null,null,null,null,null,0,0]
[null,null,null,null,null,null,null,null,null,null,null,null,null,null,null,null,null,null,null,null,null,null,null,null,null,null,null,null,0,0]
[null,null,null,null,null,null,null,null,null,null,null,null,null,null,null,null,null,null,null,null,null,null,null,null,null,null,null,null,0,0]
[null,null,null,null,null,null,null,null,null,null,null,null,null,null,null,null,null,null,null,null,null,null,null,null,null,null,null,null,0,0]
[null,null,null,null,null,null,null,null,null,null,null,null,null,null,null,null,null,null,null,null,null,null,null,null,null,null,null,null,0,0]
[null,null,null,null,null,null,null,null,null,null,null,null,null,null,null,null,null,null,null,null,null,null,null,null,null,null,null,null,0,0]
[null,null,null,null,null,null,null,null,null,null,null,null,null,null,null,null,null,null,null,null,null,null,null,null,null,null,null,null,0,0]
[null,null,null,null,null,null,null,null,null,null,null,null,null,null,null,null,null,null,null,null,null,null,null,null,null,null,null,null,0,0]
[null,null,null,null,null,null,null,null,null,null,null,null,null,null,null,null,null,null,null,null,null,null,null,null,null,null,null,null,0,0]
[null,null,null,null,null,null,null,null,null,null,null,null,null,null,null,null,null,null,null,null,null,null,null,null,null,null,null,null,0,0]
[null,null,null,null,null,null,null,null,null,null,null,null,null,null,null,null,null,null,null,null,null,null,null,null,null,null,null,null,0,0]
[null,null,null,null,null,null,null,null,null,null,null,null,null,null,null,null,null,null,null,null,null,null,null,null,null,null,null,null,0,0]
[null,null,null,null,null,null,null,null,null,null,null,null,null,null,null,null,null,null,null,null,null,null,null,null,null,null,null,null,0,0]
[null,null,null,null,null,null,null,null,null,null,null,null,null,null,null,null,null,null,null,null,null,null,null,null,null,null,null,null,0,0]
[null,null,null,null,null,null,null,null,null,null,null,null,null,null,null,null,null,null,null,null,null,null,null,null,null,null,null,null,0,0]
[null,null,null,null,null,null,null,null,null,null,null,null,null,null,null,null,null,null,null,null,null,null,null,null,null,null,null,null,0,0]
[null,null,null,null,null,null,null,null,null,null,null,null,null,null,null,null,null,null,null,null,null,null,null,null,null,null,null,null,0,0]
[null,null,null,null,null,null,null,null,null,null,null,null,null,null,null,null,null,null,null,null,null,null,null,null,null,null,null,null,0,0]
[null,null,null,null,null,null,null,null,null,null,null,null,null,null,null,null,null,null,null,null,null,null,null,null,null,null,null,null,0,0]
[null,null,null,null,null,null,null,null,null,null,null,null,null,null,null,null,null,null,null,null,null,null,null,null,null,null,null,null,0,0]
[null,null,null,null,null,null,null,null,null,null,null,null,null,null,null,null,null,null,null,null,null,null,null,null,null,null,null,null,0,0]
[null,null,null,null,null,null,null,null,null,null,null,null,null,null,null,null,null,null,null,null,null,null,null,null,null,null,null,null,0,0]
[null,null,null,null,null,null,null,null,null,null,null,null,null,null,null,null,null,null,null,null,null,null,null,null,null,null,null,null,0,0]
[null,null,null,null,null,null,null,null,null,null,null,null,null,null,null,null,null,null,null,null,null,null,null,null,null,null,null,null,0,0]
[null,null,null,null,null,null,null,null,null,null,null,null,null,null,null,null,null,null,null,null,null,null,null,null,null,null,null,null,0,0]
[null,null,null,null,null,null,null,null,null,null,null,null,null,null,null,null,null,null,null,null,null,null,null,null,null,null,null,null,0,0]
[null,null,null,null,null,null,null,null,null,null,null,null,null,null,null,null,null,null,null,null,null,null,null,null,null,null,null,null,0,0]
[null,null,null,null,null,null,null,null,null,null,null,null,null,null,null,null,null,null,null,null,null,null,null,null,null,null,null,null,0,0]
[null,null,null,null,null,null,null,null,null,null,null,null,null,null,null,null,null,null,null,null,null,null,null,null,null,null,null,null,0,0]
[null,null,null,null,null,null,null,null,null,null,null,null,null,null,null,null,null,null,null,null,null,null,null,null,null,null,null,null,{"$f":"IF(AA1090=0,0,_xlfn.DAYS(AA1090,TODAY()))","v":0},{"$f":"IF(AB1090=0,0,_xlfn.DAYS(AB1090,TODAY()))","v":0}]
[null,null,null,null,null,null,null,null,null,null,null,null,null,null,null,null,null,null,null,null,null,null,null,null,null,null,null,null,0,0]
[null,null,null,null,null,null,null,null,null,null,null,null,null,null,null,null,null,null,null,null,null,null,null,null,null,null,null,null,0,0]
[null,null,null,null,null,null,null,null,null,null,null,null,null,null,null,null,null,null,null,null,null,null,null,null,null,null,null,null,0,0]
[null,null,null,null,null,null,null,null,null,null,null,null,null,null,null,null,null,null,null,null,null,null,null,null,null,null,null,null,0,0]
[null,null,null,null,null,null,null,null,null,null,null,null,null,null,null,null,null,null,null,null,null,null,null,null,null,null,null,null,0,0]
[null,null,null,null,null,null,null,null,null,null,null,null,null,null,null,null,null,null,null,null,null,null,null,null,null,null,null,null,0,0]
[null,null,null,null,null,null,null,null,null,null,null,null,null,null,null,null,null,null,null,null,null,null,null,null,null,null,null,null,0,0]
[null,null,null,null,null,null,null,null,null,null,null,null,null,null,null,null,null,null,null,null,null,null,null,null,null,null,null,null,0,0]
[null,null,null,null,null,null,null,null,null,null,null,null,null,null,null,null,null,null,null,null,null,null,null,null,null,null,null,null,0,0]
[null,null,null,null,null,null,null,null,null,null,null,null,null,null,null,null,null,null,null,null,null,null,null,null,null,null,null,null,0,0]
[null,null,null,null,null,null,null,null,null,null,null,null,null,null,null,null,null,null,null,null,null,null,null,null,null,null,null,null,0,0]
[null,null,null,null,null,null,null,null,null,null,null,null,null,null,null,null,null,null,null,null,null,null,null,null,null,null,null,null,0,0]
[null,null,null,null,null,null,null,null,null,null,null,null,null,null,null,null,null,null,null,null,null,null,null,null,null,null,null,null,0,0]
[null,null,null,null,null,null,null,null,null,null,null,null,null,null,null,null,null,null,null,null,null,null,null,null,null,null,null,null,0,0]
[null,null,null,null,null,null,null,null,null,null,null,null,null,null,null,null,null,null,null,null,null,null,null,null,null,null,null,null,0,0]
[null,null,null,null,null,null,null,null,null,null,null,null,null,null,null,null,null,null,null,null,null,null,null,null,null,null,null,null,0,0]
[null,null,null,null,null,null,null,null,null,null,null,null,null,null,null,null,null,null,null,null,null,null,null,null,null,null,null,null,0,0]
[null,null,null,null,null,null,null,null,null,null,null,null,null,null,null,null,null,null,null,null,null,null,null,null,null,null,null,null,0,0]
[null,null,null,null,null,null,null,null,null,null,null,null,null,null,null,null,null,null,null,null,null,null,null,null,null,null,null,null,0,0]
[null,null,null,null,null,null,null,null,null,null,null,null,null,null,null,null,null,null,null,null,null,null,null,null,null,null,null,null,0,0]
[null,null,null,null,null,null,null,null,null,null,null,null,null,null,null,null,null,null,null,null,null,null,null,null,null,null,null,null,0,0]
[null,null,null,null,null,null,null,null,null,null,null,null,null,null,null,null,null,null,null,null,null,null,null,null,null,null,null,null,0,0]
[null,null,null,null,null,null,null,null,null,null,null,null,null,null,null,null,null,null,null,null,null,null,null,null,null,null,null,null,0,0]
[null,null,null,null,null,null,null,null,null,null,null,null,null,null,null,null,null,null,null,null,null,null,null,null,null,null,null,null,0,0]
[null,null,null,null,null,null,null,null,null,null,null,null,null,null,null,null,null,null,null,null,null,null,null,null,null,null,null,null,0,0]
[null,null,null,null,null,null,null,null,null,null,null,null,null,null,null,null,null,null,null,null,null,null,null,null,null,null,null,null,0,0]
[null,null,null,null,null,null,null,null,null,null,null,null,null,null,null,null,null,null,null,null,null,null,null,null,null,null,null,null,0,0]
[null,null,null,null,null,null,null,null,null,null,null,null,null,null,null,null,null,null,null,null,null,null,null,null,null,null,null,null,0,0]
[null,null,null,null,null,null,null,null,null,null,null,null,null,null,null,null,null,null,null,null,null,null,null,null,null,null,null,null,0,0]
[null,null,null,null,null,null,null,null,null,null,null,null,null,null,null,null,null,null,null,null,null,null,null,null,null,null,null,null,0,0]
[null,null,null,null,null,null,null,null,null,null,null,null,null,null,null,null,null,null,null,null,null,null,null,null,null,null,null,null,0,0]
[null,null,null,null,null,null,null,null,null,null,null,null,null,null,null,null,null,null,null,null,null,null,null,null,null,null,null,null,0,0]
[null,null,null,null,null,null,null,null,null,null,null,null,null,null,null,null,null,null,null,null,null,null,null,null,null,null,null,null,0,0]
[null,null,null,null,null,null,null,null,null,null,null,null,null,null,null,null,null,null,null,null,null,null,null,null,null,null,null,null,0,0]
[null,null,null,null,null,null,null,null,null,null,null,null,null,null,null,null,null,null,null,null,null,null,null,null,null,null,null,null,0,0]
[null,null,null,null,null,null,null,null,null,null,null,null,null,null,null,null,null,null,null,null,null,null,null,null,null,null,null,null,0,0]
[null,null,null,null,null,null,null,null,null,null,null,null,null,null,null,null,null,null,null,null,null,null,null,null,null,null,null,null,0,0]
[null,null,null,null,null,null,null,null,null,null,null,null,null,null,null,null,null,null,null,null,null,null,null,null,null,null,null,null,0,0]
[null,null,null,null,null,null,null,null,null,null,null,null,null,null,null,null,null,null,null,null,null,null,null,null,null,null,null,null,0,0]
[null,null,null,null,null,null,null,null,null,null,null,null,null,null,null,null,null,null,null,null,null,null,null,null,null,null,null,null,0,0]
[null,null,null,null,null,null,null,null,null,null,null,null,null,null,null,null,null,null,null,null,null,null,null,null,null,null,null,null,0,0]
[null,null,null,null,null,null,null,null,null,null,null,null,null,null,null,null,null,null,null,null,null,null,null,null,null,null,null,null,0,0]
[null,null,null,null,null,null,null,null,null,null,null,null,null,null,null,null,null,null,null,null,null,null,null,null,null,null,null,null,0,0]
[null,null,null,null,null,null,null,null,null,null,null,null,null,null,null,null,null,null,null,null,null,null,null,null,null,null,null,null,0,0]
[null,null,null,null,null,null,null,null,null,null,null,null,null,null,null,null,null,null,null,null,null,null,null,null,null,null,null,null,0,0]
[null,null,null,null,null,null,null,null,null,null,null,null,null,null,null,null,null,null,null,null,null,null,null,null,null,null,null,null,0,0]
[null,null,null,null,null,null,null,null,null,null,null,null,null,null,null,null,null,null,null,null,null,null,null,null,null,null,null,null,0,0]
[null,null,null,null,null,null,null,null,null,null,null,null,null,null,null,null,null,null,null,null,null,null,null,null,null,null,null,null,0,0]
[null,null,null,null,null,null,null,null,null,null,null,null,null,null,null,null,null,null,null,null,null,null,null,null,null,null,null,null,0,0]
[null,null,null,null,null,null,null,null,null,null,null,null,null,null,null,null,null,null,null,null,null,null,null,null,null,null,null,null,0,0]
[null,null,null,null,null,null,null,null,null,null,null,null,null,null,null,null,null,null,null,null,null,null,null,null,null,null,null,null,0,0]
[null,null,null,null,null,null,null,null,null,null,null,null,null,null,null,null,null,null,null,null,null,null,null,null,null,null,null,null,0,0]
[null,null,null,null,null,null,null,null,null,null,null,null,null,null,null,null,null,null,null,null,null,null,null,null,null,null,null,null,0,0]
[null,null,null,null,null,null,null,null,null,null,null,null,null,null,null,null,null,null,null,null,null,null,null,null,null,null,null,null,0,0]
[null,null,null,null,null,null,null,null,null,null,null,null,null,null,null,null,null,null,null,null,null,null,null,null,null,null,null,null,0,0]
[null,null,null,null,null,null,null,null,null,null,null,null,null,null,null,null,null,null,null,null,null,null,null,null,null,null,null,null,0,0]
[null,null,null,null,null,null,null,null,null,null,null,null,null,null,null,null,null,null,null,null,null,null,null,null,null,null,null,null,0,0]
[null,null,null,null,null,null,null,null,null,null,null,null,null,null,null,null,null,null,null,null,null,null,null,null,null,null,null,null,0,0]
[null,null,null,null,null,null,null,null,null,null,null,null,null,null,null,null,null,null,null,null,null,null,null,null,null,null,null,null,0,0]
[null,null,null,null,null,null,null,null,null,null,null,null,null,null,null,null,null,null,null,null,null,null,null,null,null,null,null,null,0,0]
[null,null,null,null,null,null,null,null,null,null,null,null,null,null,null,null,null,null,null,null,null,null,null,null,null,null,null,null,0,0]
[null,null,null,null,null,null,null,null,null,null,null,null,null,null,null,null,null,null,null,null,null,null,null,null,null,null,null,null,0,0]
[null,null,null,null,null,null,null,null,null,null,null,null,null,null,null,null,null,null,null,null,null,null,null,null,null,null,null,null,0,0]
[null,null,null,null,null,null,null,null,null,null,null,null,null,null,null,null,null,null,null,null,null,null,null,null,null,null,null,null,{"$f":"IF(AA1154=0,0,_xlfn.DAYS(AA1154,TODAY()))","v":0},{"$f":"IF(AB1154=0,0,_xlfn.DAYS(AB1154,TODAY()))","v":0}]
[null,null,null,null,null,null,null,null,null,null,null,null,null,null,null,null,null,null,null,null,null,null,null,null,null,null,null,null,0,0]
[null,null,null,null,null,null,null,null,null,null,null,null,null,null,null,null,null,null,null,null,null,null,null,null,null,null,null,null,0,0]
[null,null,null,null,null,null,null,null,null,null,null,null,null,null,null,null,null,null,null,null,null,null,null,null,null,null,null,null,0,0]
[null,null,null,null,null,null,null,null,null,null,null,null,null,null,null,null,null,null,null,null,null,null,null,null,null,null,null,null,0,0]
[null,null,null,null,null,null,null,null,null,null,null,null,null,null,null,null,null,null,null,null,null,null,null,null,null,null,null,null,0,0]
[null,null,null,null,null,null,null,null,null,null,null,null,null,null,null,null,null,null,null,null,null,null,null,null,null,null,null,null,0,0]
[null,null,null,null,null,null,null,null,null,null,null,null,null,null,null,null,null,null,null,null,null,null,null,null,null,null,null,null,0,0]
[null,null,null,null,null,null,null,null,null,null,null,null,null,null,null,null,null,null,null,null,null,null,null,null,null,null,null,null,0,0]
[null,null,null,null,null,null,null,null,null,null,null,null,null,null,null,null,null,null,null,null,null,null,null,null,null,null,null,null,0,0]
[null,null,null,null,null,null,null,null,null,null,null,null,null,null,null,null,null,null,null,null,null,null,null,null,null,null,null,null,0,0]
[null,null,null,null,null,null,null,null,null,null,null,null,null,null,null,null,null,null,null,null,null,null,null,null,null,null,null,null,0,0]
[null,null,null,null,null,null,null,null,null,null,null,null,null,null,null,null,null,null,null,null,null,null,null,null,null,null,null,null,0,0]
[null,null,null,null,null,null,null,null,null,null,null,null,null,null,null,null,null,null,null,null,null,null,null,null,null,null,null,null,0,0]
[null,null,null,null,null,null,null,null,null,null,null,null,null,null,null,null,null,null,null,null,null,null,null,null,null,null,null,null,0,0]
[null,null,null,null,null,null,null,null,null,null,null,null,null,null,null,null,null,null,null,null,null,null,null,null,null,null,null,null,0,0]
[null,null,null,null,null,null,null,null,null,null,null,null,null,null,null,null,null,null,null,null,null,null,null,null,null,null,null,null,0,0]
[null,null,null,null,null,null,null,null,null,null,null,null,null,null,null,null,null,null,null,null,null,null,null,null,null,null,null,null,0,0]
[null,null,null,null,null,null,null,null,null,null,null,null,null,null,null,null,null,null,null,null,null,null,null,null,null,null,null,null,0,0]
[null,null,null,null,null,null,null,null,null,null,null,null,null,null,null,null,null,null,null,null,null,null,null,null,null,null,null,null,0,0]
[null,null,null,null,null,null,null,null,null,null,null,null,null,null,null,null,null,null,null,null,null,null,null,null,null,null,null,null,0,0]
[null,null,null,null,null,null,null,null,null,null,null,null,null,null,null,null,null,null,null,null,null,null,null,null,null,null,null,null,0,0]
[null,null,null,null,null,null,null,null,null,null,null,null,null,null,null,null,null,null,null,null,null,null,null,null,null,null,null,null,0,0]
[null,null,null,null,null,null,null,null,null,null,null,null,null,null,null,null,null,null,null,null,null,null,null,null,null,null,null,null,0,0]
[null,null,null,null,null,null,null,null,null,null,null,null,null,null,null,null,null,null,null,null,null,null,null,null,null,null,null,null,0,0]
[null,null,null,null,null,null,null,null,null,null,null,null,null,null,null,null,null,null,null,null,null,null,null,null,null,null,null,null,0,0]
[null,null,null,null,null,null,null,null,null,null,null,null,null,null,null,null,null,null,null,null,null,null,null,null,null,null,null,null,0,0]
[null,null,null,null,null,null,null,null,null,null,null,null,null,null,null,null,null,null,null,null,null,null,null,null,null,null,null,null,0,0]
[null,null,null,null,null,null,null,null,null,null,null,null,null,null,null,null,null,null,null,null,null,null,null,null,null,null,null,null,0,0]
[null,null,null,null,null,null,null,null,null,null,null,null,null,null,null,null,null,null,null,null,null,null,null,null,null,null,null,null,0,0]
[null,null,null,null,null,null,null,null,null,null,null,null,null,null,null,null,null,null,null,null,null,null,null,null,null,null,null,null,0,0]
[null,null,null,null,null,null,null,null,null,null,null,null,null,null,null,null,null,null,null,null,null,null,null,null,null,null,null,null,0,0]
[null,null,null,null,null,null,null,null,null,null,null,null,null,null,null,null,null,null,null,null,null,null,null,null,null,null,null,null,0,0]
[null,null,null,null,null,null,null,null,null,null,null,null,null,null,null,null,null,null,null,null,null,null,null,null,null,null,null,null,0,0]
[null,null,null,null,null,null,null,null,null,null,null,null,null,null,null,null,null,null,null,null,null,null,null,null,null,null,null,null,0,0]
[null,null,null,null,null,null,null,null,null,null,null,null,null,null,null,null,null,null,null,null,null,null,null,null,null,null,null,null,0,0]
[null,null,null,null,null,null,null,null,null,null,null,null,null,null,null,null,null,null,null,null,null,null,null,null,null,null,null,null,0,0]
[null,null,null,null,null,null,null,null,null,null,null,null,null,null,null,null,null,null,null,null,null,null,null,null,null,null,null,null,0,0]
[null,null,null,null,null,null,null,null,null,null,null,null,null,null,null,null,null,null,null,null,null,null,null,null,null,null,null,null,0,0]
[null,null,null,null,null,null,null,null,null,null,null,null,null,null,null,null,null,null,null,null,null,null,null,null,null,null,null,null,0,0]
[null,null,null,null,null,null,null,null,null,null,null,null,null,null,null,null,null,null,null,null,null,null,null,null,null,null,null,null,0,0]
[null,null,null,null,null,null,null,null,null,null,null,null,null,null,null,null,null,null,null,null,null,null,null,null,null,null,null,null,0,0]
[null,null,null,null,null,null,null,null,null,null,null,null,null,null,null,null,null,null,null,null,null,null,null,null,null,null,null,null,0,0]
[null,null,null,null,null,null,null,null,null,null,null,null,null,null,null,null,null,null,null,null,null,null,null,null,null,null,null,null,0,0]
[null,null,null,null,null,null,null,null,null,null,null,null,null,null,null,null,null,null,null,null,null,null,null,null,null,null,null,null,0,0]
[null,null,null,null,null,null,null,null,null,null,null,null,null,null,null,null,null,null,null,null,null,null,null,null,null,null,null,null,0,0]
[null,null,null,null,null,null,null,null,null,null,null,null,null,null,null,null,null,null,null,null,null,null,null,null,null,null,null,null,0,0]
[null,null,null,null,null,null,null,null,null,null,null,null,null,null,null,null,null,null,null,null,null,null,null,null,null,null,null,null,0,0]
[null,null,null,null,null,null,null,null,null,null,null,null,null,null,null,null,null,null,null,null,null,null,null,null,null,null,null,null,0,0]
[null,null,null,null,null,null,null,null,null,null,null,null,null,null,null,null,null,null,null,null,null,null,null,null,null,null,null,null,0,0]
[null,null,null,null,null,null,null,null,null,null,null,null,null,null,null,null,null,null,null,null,null,null,null,null,null,null,null,null,0,0]
[null,null,null,null,null,null,null,null,null,null,null,null,null,null,null,null,null,null,null,null,null,null,null,null,null,null,null,null,0,0]
[null,null,null,null,null,null,null,null,null,null,null,null,null,null,null,null,null,null,null,null,null,null,null,null,null,null,null,null,0,0]
[null,null,null,null,null,null,null,null,null,null,null,null,null,null,null,null,null,null,null,null,null,null,null,null,null,null,null,null,0,0]
[null,null,null,null,null,null,null,null,null,null,null,null,null,null,null,null,null,null,null,null,null,null,null,null,null,null,null,null,0,0]
[null,null,null,null,null,null,null,null,null,null,null,null,null,null,null,null,null,null,null,null,null,null,null,null,null,null,null,null,0,0]
[null,null,null,null,null,null,null,null,null,null,null,null,null,null,null,null,null,null,null,null,null,null,null,null,null,null,null,null,0,0]
[null,null,null,null,null,null,null,null,null,null,null,null,null,null,null,null,null,null,null,null,null,null,null,null,null,null,null,null,0,0]
[null,null,null,null,null,null,null,null,null,null,null,null,null,null,null,null,null,null,null,null,null,null,null,null,null,null,null,null,0,0]
[null,null,null,null,null,null,null,null,null,null,null,null,null,null,null,null,null,null,null,null,null,null,null,null,null,null,null,null,0,0]
[null,null,null,null,null,null,null,null,null,null,null,null,null,null,null,null,null,null,null,null,null,null,null,null,null,null,null,null,0,0]
[null,null,null,null,null,null,null,null,null,null,null,null,null,null,null,null,null,null,null,null,null,null,null,null,null,null,null,null,0,0]
[null,null,null,null,null,null,null,null,null,null,null,null,null,null,null,null,null,null,null,null,null,null,null,null,null,null,null,null,0,0]
[null,null,null,null,null,null,null,null,null,null,null,null,null,null,null,null,null,null,null,null,null,null,null,null,null,null,null,null,0,0]
[null,null,null,null,null,null,null,null,null,null,null,null,null,null,null,null,null,null,null,null,null,null,null,null,null,null,null,null,{"$f":"IF(AA1218=0,0,_xlfn.DAYS(AA1218,TODAY()))","v":0},{"$f":"IF(AB1218=0,0,_xlfn.DAYS(AB1218,TODAY()))","v":0}]
[null,null,null,null,null,null,null,null,null,null,null,null,null,null,null,null,null,null,null,null,null,null,null,null,null,null,null,null,0,0]
[null,null,null,null,null,null,null,null,null,null,null,null,null,null,null,null,null,null,null,null,null,null,null,null,null,null,null,null,0,0]
[null,null,null,null,null,null,null,null,null,null,null,null,null,null,null,null,null,null,null,null,null,null,null,null,null,null,null,null,0,0]
[null,null,null,null,null,null,null,null,null,null,null,null,null,null,null,null,null,null,null,null,null,null,null,null,null,null,null,null,0,0]
[null,null,null,null,null,null,null,null,null,null,null,null,null,null,null,null,null,null,null,null,null,null,null,null,null,null,null,null,0,0]
[null,null,null,null,null,null,null,null,null,null,null,null,null,null,null,null,null,null,null,null,null,null,null,null,null,null,null,null,0,0]
[null,null,null,null,null,null,null,null,null,null,null,null,null,null,null,null,null,null,null,null,null,null,null,null,null,null,null,null,0,0]
[null,null,null,null,null,null,null,null,null,null,null,null,null,null,null,null,null,null,null,null,null,null,null,null,null,null,null,null,0,0]
[null,null,null,null,null,null,null,null,null,null,null,null,null,null,null,null,null,null,null,null,null,null,null,null,null,null,null,null,0,0]
[null,null,null,null,null,null,null,null,null,null,null,null,null,null,null,null,null,null,null,null,null,null,null,null,null,null,null,null,0,0]
[null,null,null,null,null,null,null,null,null,null,null,null,null,null,null,null,null,null,null,null,null,null,null,null,null,null,null,null,0,0]
[null,null,null,null,null,null,null,null,null,null,null,null,null,null,null,null,null,null,null,null,null,null,null,null,null,null,null,null,0,0]
[null,null,null,null,null,null,null,null,null,null,null,null,null,null,null,null,null,null,null,null,null,null,null,null,null,null,null,null,0,0]
[null,null,null,null,null,null,null,null,null,null,null,null,null,null,null,null,null,null,null,null,null,null,null,null,null,null,null,null,0,0]
[null,null,null,null,null,null,null,null,null,null,null,null,null,null,null,null,null,null,null,null,null,null,null,null,null,null,null,null,0,0]
[null,null,null,null,null,null,null,null,null,null,null,null,null,null,null,null,null,null,null,null,null,null,null,null,null,null,null,null,0,0]
[null,null,null,null,null,null,null,null,null,null,null,null,null,null,null,null,null,null,null,null,null,null,null,null,null,null,null,null,0,0]
[null,null,null,null,null,null,null,null,null,null,null,null,null,null,null,null,null,null,null,null,null,null,null,null,null,null,null,null,0,0]
[null,null,null,null,null,null,null,null,null,null,null,null,null,null,null,null,null,null,null,null,null,null,null,null,null,null,null,null,0,0]
[null,null,null,null,null,null,null,null,null,null,null,null,null,null,null,null,null,null,null,null,null,null,null,null,null,null,null,null,0,0]
[null,null,null,null,null,null,null,null,null,null,null,null,null,null,null,null,null,null,null,null,null,null,null,null,null,null,null,null,0,0]
[null,null,null,null,null,null,null,null,null,null,null,null,null,null,null,null,null,null,null,null,null,null,null,null,null,null,null,null,0,0]
[null,null,null,null,null,null,null,null,null,null,null,null,null,null,null,null,null,null,null,null,null,null,null,null,null,null,null,null,0,0]
[null,null,null,null,null,null,null,null,null,null,null,null,null,null,null,null,null,null,null,null,null,null,null,null,null,null,null,null,0,0]
[null,null,null,null,null,null,null,null,null,null,null,null,null,null,null,null,null,null,null,null,null,null,null,null,null,null,null,null,0,0]
[null,null,null,null,null,null,null,null,null,null,null,null,null,null,null,null,null,null,null,null,null,null,null,null,null,null,null,null,0,0]
[null,null,null,null,null,null,null,null,null,null,null,null,null,null,null,null,null,null,null,null,null,null,null,null,null,null,null,null,0,0]
[null,null,null,null,null,null,null,null,null,null,null,null,null,null,null,null,null,null,null,null,null,null,null,null,null,null,null,null,0,0]
[null,null,null,null,null,null,null,null,null,null,null,null,null,null,null,null,null,null,null,null,null,null,null,null,null,null,null,null,0,0]
[null,null,null,null,null,null,null,null,null,null,null,null,null,null,null,null,null,null,null,null,null,null,null,null,null,null,null,null,0,0]
[null,null,null,null,null,null,null,null,null,null,null,null,null,null,null,null,null,null,null,null,null,null,null,null,null,null,null,null,0,0]
[null,null,null,null,null,null,null,null,null,null,null,null,null,null,null,null,null,null,null,null,null,null,null,null,null,null,null,null,0,0]
[null,null,null,null,null,null,null,null,null,null,null,null,null,null,null,null,null,null,null,null,null,null,null,null,null,null,null,null,0,0]
[null,null,null,null,null,null,null,null,null,null,null,null,null,null,null,null,null,null,null,null,null,null,null,null,null,null,null,null,0,0]
[null,null,null,null,null,null,null,null,null,null,null,null,null,null,null,null,null,null,null,null,null,null,null,null,null,null,null,null,0,0]
[null,null,null,null,null,null,null,null,null,null,null,null,null,null,null,null,null,null,null,null,null,null,null,null,null,null,null,null,0,0]
[null,null,null,null,null,null,null,null,null,null,null,null,null,null,null,null,null,null,null,null,null,null,null,null,null,null,null,null,0,0]
[null,null,null,null,null,null,null,null,null,null,null,null,null,null,null,null,null,null,null,null,null,null,null,null,null,null,null,null,0,0]
[null,null,null,null,null,null,null,null,null,null,null,null,null,null,null,null,null,null,null,null,null,null,null,null,null,null,null,null,0,0]
[null,null,null,null,null,null,null,null,null,null,null,null,null,null,null,null,null,null,null,null,null,null,null,null,null,null,null,null,0,0]
[null,null,null,null,null,null,null,null,null,null,null,null,null,null,null,null,null,null,null,null,null,null,null,null,null,null,null,null,0,0]
[null,null,null,null,null,null,null,null,null,null,null,null,null,null,null,null,null,null,null,null,null,null,null,null,null,null,null,null,0,0]
[null,null,null,null,null,null,null,null,null,null,null,null,null,null,null,null,null,null,null,null,null,null,null,null,null,null,null,null,0,0]
[null,null,null,null,null,null,null,null,null,null,null,null,null,null,null,null,null,null,null,null,null,null,null,null,null,null,null,null,0,0]
[null,null,null,null,null,null,null,null,null,null,null,null,null,null,null,null,null,null,null,null,null,null,null,null,null,null,null,null,0,0]
[null,null,null,null,null,null,null,null,null,null,null,null,null,null,null,null,null,null,null,null,null,null,null,null,null,null,null,null,0,0]
[null,null,null,null,null,null,null,null,null,null,null,null,null,null,null,null,null,null,null,null,null,null,null,null,null,null,null,null,0,0]
[null,null,null,null,null,null,null,null,null,null,null,null,null,null,null,null,null,null,null,null,null,null,null,null,null,null,null,null,0,0]
[null,null,null,null,null,null,null,null,null,null,null,null,null,null,null,null,null,null,null,null,null,null,null,null,null,null,null,null,0,0]
[null,null,null,null,null,null,null,null,null,null,null,null,null,null,null,null,null,null,null,null,null,null,null,null,null,null,null,null,0,0]
[null,null,null,null,null,null,null,null,null,null,null,null,null,null,null,null,null,null,null,null,null,null,null,null,null,null,null,null,0,0]
[null,null,null,null,null,null,null,null,null,null,null,null,null,null,null,null,null,null,null,null,null,null,null,null,null,null,null,null,0,0]
[null,null,null,null,null,null,null,null,null,null,null,null,null,null,null,null,null,null,null,null,null,null,null,null,null,null,null,null,0,0]
[null,null,null,null,null,null,null,null,null,null,null,null,null,null,null,null,null,null,null,null,null,null,null,null,null,null,null,null,0,0]
[null,null,null,null,null,null,null,null,null,null,null,null,null,null,null,null,null,null,null,null,null,null,null,null,null,null,null,null,0,0]
[null,null,null,null,null,null,null,null,null,null,null,null,null,null,null,null,null,null,null,null,null,null,null,null,null,null,null,null,0,0]
[null,null,null,null,null,null,null,null,null,null,null,null,null,null,null,null,null,null,null,null,null,null,null,null,null,null,null,null,0,0]
[null,null,null,null,null,null,null,null,null,null,null,null,null,null,null,null,null,null,null,null,null,null,null,null,null,null,null,null,0,0]
[null,null,null,null,null,null,null,null,null,null,null,null,null,null,null,null,null,null,null,null,null,null,null,null,null,null,null,null,0,0]
[null,null,null,null,null,null,null,null,null,null,null,null,null,null,null,null,null,null,null,null,null,null,null,null,null,null,null,null,0,0]
[null,null,null,null,null,null,null,null,null,null,null,null,null,null,null,null,null,null,null,null,null,null,null,null,null,null,null,null,0,0]
[null,null,null,null,null,null,null,null,null,null,null,null,null,null,null,null,null,null,null,null,null,null,null,null,null,null,null,null,0,0]
[null,null,null,null,null,null,null,null,null,null,null,null,null,null,null,null,null,null,null,null,null,null,null,null,null,null,null,null,0,0]
[null,null,null,null,null,null,null,null,null,null,null,null,null,null,null,null,null,null,null,null,null,null,null,null,null,null,null,null,{"$f":"IF(AA1282=0,0,_xlfn.DAYS(AA1282,TODAY()))","v":0},{"$f":"IF(AB1282=0,0,_xlfn.DAYS(AB1282,TODAY()))","v":0}]
[null,null,null,null,null,null,null,null,null,null,null,null,null,null,null,null,null,null,null,null,null,null,null,null,null,null,null,null,0,0]
[null,null,null,null,null,null,null,null,null,null,null,null,null,null,null,null,null,null,null,null,null,null,null,null,null,null,null,null,0,0]
[null,null,null,null,null,null,null,null,null,null,null,null,null,null,null,null,null,null,null,null,null,null,null,null,null,null,null,null,0,0]
[null,null,null,null,null,null,null,null,null,null,null,null,null,null,null,null,null,null,null,null,null,null,null,null,null,null,null,null,0,0]
[null,null,null,null,null,null,null,null,null,null,null,null,null,null,null,null,null,null,null,null,null,null,null,null,null,null,null,null,0,0]
[null,null,null,null,null,null,null,null,null,null,null,null,null,null,null,null,null,null,null,null,null,null,null,null,null,null,null,null,0,0]
[null,null,null,null,null,null,null,null,null,null,null,null,null,null,null,null,null,null,null,null,null,null,null,null,null,null,null,null,0,0]
[null,null,null,null,null,null,null,null,null,null,null,null,null,null,null,null,null,null,null,null,null,null,null,null,null,null,null,null,0,0]
[null,null,null,null,null,null,null,null,null,null,null,null,null,null,null,null,null,null,null,null,null,null,null,null,null,null,null,null,0,0]
[null,null,null,null,null,null,null,null,null,null,null,null,null,null,null,null,null,null,null,null,null,null,null,null,null,null,null,null,0,0]
[null,null,null,null,null,null,null,null,null,null,null,null,null,null,null,null,null,null,null,null,null,null,null,null,null,null,null,null,0,0]
[null,null,null,null,null,null,null,null,null,null,null,null,null,null,null,null,null,null,null,null,null,null,null,null,null,null,null,null,0,0]
[null,null,null,null,null,null,null,null,null,null,null,null,null,null,null,null,null,null,null,null,null,null,null,null,null,null,null,null,0,0]
[null,null,null,null,null,null,null,null,null,null,null,null,null,null,null,null,null,null,null,null,null,null,null,null,null,null,null,null,0,0]
[null,null,null,null,null,null,null,null,null,null,null,null,null,null,null,null,null,null,null,null,null,null,null,null,null,null,null,null,0,0]
[null,null,null,null,null,null,null,null,null,null,null,null,null,null,null,null,null,null,null,null,null,null,null,null,null,null,null,null,0,0]
[null,null,null,null,null,null,null,null,null,null,null,null,null,null,null,null,null,null,null,null,null,null,null,null,null,null,null,null,0,0]
[null,null,null,null,null,null,null,null,null,null,null,null,null,null,null,null,null,null,null,null,null,null,null,null,null,null,null,null,0,0]
[null,null,null,null,null,null,null,null,null,null,null,null,null,null,null,null,null,null,null,null,null,null,null,null,null,null,null,null,0,0]
[null,null,null,null,null,null,null,null,null,null,null,null,null,null,null,null,null,null,null,null,null,null,null,null,null,null,null,null,0,0]
[null,null,null,null,null,null,null,null,null,null,null,null,null,null,null,null,null,null,null,null,null,null,null,null,null,null,null,null,0,0]
[null,null,null,null,null,null,null,null,null,null,null,null,null,null,null,null,null,null,null,null,null,null,null,null,null,null,null,null,0,0]
[null,null,null,null,null,null,null,null,null,null,null,null,null,null,null,null,null,null,null,null,null,null,null,null,null,null,null,null,0,0]
[null,null,null,null,null,null,null,null,null,null,null,null,null,null,null,null,null,null,null,null,null,null,null,null,null,null,null,null,0,0]
[null,null,null,null,null,null,null,null,null,null,null,null,null,null,null,null,null,null,null,null,null,null,null,null,null,null,null,null,0,0]
[null,null,null,null,null,null,null,null,null,null,null,null,null,null,null,null,null,null,null,null,null,null,null,null,null,null,null,null,0,0]
[null,null,null,null,null,null,null,null,null,null,null,null,null,null,null,null,null,null,null,null,null,null,null,null,null,null,null,null,0,0]
[null,null,null,null,null,null,null,null,null,null,null,null,null,null,null,null,null,null,null,null,null,null,null,null,null,null,null,null,0,0]
[null,null,null,null,null,null,null,null,null,null,null,null,null,null,null,null,null,null,null,null,null,null,null,null,null,null,null,null,0,0]
[null,null,null,null,null,null,null,null,null,null,null,null,null,null,null,null,null,null,null,null,null,null,null,null,null,null,null,null,0,0]
[null,null,null,null,null,null,null,null,null,null,null,null,null,null,null,null,null,null,null,null,null,null,null,null,null,null,null,null,0,0]
[null,null,null,null,null,null,null,null,null,null,null,null,null,null,null,null,null,null,null,null,null,null,null,null,null,null,null,null,0,0]
[null,null,null,null,null,null,null,null,null,null,null,null,null,null,null,null,null,null,null,null,null,null,null,null,null,null,null,null,0,0]
[null,null,null,null,null,null,null,null,null,null,null,null,null,null,null,null,null,null,null,null,null,null,null,null,null,null,null,null,0,0]
[null,null,null,null,null,null,null,null,null,null,null,null,null,null,null,null,null,null,null,null,null,null,null,null,null,null,null,null,0,0]
[null,null,null,null,null,null,null,null,null,null,null,null,null,null,null,null,null,null,null,null,null,null,null,null,null,null,null,null,0,0]
[null,null,null,null,null,null,null,null,null,null,null,null,null,null,null,null,null,null,null,null,null,null,null,null,null,null,null,null,0,0]
[null,null,null,null,null,null,null,null,null,null,null,null,null,null,null,null,null,null,null,null,null,null,null,null,null,null,null,null,0,0]
[null,null,null,null,null,null,null,null,null,null,null,null,null,null,null,null,null,null,null,null,null,null,null,null,null,null,null,null,0,0]
[null,null,null,null,null,null,null,null,null,null,null,null,null,null,null,null,null,null,null,null,null,null,null,null,null,null,null,null,0,0]
[null,null,null,null,null,null,null,null,null,null,null,null,null,null,null,null,null,null,null,null,null,null,null,null,null,null,null,null,0,0]
[null,null,null,null,null,null,null,null,null,null,null,null,null,null,null,null,null,null,null,null,null,null,null,null,null,null,null,null,0,0]
[null,null,null,null,null,null,null,null,null,null,null,null,null,null,null,null,null,null,null,null,null,null,null,null,null,null,null,null,0,0]
[null,null,null,null,null,null,null,null,null,null,null,null,null,null,null,null,null,null,null,null,null,null,null,null,null,null,null,null,0,0]
[null,null,null,null,null,null,null,null,null,null,null,null,null,null,null,null,null,null,null,null,null,null,null,null,null,null,null,null,0,0]
[null,null,null,null,null,null,null,null,null,null,null,null,null,null,null,null,null,null,null,null,null,null,null,null,null,null,null,null,0,0]
[null,null,null,null,null,null,null,null,null,null,null,null,null,null,null,null,null,null,null,null,null,null,null,null,null,null,null,null,0,0]
[null,null,null,null,null,null,null,null,null,null,null,null,null,null,null,null,null,null,null,null,null,null,null,null,null,null,null,null,0,0]
[null,null,null,null,null,null,null,null,null,null,null,null,null,null,null,null,null,null,null,null,null,null,null,null,null,null,null,null,0,0]
[null,null,null,null,null,null,null,null,null,null,null,null,null,null,null,null,null,null,null,null,null,null,null,null,null,null,null,null,0,0]
[null,null,null,null,null,null,null,null,null,null,null,null,null,null,null,null,null,null,null,null,null,null,null,null,null,null,null,null,0,0]
[null,null,null,null,null,null,null,null,null,null,null,null,null,null,null,null,null,null,null,null,null,null,null,null,null,null,null,null,0,0]
[null,null,null,null,null,null,null,null,null,null,null,null,null,null,null,null,null,null,null,null,null,null,null,null,null,null,null,null,0,0]
[null,null,null,null,null,null,null,null,null,null,null,null,null,null,null,null,null,null,null,null,null,null,null,null,null,null,null,null,0,0]
[null,null,null,null,null,null,null,null,null,null,null,null,null,null,null,null,null,null,null,null,null,null,null,null,null,null,null,null,0,0]
[null,null,null,null,null,null,null,null,null,null,null,null,null,null,null,null,null,null,null,null,null,null,null,null,null,null,null,null,0,0]
[null,null,null,null,null,null,null,null,null,null,null,null,null,null,null,null,null,null,null,null,null,null,null,null,null,null,null,null,0,0]
[null,null,null,null,null,null,null,null,null,null,null,null,null,null,null,null,null,null,null,null,null,null,null,null,null,null,null,null,0,0]
[null,null,null,null,null,null,null,null,null,null,null,null,null,null,null,null,null,null,null,null,null,null,null,null,null,null,null,null,0,0]
[null,null,null,null,null,null,null,null,null,null,null,null,null,null,null,null,null,null,null,null,null,null,null,null,null,null,null,null,0,0]
[null,null,null,null,null,null,null,null,null,null,null,null,null,null,null,null,null,null,null,null,null,null,null,null,null,null,null,null,0,0]
[null,null,null,null,null,null,null,null,null,null,null,null,null,null,null,null,null,null,null,null,null,null,null,null,null,null,null,null,0,0]
[null,null,null,null,null,null,null,null,null,null,null,null,null,null,null,null,null,null,null,null,null,null,null,null,null,null,null,null,0,0]
[null,null,null,null,null,null,null,null,null,null,null,null,null,null,null,null,null,null,null,null,null,null,null,null,null,null,null,null,{"$f":"IF(AA1346=0,0,_xlfn.DAYS(AA1346,TODAY()))","v":0},{"$f":"IF(AB1346=0,0,_xlfn.DAYS(AB1346,TODAY()))","v":0}]
[null,null,null,null,null,null,null,null,null,null,null,null,null,null,null,null,null,null,null,null,null,null,null,null,null,null,null,null,0,0]
[null,null,null,null,null,null,null,null,null,null,null,null,null,null,null,null,null,null,null,null,null,null,null,null,null,null,null,null,0,0]
[null,null,null,null,null,null,null,null,null,null,null,null,null,null,null,null,null,null,null,null,null,null,null,null,null,null,null,null,0,0]
[null,null,null,null,null,null,null,null,null,null,null,null,null,null,null,null,null,null,null,null,null,null,null,null,null,null,null,null,0,0]
[null,null,null,null,null,null,null,null,null,null,null,null,null,null,null,null,null,null,null,null,null,null,null,null,null,null,null,null,0,0]
[null,null,null,null,null,null,null,null,null,null,null,null,null,null,null,null,null,null,null,null,null,null,null,null,null,null,null,null,0,0]
[null,null,null,null,null,null,null,null,null,null,null,null,null,null,null,null,null,null,null,null,null,null,null,null,null,null,null,null,0,0]
[null,null,null,null,null,null,null,null,null,null,null,null,null,null,null,null,null,null,null,null,null,null,null,null,null,null,null,null,0,0]
[null,null,null,null,null,null,null,null,null,null,null,null,null,null,null,null,null,null,null,null,null,null,null,null,null,null,null,null,0,0]
[null,null,null,null,null,null,null,null,null,null,null,null,null,null,null,null,null,null,null,null,null,null,null,null,null,null,null,null,0,0]
[null,null,null,null,null,null,null,null,null,null,null,null,null,null,null,null,null,null,null,null,null,null,null,null,null,null,null,null,0,0]
[null,null,null,null,null,null,null,null,null,null,null,null,null,null,null,null,null,null,null,null,null,null,null,null,null,null,null,null,0,0]
[null,null,null,null,null,null,null,null,null,null,null,null,null,null,null,null,null,null,null,null,null,null,null,null,null,null,null,null,0,0]
[null,null,null,null,null,null,null,null,null,null,null,null,null,null,null,null,null,null,null,null,null,null,null,null,null,null,null,null,0,0]
[null,null,null,null,null,null,null,null,null,null,null,null,null,null,null,null,null,null,null,null,null,null,null,null,null,null,null,null,0,0]
[null,null,null,null,null,null,null,null,null,null,null,null,null,null,null,null,null,null,null,null,null,null,null,null,null,null,null,null,0,0]
[null,null,null,null,null,null,null,null,null,null,null,null,null,null,null,null,null,null,null,null,null,null,null,null,null,null,null,null,0,0]
[null,null,null,null,null,null,null,null,null,null,null,null,null,null,null,null,null,null,null,null,null,null,null,null,null,null,null,null,0,0]
[null,null,null,null,null,null,null,null,null,null,null,null,null,null,null,null,null,null,null,null,null,null,null,null,null,null,null,null,0,0]
[null,null,null,null,null,null,null,null,null,null,null,null,null,null,null,null,null,null,null,null,null,null,null,null,null,null,null,null,0,0]
[null,null,null,null,null,null,null,null,null,null,null,null,null,null,null,null,null,null,null,null,null,null,null,null,null,null,null,null,0,0]
[null,null,null,null,null,null,null,null,null,null,null,null,null,null,null,null,null,null,null,null,null,null,null,null,null,null,null,null,0,0]
[null,null,null,null,null,null,null,null,null,null,null,null,null,null,null,null,null,null,null,null,null,null,null,null,null,null,null,null,0,0]
[null,null,null,null,null,null,null,null,null,null,null,null,null,null,null,null,null,null,null,null,null,null,null,null,null,null,null,null,0,0]
[null,null,null,null,null,null,null,null,null,null,null,null,null,null,null,null,null,null,null,null,null,null,null,null,null,null,null,null,0,0]
[null,null,null,null,null,null,null,null,null,null,null,null,null,null,null,null,null,null,null,null,null,null,null,null,null,null,null,null,0,0]
[null,null,null,null,null,null,null,null,null,null,null,null,null,null,null,null,null,null,null,null,null,null,null,null,null,null,null,null,0,0]
[null,null,null,null,null,null,null,null,null,null,null,null,null,null,null,null,null,null,null,null,null,null,null,null,null,null,null,null,0,0]
[null,null,null,null,null,null,null,null,null,null,null,null,null,null,null,null,null,null,null,null,null,null,null,null,null,null,null,null,0,0]
[null,null,null,null,null,null,null,null,null,null,null,null,null,null,null,null,null,null,null,null,null,null,null,null,null,null,null,null,0,0]
[null,null,null,null,null,null,null,null,null,null,null,null,null,null,null,null,null,null,null,null,null,null,null,null,null,null,null,null,0,0]
[null,null,null,null,null,null,null,null,null,null,null,null,null,null,null,null,null,null,null,null,null,null,null,null,null,null,null,null,0,0]
[null,null,null,null,null,null,null,null,null,null,null,null,null,null,null,null,null,null,null,null,null,null,null,null,null,null,null,null,0,0]
[null,null,null,null,null,null,null,null,null,null,null,null,null,null,null,null,null,null,null,null,null,null,null,null,null,null,null,null,0,0]
[null,null,null,null,null,null,null,null,null,null,null,null,null,null,null,null,null,null,null,null,null,null,null,null,null,null,null,null,0,0]
[null,null,null,null,null,null,null,null,null,null,null,null,null,null,null,null,null,null,null,null,null,null,null,null,null,null,null,null,0,0]
[null,null,null,null,null,null,null,null,null,null,null,null,null,null,null,null,null,null,null,null,null,null,null,null,null,null,null,null,0,0]
[null,null,null,null,null,null,null,null,null,null,null,null,null,null,null,null,null,null,null,null,null,null,null,null,null,null,null,null,0,0]
[null,null,null,null,null,null,null,null,null,null,null,null,null,null,null,null,null,null,null,null,null,null,null,null,null,null,null,null,0,0]
[null,null,null,null,null,null,null,null,null,null,null,null,null,null,null,null,null,null,null,null,null,null,null,null,null,null,null,null,0,0]
[null,null,null,null,null,null,null,null,null,null,null,null,null,null,null,null,null,null,null,null,null,null,null,null,null,null,null,null,0,0]
[null,null,null,null,null,null,null,null,null,null,null,null,null,null,null,null,null,null,null,null,null,null,null,null,null,null,null,null,0,0]
[null,null,null,null,null,null,null,null,null,null,null,null,null,null,null,null,null,null,null,null,null,null,null,null,null,null,null,null,0,0]
[null,null,null,null,null,null,null,null,null,null,null,null,null,null,null,null,null,null,null,null,null,null,null,null,null,null,null,null,0,0]
[null,null,null,null,null,null,null,null,null,null,null,null,null,null,null,null,null,null,null,null,null,null,null,null,null,null,null,null,0,0]
[null,null,null,null,null,null,null,null,null,null,null,null,null,null,null,null,null,null,null,null,null,null,null,null,null,null,null,null,0,0]
[null,null,null,null,null,null,null,null,null,null,null,null,null,null,null,null,null,null,null,null,null,null,null,null,null,null,null,null,0,0]
[null,null,null,null,null,null,null,null,null,null,null,null,null,null,null,null,null,null,null,null,null,null,null,null,null,null,null,null,0,0]
[null,null,null,null,null,null,null,null,null,null,null,null,null,null,null,null,null,null,null,null,null,null,null,null,null,null,null,null,0,0]
[null,null,null,null,null,null,null,null,null,null,null,null,null,null,null,null,null,null,null,null,null,null,null,null,null,null,null,null,0,0]
[null,null,null,null,null,null,null,null,null,null,null,null,null,null,null,null,null,null,null,null,null,null,null,null,null,null,null,null,0,0]
[null,null,null,null,null,null,null,null,null,null,null,null,null,null,null,null,null,null,null,null,null,null,null,null,null,null,null,null,0,0]
[null,null,null,null,null,null,null,null,null,null,null,null,null,null,null,null,null,null,null,null,null,null,null,null,null,null,null,null,0,0]
[null,null,null,null,null,null,null,null,null,null,null,null,null,null,null,null,null,null,null,null,null,null,null,null,null,null,null,null,0,0]
[null,null,null,null,null,null,null,null,null,null,null,null,null,null,null,null,null,null,null,null,null,null,null,null,null,null,null,null,0,0]
[null,null,null,null,null,null,null,null,null,null,null,null,null,null,null,null,null,null,null,null,null,null,null,null,null,null,null,null,0,0]
[null,null,null,null,null,null,null,null,null,null,null,null,null,null,null,null,null,null,null,null,null,null,null,null,null,null,null,null,0,0]
[null,null,null,null,null,null,null,null,null,null,null,null,null,null,null,null,null,null,null,null,null,null,null,null,null,null,null,null,0,0]
[null,null,null,null,null,null,null,null,null,null,null,null,null,null,null,null,null,null,null,null,null,null,null,null,null,null,null,null,0,0]
[null,null,null,null,null,null,null,null,null,null,null,null,null,null,null,null,null,null,null,null,null,null,null,null,null,null,null,null,0,0]
[null,null,null,null,null,null,null,null,null,null,null,null,null,null,null,null,null,null,null,null,null,null,null,null,null,null,null,null,0,0]
[null,null,null,null,null,null,null,null,null,null,null,null,null,null,null,null,null,null,null,null,null,null,null,null,null,null,null,null,0,0]
[null,null,null,null,null,null,null,null,null,null,null,null,null,null,null,null,null,null,null,null,null,null,null,null,null,null,null,null,0,0]
[null,null,null,null,null,null,null,null,null,null,null,null,null,null,null,null,null,null,null,null,null,null,null,null,null,null,null,null,{"$f":"IF(AA1410=0,0,_xlfn.DAYS(AA1410,TODAY()))","v":0},{"$f":"IF(AB1410=0,0,_xlfn.DAYS(AB1410,TODAY()))","v":0}]
[null,null,null,null,null,null,null,null,null,null,null,null,null,null,null,null,null,null,null,null,null,null,null,null,null,null,null,null,0,0]
[null,null,null,null,null,null,null,null,null,null,null,null,null,null,null,null,null,null,null,null,null,null,null,null,null,null,null,null,0,0]
[null,null,null,null,null,null,null,null,null,null,null,null,null,null,null,null,null,null,null,null,null,null,null,null,null,null,null,null,0,0]
[null,null,null,null,null,null,null,null,null,null,null,null,null,null,null,null,null,null,null,null,null,null,null,null,null,null,null,null,0,0]
[null,null,null,null,null,null,null,null,null,null,null,null,null,null,null,null,null,null,null,null,null,null,null,null,null,null,null,null,0,0]
[null,null,null,null,null,null,null,null,null,null,null,null,null,null,null,null,null,null,null,null,null,null,null,null,null,null,null,null,0,0]
[null,null,null,null,null,null,null,null,null,null,null,null,null,null,null,null,null,null,null,null,null,null,null,null,null,null,null,null,0,0]
[null,null,null,null,null,null,null,null,null,null,null,null,null,null,null,null,null,null,null,null,null,null,null,null,null,null,null,null,0,0]
[null,null,null,null,null,null,null,null,null,null,null,null,null,null,null,null,null,null,null,null,null,null,null,null,null,null,null,null,0,0]
[null,null,null,null,null,null,null,null,null,null,null,null,null,null,null,null,null,null,null,null,null,null,null,null,null,null,null,null,0,0]
[null,null,null,null,null,null,null,null,null,null,null,null,null,null,null,null,null,null,null,null,null,null,null,null,null,null,null,null,0,0]
[null,null,null,null,null,null,null,null,null,null,null,null,null,null,null,null,null,null,null,null,null,null,null,null,null,null,null,null,0,0]
[null,null,null,null,null,null,null,null,null,null,null,null,null,null,null,null,null,null,null,null,null,null,null,null,null,null,null,null,0,0]
[null,null,null,null,null,null,null,null,null,null,null,null,null,null,null,null,null,null,null,null,null,null,null,null,null,null,null,null,0,0]
[null,null,null,null,null,null,null,null,null,null,null,null,null,null,null,null,null,null,null,null,null,null,null,null,null,null,null,null,0,0]
[null,null,null,null,null,null,null,null,null,null,null,null,null,null,null,null,null,null,null,null,null,null,null,null,null,null,null,null,0,0]
[null,null,null,null,null,null,null,null,null,null,null,null,null,null,null,null,null,null,null,null,null,null,null,null,null,null,null,null,0,0]
[null,null,null,null,null,null,null,null,null,null,null,null,null,null,null,null,null,null,null,null,null,null,null,null,null,null,null,null,0,0]
[null,null,null,null,null,null,null,null,null,null,null,null,null,null,null,null,null,null,null,null,null,null,null,null,null,null,null,null,0,0]
[null,null,null,null,null,null,null,null,null,null,null,null,null,null,null,null,null,null,null,null,null,null,null,null,null,null,null,null,0,0]
[null,null,null,null,null,null,null,null,null,null,null,null,null,null,null,null,null,null,null,null,null,null,null,null,null,null,null,null,0,0]
[null,null,null,null,null,null,null,null,null,null,null,null,null,null,null,null,null,null,null,null,null,null,null,null,null,null,null,null,0,0]
[null,null,null,null,null,null,null,null,null,null,null,null,null,null,null,null,null,null,null,null,null,null,null,null,null,null,null,null,0,0]
[null,null,null,null,null,null,null,null,null,null,null,null,null,null,null,null,null,null,null,null,null,null,null,null,null,null,null,null,0,0]
[null,null,null,null,null,null,null,null,null,null,null,null,null,null,null,null,null,null,null,null,null,null,null,null,null,null,null,null,0,0]
[null,null,null,null,null,null,null,null,null,null,null,null,null,null,null,null,null,null,null,null,null,null,null,null,null,null,null,null,0,0]
[null,null,null,null,null,null,null,null,null,null,null,null,null,null,null,null,null,null,null,null,null,null,null,null,null,null,null,null,0,0]
[null,null,null,null,null,null,null,null,null,null,null,null,null,null,null,null,null,null,null,null,null,null,null,null,null,null,null,null,0,0]
[null,null,null,null,null,null,null,null,null,null,null,null,null,null,null,null,null,null,null,null,null,null,null,null,null,null,null,null,0,0]
[null,null,null,null,null,null,null,null,null,null,null,null,null,null,null,null,null,null,null,null,null,null,null,null,null,null,null,null,0,0]
[null,null,null,null,null,null,null,null,null,null,null,null,null,null,null,null,null,null,null,null,null,null,null,null,null,null,null,null,0,0]
[null,null,null,null,null,null,null,null,null,null,null,null,null,null,null,null,null,null,null,null,null,null,null,null,null,null,null,null,0,0]
[null,null,null,null,null,null,null,null,null,null,null,null,null,null,null,null,null,null,null,null,null,null,null,null,null,null,null,null,0,0]
[null,null,null,null,null,null,null,null,null,null,null,null,null,null,null,null,null,null,null,null,null,null,null,null,null,null,null,null,0,0]
[null,null,null,null,null,null,null,null,null,null,null,null,null,null,null,null,null,null,null,null,null,null,null,null,null,null,null,null,0,0]
[null,null,null,null,null,null,null,null,null,null,null,null,null,null,null,null,null,null,null,null,null,null,null,null,null,null,null,null,0,0]
[null,null,null,null,null,null,null,null,null,null,null,null,null,null,null,null,null,null,null,null,null,null,null,null,null,null,null,null,0,0]
[null,null,null,null,null,null,null,null,null,null,null,null,null,null,null,null,null,null,null,null,null,null,null,null,null,null,null,null,0,0]
[null,null,null,null,null,null,null,null,null,null,null,null,null,null,null,null,null,null,null,null,null,null,null,null,null,null,null,null,0,0]
[null,null,null,null,null,null,null,null,null,null,null,null,null,null,null,null,null,null,null,null,null,null,null,null,null,null,null,null,0,0]
[null,null,null,null,null,null,null,null,null,null,null,null,null,null,null,null,null,null,null,null,null,null,null,null,null,null,null,null,0,0]
[null,null,null,null,null,null,null,null,null,null,null,null,null,null,null,null,null,null,null,null,null,null,null,null,null,null,null,null,0,0]
[null,null,null,null,null,null,null,null,null,null,null,null,null,null,null,null,null,null,null,null,null,null,null,null,null,null,null,null,0,0]
[null,null,null,null,null,null,null,null,null,null,null,null,null,null,null,null,null,null,null,null,null,null,null,null,null,null,null,null,0,0]
[null,null,null,null,null,null,null,null,null,null,null,null,null,null,null,null,null,null,null,null,null,null,null,null,null,null,null,null,0,0]
[null,null,null,null,null,null,null,null,null,null,null,null,null,null,null,null,null,null,null,null,null,null,null,null,null,null,null,null,0,0]
[null,null,null,null,null,null,null,null,null,null,null,null,null,null,null,null,null,null,null,null,null,null,null,null,null,null,null,null,0,0]
[null,null,null,null,null,null,null,null,null,null,null,null,null,null,null,null,null,null,null,null,null,null,null,null,null,null,null,null,0,0]
[null,null,null,null,null,null,null,null,null,null,null,null,null,null,null,null,null,null,null,null,null,null,null,null,null,null,null,null,0,0]
[null,null,null,null,null,null,null,null,null,null,null,null,null,null,null,null,null,null,null,null,null,null,null,null,null,null,null,null,0,0]
[null,null,null,null,null,null,null,null,null,null,null,null,null,null,null,null,null,null,null,null,null,null,null,null,null,null,null,null,0,0]
[null,null,null,null,null,null,null,null,null,null,null,null,null,null,null,null,null,null,null,null,null,null,null,null,null,null,null,null,0,0]
[null,null,null,null,null,null,null,null,null,null,null,null,null,null,null,null,null,null,null,null,null,null,null,null,null,null,null,null,0,0]
[null,null,null,null,null,null,null,null,null,null,null,null,null,null,null,null,null,null,null,null,null,null,null,null,null,null,null,null,0,0]
[null,null,null,null,null,null,null,null,null,null,null,null,null,null,null,null,null,null,null,null,null,null,null,null,null,null,null,null,0,0]
[null,null,null,null,null,null,null,null,null,null,null,null,null,null,null,null,null,null,null,null,null,null,null,null,null,null,null,null,0,0]
[null,null,null,null,null,null,null,null,null,null,null,null,null,null,null,null,null,null,null,null,null,null,null,null,null,null,null,null,0,0]
[null,null,null,null,null,null,null,null,null,null,null,null,null,null,null,null,null,null,null,null,null,null,null,null,null,null,null,null,0,0]
[null,null,null,null,null,null,null,null,null,null,null,null,null,null,null,null,null,null,null,null,null,null,null,null,null,null,null,null,0,0]
[null,null,null,null,null,null,null,null,null,null,null,null,null,null,null,null,null,null,null,null,null,null,null,null,null,null,null,null,0,0]
[null,null,null,null,null,null,null,null,null,null,null,null,null,null,null,null,null,null,null,null,null,null,null,null,null,null,null,null,0,0]
[null,null,null,null,null,null,null,null,null,null,null,null,null,null,null,null,null,null,null,null,null,null,null,null,null,null,null,null,0,0]
[null,null,null,null,null,null,null,null,null,null,null,null,null,null,null,null,null,null,null,null,null,null,null,null,null,null,null,null,0,0]
[null,null,null,null,null,null,null,null,null,null,null,null,null,null,null,null,null,null,null,null,null,null,null,null,null,null,null,null,{"$f":"IF(AA1474=0,0,_xlfn.DAYS(AA1474,TODAY()))","v":0},{"$f":"IF(AB1474=0,0,_xlfn.DAYS(AB1474,TODAY()))","v":0}]
[null,null,null,null,null,null,null,null,null,null,null,null,null,null,null,null,null,null,null,null,null,null,null,null,null,null,null,null,0,0]
[null,null,null,null,null,null,null,null,null,null,null,null,null,null,null,null,null,null,null,null,null,null,null,null,null,null,null,null,0,0]
[null,null,null,null,null,null,null,null,null,null,null,null,null,null,null,null,null,null,null,null,null,null,null,null,null,null,null,null,0,0]
[null,null,null,null,null,null,null,null,null,null,null,null,null,null,null,null,null,null,null,null,null,null,null,null,null,null,null,null,0,0]
[null,null,null,null,null,null,null,null,null,null,null,null,null,null,null,null,null,null,null,null,null,null,null,null,null,null,null,null,0,0]
[null,null,null,null,null,null,null,null,null,null,null,null,null,null,null,null,null,null,null,null,null,null,null,null,null,null,null,null,0,0]
[null,null,null,null,null,null,null,null,null,null,null,null,null,null,null,null,null,null,null,null,null,null,null,null,null,null,null,null,0,0]
[null,null,null,null,null,null,null,null,null,null,null,null,null,null,null,null,null,null,null,null,null,null,null,null,null,null,null,null,0,0]
[null,null,null,null,null,null,null,null,null,null,null,null,null,null,null,null,null,null,null,null,null,null,null,null,null,null,null,null,0,0]
[null,null,null,null,null,null,null,null,null,null,null,null,null,null,null,null,null,null,null,null,null,null,null,null,null,null,null,null,0,0]
[null,null,null,null,null,null,null,null,null,null,null,null,null,null,null,null,null,null,null,null,null,null,null,null,null,null,null,null,0,0]
[null,null,null,null,null,null,null,null,null,null,null,null,null,null,null,null,null,null,null,null,null,null,null,null,null,null,null,null,0,0]
[null,null,null,null,null,null,null,null,null,null,null,null,null,null,null,null,null,null,null,null,null,null,null,null,null,null,null,null,0,0]
[null,null,null,null,null,null,null,null,null,null,null,null,null,null,null,null,null,null,null,null,null,null,null,null,null,null,null,null,0,0]
[null,null,null,null,null,null,null,null,null,null,null,null,null,null,null,null,null,null,null,null,null,null,null,null,null,null,null,null,0,0]
[null,null,null,null,null,null,null,null,null,null,null,null,null,null,null,null,null,null,null,null,null,null,null,null,null,null,null,null,0,0]
[null,null,null,null,null,null,null,null,null,null,null,null,null,null,null,null,null,null,null,null,null,null,null,null,null,null,null,null,0,0]
[null,null,null,null,null,null,null,null,null,null,null,null,null,null,null,null,null,null,null,null,null,null,null,null,null,null,null,null,0,0]
[null,null,null,null,null,null,null,null,null,null,null,null,null,null,null,null,null,null,null,null,null,null,null,null,null,null,null,null,0,0]
[null,null,null,null,null,null,null,null,null,null,null,null,null,null,null,null,null,null,null,null,null,null,null,null,null,null,null,null,0,0]
[null,null,null,null,null,null,null,null,null,null,null,null,null,null,null,null,null,null,null,null,null,null,null,null,null,null,null,null,0,0]
[null,null,null,null,null,null,null,null,null,null,null,null,null,null,null,null,null,null,null,null,null,null,null,null,null,null,null,null,0,0]
[null,null,null,null,null,null,null,null,null,null,null,null,null,null,null,null,null,null,null,null,null,null,null,null,null,null,null,null,0,0]
[null,null,null,null,null,null,null,null,null,null,null,null,null,null,null,null,null,null,null,null,null,null,null,null,null,null,null,null,0,0]
[null,null,null,null,null,null,null,null,null,null,null,null,null,null,null,null,null,null,null,null,null,null,null,null,null,null,null,null,0,0]
[null,null,null,null,null,null,null,null,null,null,null,null,null,null,null,null,null,null,null,null,null,null,null,null,null,null,null,null,0,0]
[null,null,null,null,null,null,null,null,null,null,null,null,null,null,null,null,null,null,null,null,null,null,null,null,null,null,null,null,0,0]
[null,null,null,null,null,null,null,null,null,null,null,null,null,null,null,null,null,null,null,null,null,null,null,null,null,null,null,null,0,0]
[null,null,null,null,null,null,null,null,null,null,null,null,null,null,null,null,null,null,null,null,null,null,null,null,null,null,null,null,0,0]
[null,null,null,null,null,null,null,null,null,null,null,null,null,null,null,null,null,null,null,null,null,null,null,null,null,null,null,null,0,0]
[null,null,null,null,null,null,null,null,null,null,null,null,null,null,null,null,null,null,null,null,null,null,null,null,null,null,null,null,0,0]
[null,null,null,null,null,null,null,null,null,null,null,null,null,null,null,null,null,null,null,null,null,null,null,null,null,null,null,null,0,0]
[null,null,null,null,null,null,null,null,null,null,null,null,null,null,null,null,null,null,null,null,null,null,null,null,null,null,null,null,0,0]
[null,null,null,null,null,null,null,null,null,null,null,null,null,null,null,null,null,null,null,null,null,null,null,null,null,null,null,null,0,0]
[null,null,null,null,null,null,null,null,null,null,null,null,null,null,null,null,null,null,null,null,null,null,null,null,null,null,null,null,0,0]
[null,null,null,null,null,null,null,null,null,null,null,null,null,null,null,null,null,null,null,null,null,null,null,null,null,null,null,null,0,0]
[null,null,null,null,null,null,null,null,null,null,null,null,null,null,null,null,null,null,null,null,null,null,null,null,null,null,null,null,0,0]
[null,null,null,null,null,null,null,null,null,null,null,null,null,null,null,null,null,null,null,null,null,null,null,null,null,null,null,null,0,0]
[null,null,null,null,null,null,null,null,null,null,null,null,null,null,null,null,null,null,null,null,null,null,null,null,null,null,null,null,0,0]
[null,null,null,null,null,null,null,null,null,null,null,null,null,null,null,null,null,null,null,null,null,null,null,null,null,null,null,null,0,0]
[null,null,null,null,null,null,null,null,null,null,null,null,null,null,null,null,null,null,null,null,null,null,null,null,null,null,null,null,0,0]
[null,null,null,null,null,null,null,null,null,null,null,null,null,null,null,null,null,null,null,null,null,null,null,null,null,null,null,null,0,0]
[null,null,null,null,null,null,null,null,null,null,null,null,null,null,null,null,null,null,null,null,null,null,null,null,null,null,null,null,0,0]
[null,null,null,null,null,null,null,null,null,null,null,null,null,null,null,null,null,null,null,null,null,null,null,null,null,null,null,null,0,0]
[null,null,null,null,null,null,null,null,null,null,null,null,null,null,null,null,null,null,null,null,null,null,null,null,null,null,null,null,0,0]
[null,null,null,null,null,null,null,null,null,null,null,null,null,null,null,null,null,null,null,null,null,null,null,null,null,null,null,null,0,0]
[null,null,null,null,null,null,null,null,null,null,null,null,null,null,null,null,null,null,null,null,null,null,null,null,null,null,null,null,0,0]
[null,null,null,null,null,null,null,null,null,null,null,null,null,null,null,null,null,null,null,null,null,null,null,null,null,null,null,null,0,0]
[null,null,null,null,null,null,null,null,null,null,null,null,null,null,null,null,null,null,null,null,null,null,null,null,null,null,null,null,0,0]
[null,null,null,null,null,null,null,null,null,null,null,null,null,null,null,null,null,null,null,null,null,null,null,null,null,null,null,null,0,0]
[null,null,null,null,null,null,null,null,null,null,null,null,null,null,null,null,null,null,null,null,null,null,null,null,null,null,null,null,0,0]
[null,null,null,null,null,null,null,null,null,null,null,null,null,null,null,null,null,null,null,null,null,null,null,null,null,null,null,null,0,0]
[null,null,null,null,null,null,null,null,null,null,null,null,null,null,null,null,null,null,null,null,null,null,null,null,null,null,null,null,0,0]
[null,null,null,null,null,null,null,null,null,null,null,null,null,null,null,null,null,null,null,null,null,null,null,null,null,null,null,null,0,0]
[null,null,null,null,null,null,null,null,null,null,null,null,null,null,null,null,null,null,null,null,null,null,null,null,null,null,null,null,0,0]
[null,null,null,null,null,null,null,null,null,null,null,null,null,null,null,null,null,null,null,null,null,null,null,null,null,null,null,null,0,0]
[null,null,null,null,null,null,null,null,null,null,null,null,null,null,null,null,null,null,null,null,null,null,null,null,null,null,null,null,0,0]
[null,null,null,null,null,null,null,null,null,null,null,null,null,null,null,null,null,null,null,null,null,null,null,null,null,null,null,null,0,0]
[null,null,null,null,null,null,null,null,null,null,null,null,null,null,null,null,null,null,null,null,null,null,null,null,null,null,null,null,0,0]
[null,null,null,null,null,null,null,null,null,null,null,null,null,null,null,null,null,null,null,null,null,null,null,null,null,null,null,null,0,0]
[null,null,null,null,null,null,null,null,null,null,null,null,null,null,null,null,null,null,null,null,null,null,null,null,null,null,null,null,0,0]
[null,null,null,null,null,null,null,null,null,null,null,null,null,null,null,null,null,null,null,null,null,null,null,null,null,null,null,null,0,0]
[null,null,null,null,null,null,null,null,null,null,null,null,null,null,null,null,null,null,null,null,null,null,null,null,null,null,null,null,0,0]
[null,null,null,null,null,null,null,null,null,null,null,null,null,null,null,null,null,null,null,null,null,null,null,null,null,null,null,null,{"$f":"IF(AA1538=0,0,_xlfn.DAYS(AA1538,TODAY()))","v":0},{"$f":"IF(AB1538=0,0,_xlfn.DAYS(AB1538,TODAY()))","v":0}]
[null,null,null,null,null,null,null,null,null,null,null,null,null,null,null,null,null,null,null,null,null,null,null,null,null,null,null,null,0,0]
[null,null,null,null,null,null,null,null,null,null,null,null,null,null,null,null,null,null,null,null,null,null,null,null,null,null,null,null,0,0]
[null,null,null,null,null,null,null,null,null,null,null,null,null,null,null,null,null,null,null,null,null,null,null,null,null,null,null,null,0,0]
[null,null,null,null,null,null,null,null,null,null,null,null,null,null,null,null,null,null,null,null,null,null,null,null,null,null,null,null,0,0]
[null,null,null,null,null,null,null,null,null,null,null,null,null,null,null,null,null,null,null,null,null,null,null,null,null,null,null,null,0,0]
[null,null,null,null,null,null,null,null,null,null,null,null,null,null,null,null,null,null,null,null,null,null,null,null,null,null,null,null,0,0]
[null,null,null,null,null,null,null,null,null,null,null,null,null,null,null,null,null,null,null,null,null,null,null,null,null,null,null,null,0,0]
[null,null,null,null,null,null,null,null,null,null,null,null,null,null,null,null,null,null,null,null,null,null,null,null,null,null,null,null,0,0]
[null,null,null,null,null,null,null,null,null,null,null,null,null,null,null,null,null,null,null,null,null,null,null,null,null,null,null,null,0,0]
[null,null,null,null,null,null,null,null,null,null,null,null,null,null,null,null,null,null,null,null,null,null,null,null,null,null,null,null,0,0]
[null,null,null,null,null,null,null,null,null,null,null,null,null,null,null,null,null,null,null,null,null,null,null,null,null,null,null,null,0,0]
[null,null,null,null,null,null,null,null,null,null,null,null,null,null,null,null,null,null,null,null,null,null,null,null,null,null,null,null,0,0]
[null,null,null,null,null,null,null,null,null,null,null,null,null,null,null,null,null,null,null,null,null,null,null,null,null,null,null,null,0,0]
[null,null,null,null,null,null,null,null,null,null,null,null,null,null,null,null,null,null,null,null,null,null,null,null,null,null,null,null,0,0]
[null,null,null,null,null,null,null,null,null,null,null,null,null,null,null,null,null,null,null,null,null,null,null,null,null,null,null,null,0,0]
[null,null,null,null,null,null,null,null,null,null,null,null,null,null,null,null,null,null,null,null,null,null,null,null,null,null,null,null,0,0]
[null,null,null,null,null,null,null,null,null,null,null,null,null,null,null,null,null,null,null,null,null,null,null,null,null,null,null,null,0,0]
[null,null,null,null,null,null,null,null,null,null,null,null,null,null,null,null,null,null,null,null,null,null,null,null,null,null,null,null,0,0]
[null,null,null,null,null,null,null,null,null,null,null,null,null,null,null,null,null,null,null,null,null,null,null,null,null,null,null,null,0,0]
[null,null,null,null,null,null,null,null,null,null,null,null,null,null,null,null,null,null,null,null,null,null,null,null,null,null,null,null,0,0]
[null,null,null,null,null,null,null,null,null,null,null,null,null,null,null,null,null,null,null,null,null,null,null,null,null,null,null,null,0,0]
[null,null,null,null,null,null,null,null,null,null,null,null,null,null,null,null,null,null,null,null,null,null,null,null,null,null,null,null,0,0]
[null,null,null,null,null,null,null,null,null,null,null,null,null,null,null,null,null,null,null,null,null,null,null,null,null,null,null,null,0,0]
[null,null,null,null,null,null,null,null,null,null,null,null,null,null,null,null,null,null,null,null,null,null,null,null,null,null,null,null,0,0]
[null,null,null,null,null,null,null,null,null,null,null,null,null,null,null,null,null,null,null,null,null,null,null,null,null,null,null,null,0,0]
[null,null,null,null,null,null,null,null,null,null,null,null,null,null,null,null,null,null,null,null,null,null,null,null,null,null,null,null,0,0]
[null,null,null,null,null,null,null,null,null,null,null,null,null,null,null,null,null,null,null,null,null,null,null,null,null,null,null,null,0,0]
[null,null,null,null,null,null,null,null,null,null,null,null,null,null,null,null,null,null,null,null,null,null,null,null,null,null,null,null,0,0]
[null,null,null,null,null,null,null,null,null,null,null,null,null,null,null,null,null,null,null,null,null,null,null,null,null,null,null,null,0,0]
[null,null,null,null,null,null,null,null,null,null,null,null,null,null,null,null,null,null,null,null,null,null,null,null,null,null,null,null,0,0]
[null,null,null,null,null,null,null,null,null,null,null,null,null,null,null,null,null,null,null,null,null,null,null,null,null,null,null,null,0,0]
[null,null,null,null,null,null,null,null,null,null,null,null,null,null,null,null,null,null,null,null,null,null,null,null,null,null,null,null,0,0]
[null,null,null,null,null,null,null,null,null,null,null,null,null,null,null,null,null,null,null,null,null,null,null,null,null,null,null,null,0,0]
[null,null,null,null,null,null,null,null,null,null,null,null,null,null,null,null,null,null,null,null,null,null,null,null,null,null,null,null,0,0]
[null,null,null,null,null,null,null,null,null,null,null,null,null,null,null,null,null,null,null,null,null,null,null,null,null,null,null,null,0,0]
[null,null,null,null,null,null,null,null,null,null,null,null,null,null,null,null,null,null,null,null,null,null,null,null,null,null,null,null,0,0]
[null,null,null,null,null,null,null,null,null,null,null,null,null,null,null,null,null,null,null,null,null,null,null,null,null,null,null,null,0,0]
[null,null,null,null,null,null,null,null,null,null,null,null,null,null,null,null,null,null,null,null,null,null,null,null,null,null,null,null,0,0]
[null,null,null,null,null,null,null,null,null,null,null,null,null,null,null,null,null,null,null,null,null,null,null,null,null,null,null,null,0,0]
[null,null,null,null,null,null,null,null,null,null,null,null,null,null,null,null,null,null,null,null,null,null,null,null,null,null,null,null,0,0]
[null,null,null,null,null,null,null,null,null,null,null,null,null,null,null,null,null,null,null,null,null,null,null,null,null,null,null,null,0,0]
[null,null,null,null,null,null,null,null,null,null,null,null,null,null,null,null,null,null,null,null,null,null,null,null,null,null,null,null,0,0]
[null,null,null,null,null,null,null,null,null,null,null,null,null,null,null,null,null,null,null,null,null,null,null,null,null,null,null,null,0,0]
[null,null,null,null,null,null,null,null,null,null,null,null,null,null,null,null,null,null,null,null,null,null,null,null,null,null,null,null,0,0]
[null,null,null,null,null,null,null,null,null,null,null,null,null,null,null,null,null,null,null,null,null,null,null,null,null,null,null,null,0,0]
[null,null,null,null,null,null,null,null,null,null,null,null,null,null,null,null,null,null,null,null,null,null,null,null,null,null,null,null,0,0]
[null,null,null,null,null,null,null,null,null,null,null,null,null,null,null,null,null,null,null,null,null,null,null,null,null,null,null,null,0,0]
[null,null,null,null,null,null,null,null,null,null,null,null,null,null,null,null,null,null,null,null,null,null,null,null,null,null,null,null,0,0]
[null,null,null,null,null,null,null,null,null,null,null,null,null,null,null,null,null,null,null,null,null,null,null,null,null,null,null,null,0,0]
[null,null,null,null,null,null,null,null,null,null,null,null,null,null,null,null,null,null,null,null,null,null,null,null,null,null,null,null,0,0]
[null,null,null,null,null,null,null,null,null,null,null,null,null,null,null,null,null,null,null,null,null,null,null,null,null,null,null,null,0,0]
[null,null,null,null,null,null,null,null,null,null,null,null,null,null,null,null,null,null,null,null,null,null,null,null,null,null,null,null,0,0]
[null,null,null,null,null,null,null,null,null,null,null,null,null,null,null,null,null,null,null,null,null,null,null,null,null,null,null,null,0,0]
[null,null,null,null,null,null,null,null,null,null,null,null,null,null,null,null,null,null,null,null,null,null,null,null,null,null,null,null,0,0]
[null,null,null,null,null,null,null,null,null,null,null,null,null,null,null,null,null,null,null,null,null,null,null,null,null,null,null,null,0,0]
[null,null,null,null,null,null,null,null,null,null,null,null,null,null,null,null,null,null,null,null,null,null,null,null,null,null,null,null,0,0]
[null,null,null,null,null,null,null,null,null,null,null,null,null,null,null,null,null,null,null,null,null,null,null,null,null,null,null,null,0,0]
[null,null,null,null,null,null,null,null,null,null,null,null,null,null,null,null,null,null,null,null,null,null,null,null,null,null,null,null,0,0]
[null,null,null,null,null,null,null,null,null,null,null,null,null,null,null,null,null,null,null,null,null,null,null,null,null,null,null,null,0,0]
[null,null,null,null,null,null,null,null,null,null,null,null,null,null,null,null,null,null,null,null,null,null,null,null,null,null,null,null,0,0]
[null,null,null,null,null,null,null,null,null,null,null,null,null,null,null,null,null,null,null,null,null,null,null,null,null,null,null,null,0,0]
[null,null,null,null,null,null,null,null,null,null,null,null,null,null,null,null,null,null,null,null,null,null,null,null,null,null,null,null,0,0]
[null,null,null,null,null,null,null,null,null,null,null,null,null,null,null,null,null,null,null,null,null,null,null,null,null,null,null,null,0,0]
[null,null,null,null,null,null,null,null,null,null,null,null,null,null,null,null,null,null,null,null,null,null,null,null,null,null,null,null,{"$f":"IF(AA1602=0,0,_xlfn.DAYS(AA1602,TODAY()))","v":0},{"$f":"IF(AB1602=0,0,_xlfn.DAYS(AB1602,TODAY()))","v":0}]
[null,null,null,null,null,null,null,null,null,null,null,null,null,null,null,null,null,null,null,null,null,null,null,null,null,null,null,null,0,0]
[null,null,null,null,null,null,null,null,null,null,null,null,null,null,null,null,null,null,null,null,null,null,null,null,null,null,null,null,0,0]
[null,null,null,null,null,null,null,null,null,null,null,null,null,null,null,null,null,null,null,null,null,null,null,null,null,null,null,null,0,0]
[null,null,null,null,null,null,null,null,null,null,null,null,null,null,null,null,null,null,null,null,null,null,null,null,null,null,null,null,0,0]
[null,null,null,null,null,null,null,null,null,null,null,null,null,null,null,null,null,null,null,null,null,null,null,null,null,null,null,null,0,0]
[null,null,null,null,null,null,null,null,null,null,null,null,null,null,null,null,null,null,null,null,null,null,null,null,null,null,null,null,0,0]
[null,null,null,null,null,null,null,null,null,null,null,null,null,null,null,null,null,null,null,null,null,null,null,null,null,null,null,null,0,0]
[null,null,null,null,null,null,null,null,null,null,null,null,null,null,null,null,null,null,null,null,null,null,null,null,null,null,null,null,0,0]
[null,null,null,null,null,null,null,null,null,null,null,null,null,null,null,null,null,null,null,null,null,null,null,null,null,null,null,null,0,0]
[null,null,null,null,null,null,null,null,null,null,null,null,null,null,null,null,null,null,null,null,null,null,null,null,null,null,null,null,0,0]
[null,null,null,null,null,null,null,null,null,null,null,null,null,null,null,null,null,null,null,null,null,null,null,null,null,null,null,null,0,0]
[null,null,null,null,null,null,null,null,null,null,null,null,null,null,null,null,null,null,null,null,null,null,null,null,null,null,null,null,0,0]
[null,null,null,null,null,null,null,null,null,null,null,null,null,null,null,null,null,null,null,null,null,null,null,null,null,null,null,null,0,0]
[null,null,null,null,null,null,null,null,null,null,null,null,null,null,null,null,null,null,null,null,null,null,null,null,null,null,null,null,0,0]
[null,null,null,null,null,null,null,null,null,null,null,null,null,null,null,null,null,null,null,null,null,null,null,null,null,null,null,null,0,0]
[null,null,null,null,null,null,null,null,null,null,null,null,null,null,null,null,null,null,null,null,null,null,null,null,null,null,null,null,0,0]
[null,null,null,null,null,null,null,null,null,null,null,null,null,null,null,null,null,null,null,null,null,null,null,null,null,null,null,null,0,0]
[null,null,null,null,null,null,null,null,null,null,null,null,null,null,null,null,null,null,null,null,null,null,null,null,null,null,null,null,0,0]
[null,null,null,null,null,null,null,null,null,null,null,null,null,null,null,null,null,null,null,null,null,null,null,null,null,null,null,null,0,0]
[null,null,null,null,null,null,null,null,null,null,null,null,null,null,null,null,null,null,null,null,null,null,null,null,null,null,null,null,0,0]
[null,null,null,null,null,null,null,null,null,null,null,null,null,null,null,null,null,null,null,null,null,null,null,null,null,null,null,null,0,0]
[null,null,null,null,null,null,null,null,null,null,null,null,null,null,null,null,null,null,null,null,null,null,null,null,null,null,null,null,0,0]
[null,null,null,null,null,null,null,null,null,null,null,null,null,null,null,null,null,null,null,null,null,null,null,null,null,null,null,null,0,0]
[null,null,null,null,null,null,null,null,null,null,null,null,null,null,null,null,null,null,null,null,null,null,null,null,null,null,null,null,0,0]
[null,null,null,null,null,null,null,null,null,null,null,null,null,null,null,null,null,null,null,null,null,null,null,null,null,null,null,null,0,0]
[null,null,null,null,null,null,null,null,null,null,null,null,null,null,null,null,null,null,null,null,null,null,null,null,null,null,null,null,0,0]
[null,null,null,null,null,null,null,null,null,null,null,null,null,null,null,null,null,null,null,null,null,null,null,null,null,null,null,null,0,0]
[null,null,null,null,null,null,null,null,null,null,null,null,null,null,null,null,null,null,null,null,null,null,null,null,null,null,null,null,0,0]
[null,null,null,null,null,null,null,null,null,null,null,null,null,null,null,null,null,null,null,null,null,null,null,null,null,null,null,null,0,0]
[null,null,null,null,null,null,null,null,null,null,null,null,null,null,null,null,null,null,null,null,null,null,null,null,null,null,null,null,0,0]
[null,null,null,null,null,null,null,null,null,null,null,null,null,null,null,null,null,null,null,null,null,null,null,null,null,null,null,null,0,0]
[null,null,null,null,null,null,null,null,null,null,null,null,null,null,null,null,null,null,null,null,null,null,null,null,null,null,null,null,0,0]
[null,null,null,null,null,null,null,null,null,null,null,null,null,null,null,null,null,null,null,null,null,null,null,null,null,null,null,null,0,0]
[null,null,null,null,null,null,null,null,null,null,null,null,null,null,null,null,null,null,null,null,null,null,null,null,null,null,null,null,0,0]
[null,null,null,null,null,null,null,null,null,null,null,null,null,null,null,null,null,null,null,null,null,null,null,null,null,null,null,null,0,0]
[null,null,null,null,null,null,null,null,null,null,null,null,null,null,null,null,null,null,null,null,null,null,null,null,null,null,null,null,0,0]
[null,null,null,null,null,null,null,null,null,null,null,null,null,null,null,null,null,null,null,null,null,null,null,null,null,null,null,null,0,0]
[null,null,null,null,null,null,null,null,null,null,null,null,null,null,null,null,null,null,null,null,null,null,null,null,null,null,null,null,0,0]
[null,null,null,null,null,null,null,null,null,null,null,null,null,null,null,null,null,null,null,null,null,null,null,null,null,null,null,null,0,0]
[null,null,null,null,null,null,null,null,null,null,null,null,null,null,null,null,null,null,null,null,null,null,null,null,null,null,null,null,0,0]
[null,null,null,null,null,null,null,null,null,null,null,null,null,null,null,null,null,null,null,null,null,null,null,null,null,null,null,null,0,0]
[null,null,null,null,null,null,null,null,null,null,null,null,null,null,null,null,null,null,null,null,null,null,null,null,null,null,null,null,0,0]
[null,null,null,null,null,null,null,null,null,null,null,null,null,null,null,null,null,null,null,null,null,null,null,null,null,null,null,null,0,0]
[null,null,null,null,null,null,null,null,null,null,null,null,null,null,null,null,null,null,null,null,null,null,null,null,null,null,null,null,0,0]
[null,null,null,null,null,null,null,null,null,null,null,null,null,null,null,null,null,null,null,null,null,null,null,null,null,null,null,null,0,0]
[null,null,null,null,null,null,null,null,null,null,null,null,null,null,null,null,null,null,null,null,null,null,null,null,null,null,null,null,0,0]
[null,null,null,null,null,null,null,null,null,null,null,null,null,null,null,null,null,null,null,null,null,null,null,null,null,null,null,null,0,0]
[null,null,null,null,null,null,null,null,null,null,null,null,null,null,null,null,null,null,null,null,null,null,null,null,null,null,null,null,0,0]
[null,null,null,null,null,null,null,null,null,null,null,null,null,null,null,null,null,null,null,null,null,null,null,null,null,null,null,null,0,0]

{"sheet":"Hoja1","index":5,"n_rows":52,"n_cols":10,"rows_kept":52,"cut":false,"hidden":true,"merged":[]}
["EJECUTOR (Dpto / Entidad)","(Todas)"]
["ESTADO","(Varios elementos)",null,null,null,null,"EJECUTOR (Dpto / Entidad)","DESENTRALIZADOS"]
[]
["Etiquetas de fila","Suma de VALOR PROYECTO","Suma de VALOR SGR",null,null,null,"Etiquetas de fila","Cuenta de BPIM","Suma de VALOR PROYECTO","Suma de VALOR SGR"]
["AGROSAVIA",4583970033,3282745260,null,null,null,"ICCU - GESPROY GB",45,305040081219.72998,269371839280]
["BANCO AGRARIO DE COLOMBIA",60041780218,15888838218,null,null,null,"IDECUT",1,1972606058,1972606058]
["CAR",18000000000,18000000000,null,null,null,"Total general",46,307012687277.72998,271344445338]
["CONNECT BOGOTA REGIÓN",3438832990.73,3028251016.23]
["EMTEL",16921563805,16921563805]
["FEDERACIÓN NACIONAL DE CAFETEROS",13783557324,12848931736]
["FUNDACION UNIVERSIDAD DEL VALLE",31610831242,31553631242]
["ICCU - GESPROY GB",56499307427.110001,53917171450]
["INSTITUTO SUPERIOR DE EDUCACION RURAL DE PAMPLONA",1097306327,999999999]
["INSTITUTO UNIVERSITARIO DE LA PAZ – UNIPAZ",1178749590,996109590]
["MUNICIPIO DE UTICA",2347004868,2123058880]
["MUNICIPIO DE ZIPAQUIRA",900000000,467000000]
["PONIFICA UNIVERSIDAD JAVERIANA",8577491761,7246312500]
["SECRETARIA DE AGRICULTURA",6523880054,4220000000]
["SECRETARIA DE AMBIENTE",5626890769,2857824455]
["SECRETARIA DE CIENCIA, TECNOLOGIA E INNOVACIÓN",194210559816.78,157570339540.22998]
["SECRETARIA DE COMPETITIVIDAD",33049757567,29740192043]
["SECRETARIA DE EDUCACIÓN",188177731805,188177731805]
["SECRETARIA DE GOBIERNO",9260000000,8500000000]
["SECRETARIA DE HABITAT Y VIVIENDA",17979476172.169998,17339445951.68]
["SECRETARIA DE MINAS, ENERGIA Y GAS",23075304536,12711103496]
["SECRETARIA DE PLANEACIÓN",6791102421.6400003,6725380621.6400003]
["U CATOLICA",343595000,299220000]
["U DE LOS ANDES",2814671307,2748000000]
["U DISTRITAL",1218668841,1113595753]
["U EAN",1294375000,1250000000]
["U JAVERIANA",6524500000,6524500000]
["U TECNOLOGICA DE PEREIRA",4360028215,3950208215]
["UNAD",3412874201,1999985660]
["UNIDAD ADMINISTRATIVA DE GESTIÓN DEL RIESGO.",17803380967.41,17803380967.41]
["UNIVERSIDAD ANTONIO NARIÑO",4526652200,4250000000]
["UNIVERSIDAD DE ANTIOQUIA",1090608306,998808306]
["UNIVERSIDAD DE CALDAS",6358000000,6000000000]
["UNIVERSIDAD DE CUNDINAMARCA",2024433669,1997753509]
["UNIVERSIDAD DE LA SABANA",1519950000,1309600000]
["UNIVERSIDAD DEL NORTE",6920233499,6750000000]
["UNIVERSIDAD DEL VALLE",5913070114,5335769261]
["UNIVERSIDAD EAN",2044506416,1750000000]
["UNIVERSIDAD INDUSTRIAL DE SANTANDER",10702443686.290001,7971112900.29]
["UNIVERSIDAD MILITAR NUEVA GRANADA",13355871910,8434309321]
["UNIVERSIDAD NACIONAL DE COLOMBIA",57170600235,51499028193.099998]
["UNIVERSIDAD TECNOLOGICA DE SANTANDER",1511504755,980000000]
["UPTC",2312299017.4499998,1967031046.1500001]
["ZIPAQUIRA",7458735075,7458735075]
["(en blanco)"]
["SUPERVISIÓN / INTERVENTORÍA -EPC",4999900475,4999900475]
["SUPERVISIÓN / INTERVENTORÍA RAPE - SECRETARIA DE PLANEACIÓN",32499987282,32499987282]
["Total general",901855988898.58008,775006557572.7301]

{"sheet":"Proyectos en Ejecución","index":6,"n_rows":239,"n_cols":23,"rows_kept":239,"cut":false,"hidden":false,"merged":[[0,0,4,22]]}
[" SISTEMAS GENERAL DEL REGALÍAS-BASE DE PROYECTOS APROBADOS"]
[]
[]
[]
[]
["N°","EJECUTOR (Dpto / Entidad)","EJECUTOR INTERNO","BPIN","PROYECTO","FUENTE DE FINANCIACIÓN","SECTOR","VALOR PROYECTO","VALOR SGR","OTRAS FUENTES","FECHA DE APROBACIÓN OCAD","AÑO DE APROBACIÓN","ACUERDO DE APROBACIÓN","Cumplimiento de requisitos previos al inicio de la ejecución","Proyecto fue aprobado en SUIFP SGR pero no ha migrado a Gesproy","CDP","Proyecto fue migrado a Gesproy pero no tiene asignación de recursos en SPGR.","Proyecto con asignación de recursos en SPGR y sin apertura del primer proceso de contratación","Proyecto con asignación de recursos y sin apertura del primer proceso de contratación y sin identificación de alcance,  hitos y programación","Proyecto con apertura del primer proceso de contratación y sin suscripción del primer contrato.","ESTADO","\tAVANCE FÍSICO","\tAVANCE FINANCIERO"]
[1,"CUNDINAMARCA","SECRETARIA DE AMBIENTE",2012000050005,"ESTUDIOS Y DISEÑOS DE DETALLE EMBALSE CALANDAIMA MUNICIPIO DE EL COLEGIO DEPARTAMENTO DE CUNDINAMARCA","(2012) Fondo de desarrollo regional $1.000.000.000\n(2012) Propios $3.000.000.000","AMBIENTE Y DESARROLLO SOSTENIBLE",4000000000,1000000000,{"$f":"H7-I7","v":3000000000},41271,2012,"004 DE 2012","04/04/2013\t","OK","15/04/2013\t","25/01/2013\t","30/08/2013\t","OK","12/07/2013\t","CERRADO",1,1]
[2,"DESENTRALIZADOS","ICCU - GESPROY GB",2012000050006,"CONSTRUCCIÓN CUBIERTA COLISEO DEL CENTRO AGROTECNOLOGICO DE EXPOSICIONES Y COMERCIALIZACION DE LA REGION DEL SUMAPAZ EN EL MUNICIPIO DE FUSAGASUGA - CUNDINAMARCA","(2012) Fondo de desarrollo refional $3.581.531\n(2012) Propios $656.000.000\n(2015) Propios $1.000.000","TRANSPORTE",6352617736,3581530801,2771086935,41271,2012,"004 DE 2012","S.D 31/05/2013","OK","217-24/04/2013",41299,41639,"OK",41808,"CERRADO",1,0.99539999999999995]
[3,"CUNDINAMARCA","SECRETARIA DE AGRICULTURA",2012000050007,"FORTALECIMIENTO DE LAS CADENAS HORTIFRUTICOLA Y AROMATICAS EN CUNDINAMARCA","(2012) Fondo de desarrollo regional $1.3000.000.000\n(2012) Propios $171.020.400","AGRICULTURA ",2490400000,1300000000,1190400000,41271,2012,"004 DE 2012","013-03/05/2013","OK",41453,"0018-25/01/2013",41458,"OK",41458,"CERRADO",1,1]
[4,"CUNDINAMARCA","SECRETARIA DE AGRICULTURA",2012000050009,"FORTALECIMIENTO DE LA PRODUCTIVIDAD Y COMPETITIVIDAD DEL SECTOR CACAOTERO EN EL DEPARTAMENTO DE CUNDINAMARCA ","(2012) Fondo de desarrollo regional $1.200.000.000\n(2012) Propios $45.229.825","AGRICULTURA ",2334689275,1200000000,1134689275,41271,2012,"004 DE 2012","012-04/04/2013","OK",41431,"0018-25/01/2013","001 de 2013- 24/06/2013","OK",41449,"CERRADO",1,0.96340000000000003]
[5,"CUNDINAMARCA","SECRETARIA GENERAL",2012000050010,"ESTUDIOS Y DISEÑOS PARA LA RECUPERACIÓN Y ADECUACION DEL PATRIMONIO HISTORICO CULTURAL PALACIO DE SAN FRANCISCO EN BOGOTA D.C. DEPARTAMENTO DE CUNDINAMARCA ","(2012) SGR $1.000.000.000","CULTURA ",1000000000,1000000000,0,41271,2012,"004 DE 2012","01-04/04/2013","OK",41705,41299,41795,"OK",41852,"CERRADO",1,0.95140000000000002]
[6,"CUNDINAMARCA","SECRETARIA DE EDUCACIÓN",2012000050011,"FORTALECIMIENTO DE LA PERMANENCIA DE LOS ESTUDIANTES EN LOS MUNICIPIOS DEL DEPARTAMENTO DE CUNDINAMARCA DEPARTAMENTO DE CUNDINAMARCA\n","(2012) Fondo de compensación regional $6.000.000.000","EDUCACIÓN",6000000000,6000000000,0,41187,2012,"003 DE 2012","1-01/04/2013","OK",41247,41227,41247,"OK",41247,"CERRADO",1,0.58189999999999997]
[7,"CUNDINAMARCA","SECRETARIA DE DESARROLLO E INCLUSIÓN SOCIAL",2012000050012,"IMPLEMENTACIÓN DEL PROGRAMA DE COMPLEMENTACION ALIMENTARIA Y NUTRICIONAL EN MENORES DE 5 AÑOS, MUJERES GESTANTES Y LACTANTES EN TODO EL DEPARTAMENTO DE CUNDINAMARCA","(2012) Fondo de compensación regional $3.000.000.000\n(2012) Propios $1.000.000","SALUD Y PROTECCIÓN SOCIAL",4531022720,3000000000,1531022720,41187,2012,"003 DE 2012","08/11/2013 -031","OK",41335,41267,41520,"OK",41541,"CERRADO",0.99039999999999995,0.99719999999999998]
[8,"CUNDINAMARCA","SECRETARIA DE TRANSPORTE Y MOVILIDAD",2012000050013,"ACTUALIZACION Y FORMULACION DE LOS ESTUDIOS Y DISEÑOS FASE II Y III DE LA EXTENCION NORTE - QUITO - SUR DEL SISTEMA TRANSMILENIO AL MUNICIPIO DE SOACHA DEPARTAMENTO DE CUNDINAMARCA ","(2012) Fondo de desarrollo regional $3.8000.000.000\n(2014) Propios $896.129.949","SALUD Y PROTECCIÓN SOCIAL",4026917304,3130787355,896129949,41187,2012,"003 DE 2012","04/04/2013-32","OK",41586,41508,41600,"OK",41632,"CERRADO",0.96220000000000006,0.97030000000000005]
[9,"CUNDINAMARCA","SECRETARIA DE AGRICULTURA",2012000050014,"MEJORAMIENTO DE LA COMPETITIVIDAD Y SOSTENIBILIDAD DEL SUB SECTOR PANELERO DE CUNDINAMARCA","(2012) Fondo de desarrollo regional $1.300.000.000\n(2012) Propios $259.272.190","AGRICULTURA ",1559272190,1300000000,259272190,41271,2012,"004 DE 2012","04/04/2013-014","OK",41449,41299,41451,"OK",41451,"CERRADO",1,1]
[10,"CUNDINAMARCA","SECRETARIA DE AGRICULTURA",2012000050023,"FORTALECIMIENTO DE LA ACTIVIDAD CAFETERA COMO ALTERNATIVA SOSTENIBLE DE DESARROLLO REGIONAL EN EL DEPARTAMENTO DE CUNDINAMARCA ","(2012) Propios $7.619.581.451\n(2012) SGR $1.300.000.000\n(2013) Propios $7.658.466.323\n(2014) Propios $10.524.643.730\n(2015) Propios $12.067.446.396 \n(2016) Propios $13.101.193.938\n(2017) Propios $12.559.119.735\n(2018) Propios $12.338.370.939","AGRICULTURA ",77168795512,1300000000,75868795512,41271,2012,"004 DE 2012","10/04/2013 015\n","OK",41431,41299,41453,"OK",41453,"CERRADO",1,0.99990000000000001]
[11,"CUNDINAMARCA","SECRETARIA DE AGRICULTURA",2012000050024,"IMPLEMENTACION DE UN MODELO DE PRODUCCION EN SISTEMAS DE DOBLE PROPOSITO EN PEQUEÑOS PRODUCTORES DEL DEPARTAMENTO DE CUNDINAMARCA","(2012) Fondo de desarrollo regional $900.000.000\n(2012) Propios $ 1.049.149.973\n(2013) Fondo de desarrollo regional $923.985.000\n(2013) Propios $497.551.400","AGRICULTURA ",3371686373,1823985000,1547701373,41271,2012,"004 DE 2012","20/05/2013 011","OK",41570,41299,41579,"OK",41579,"CERRADO",1,0.99439999999999995]
[12,"CUNDINAMARCA","SECRETARIA DE GOBIERNO",2012000050025,"ESTUDIOS Y DISEÑOS PARA LA CONSTRUCCIÓN DE UN CENTRO ESPECIALIZADO AL SERVICIO DE ADOLESCENTES INFRACTORES DE LA LEY EN EL DEPARTAMENTO DE CUNDINAMARCA","(2012) Fondo de desarrollo regional $200.000.000","DEFENSA",200000000,200000000,0,41271,2012,"004 DE 2012","1-29/04/2013","OK",41376,41299,41254,"OK",41387,"CERRADO",1,1]
[13,"ENTIDAD APORTANTE RECURSOS","MUNICIPIO DE COGUA",2012000050026,"MEJORAMIENTO DE LA VA COGUA-SAN CAYETANO (SECTOR LAS MARGARITAS K8+300 SECTOR LAS MARGARITAS HASTA K10+300) CON K0+00 EN COGUA DEPARTAMENTO DE CUNDINAMARCA","(2012) Fondo de compensación regional $277.000.000\n(2012) Fondo de desarrollo regional $1.723.000","TRANSPORTE",2000000000,2000000000,0,41271,2012,"005 DE 2012","28/12/2012-05","OK",41501,41444,41530,"OK",41578,"CERRADO",1,1]
[14,"DESENTRALIZADOS","ICCU - GESPROY GB",2012000050027,"MEJORAMIENTO DE LA VA UBALA-PALOMAS-MAMBITA (K0+00 UBICADO EN EL SITIO PROFESIONALES MUNICIPIO DE UBALA), DEPARTAMENTO DE CUNDINAMARCA ","(2012) Fondo de compensación regional $3.000.000\n(2014) Propios $359.160.441","TRANSPORTE",3359160462,3000000000,359160462,41271,2012,"04 DE 2012",41425,"OK",41381,41299,41519,"OK",41561,"CERRADO",1,0.98660000000000003]
[15,"DESENTRALIZADOS","ICCU - GESPROY GB",2012000050028,"MEJORAMIENTO Y MANTENIMIENTO DE LA RED VIAL SECUNDARIA Y TERCIARIA MEDIANTE LA DOTACIÓN DE MAQUINARIA A LOS MUNICIPIOS DEL DEPARTAMENTO DE CUNDINAMARCA ","(2012) Asignaciones directas $450.622.348\n(2012) Fondo de desarrollo regional $8.103.535\n(2012) Propios $2.398.565.107","TRANSPORTE",19769772343,8103535586,11666236757,41271,2012,"004 DE 2012",41423,"OK",41339,41299,41422,"OK",41422,"CERRADO",1,0.93179999999999996]
[16,"CUNDINAMARCA","SECRETARIA DE MINAS, ENERGIA Y GAS",2012000050029,"IMPLEMENTACIÓN Y MASIFICACION DEL SERVICIO DE GAS COMBUSTIBLE POR REDES PARA MUNICIPIOS DE ANOLAIMA, CACHIPAY, CHOACHI, FOMEQUE, UBAQUE Y VIOTA CUNDINAMARCA","(2013) Propios $1.492.571.000\n(2013) SGR $2.199.142.000\n(2014) Propios $454.749.000\n(2015) Propios $10.093.523.400 \n(2016) Propios $2.505.621.600","MINAS Y ENERGÍA",15253036000,2199142000,13053894000,41271,2012,"004 DE 2012","29/05/2013-008","OK",41519,41299,41541,"OK",41541,"CERRADO",1,0.94499999999999995]
[17,"CUNDINAMARCA","SECRETARIA DE COMPETITIVIDAD",2012000050030,"DESARROLLO CREACION Y FORTALECIMIENTO DE NUEVE (9) CENTROS DE EMPREDIMIENTO Y FORTALECIMIENTO EMPRESARIAL EN EL DEPARTAMENTO DE CUNDINAMARCA ","(2012) SGR $1.708.104.361\n(2014) Propios $44.397.453","COMERCIO, INDUSTRIA Y TURISMO ",1752501814,1708104361,44397453,41271,2012,"004 DE 2012",41393,"OK",41397,41299,41423,"OK",41423,"PARA CIERRE",1,0.95069999999999999]
[18,"ENTIDAD APORTANTE RECURSOS","MUNICIPIO DE MOSQUERA",2012000050039,"MEJORAMIENTO DE LA VIA CALLE 23 ENTRE CRA 3 Y 9B EN MOSQUERA CLL 7 ENTRE CRA 13 Y 24 EN FUNZA DEPARTAMENTO DE CUNDINAMARCA","(2012) Fondo regional de desarrollo $1.000.000\n(2012) Propios $2.336.453\n(2014) Propios $380.406.743","TRANSPORTE",2816415712,1000000000,1816415712,41271,2012,"004 DE 2012","11/12/2012-007","OK",41585,41564,41431,"OK",41519,"CERRADO",1,1]
[19,"ENTIDAD APORTANTE RECURSOS","MUNICIPIO DE SOACHA",2012000050044,"REHABILITACIÓN Y MEJORAMIENTO DE LA VIA PARALELA ( TRANSVERSAL 8 Y CARRERA 7) ENTRE CARRERA 13 CON AUTOPISTA SUR BARRIO LA DESPENSA, HASTA LA CALLE 27 DEL CENTRO DEL MUNICIPIO DE SOACHA CUNDINAMARCA (TRAMO N 1 - K0+000 HASTA K0+262)","(2012) Fondo de desarrollo regional $1.000.000","TRANSPORTE",1000000000,1000000000,0,41271,2012,"004 DE 2012","01/04/2013-01","OK",41627,"NO HAY INFORMACION",41352,"OK",41400,"CERRADO",1,1]
[20,"DESENTRALIZADOS","ICCU - GESPROY GB",2012000050051,"MEJORAMIENTO DEL PUENTE GUATIMBOL SOBRE EL RIO SUMAPAZ EN LA VA VENECIA - ICONONZO DEPARTAMENTO DE CUNDINAMARCA","(2012)Fondo de compensación regional $320.304.130\n(2012) Propios $107.811.063\n(2013) Propios $18.876.296\n(2014) Propios $80.204.150","TRANSPORTE",827195639,620304130,206891509,41271,2012,"004 DE 2012",41425,"OK",41381,41269,41417,"OK",41515,"CERRADO",1,0.98089999999999999]
[21,"DESENTRALIZADOS","ICCU - GESPROY GB",2012000050052,"FORMULACIÓN Y ACTUALIZACION DE LOS ESTUDIOS Y DISEÑOS DE LA VIA UBAQUE - LOS CEREZOS - CHIPAQUE DEPARTAMENTO DE CUNDINAMARCA","(2012) Fondo de desarrollo regional $250.000.000\n(2013) Propios $7.547.261","TRANSPORTE",257457261,250000000,7457261,41271,2012,"004 DE 2012",41365,"OK",41401,41299,41508,"OK",41554,"CERRADO",1,0.99960000000000004]
[22,"DESENTRALIZADOS","ICCU - GESPROY GB",2012000050054,"FORMULACIÓN Y ACTUALIZACION DE LOS ESTUDIOS Y DISEÑOS PARA EL MEJORAMIENTO DE LA TRONCAL DEL CARBON EN LONGITUD DE 43 KMS (K0+00 LOCALIZADO EN TIERRA NEGRA) DEPARTAMENTO DE CUNDINAMARCA","(2012) Fondo de desarrollo regional $755.000.000\n(2013) Propios $22.429.075","TRANSPORTE",777429075,755000000,22429075,41271,2012,"004 DE 2012",41365,"OK",41381,41299,41507,"OK",41550,"CERRADO",1,0.99839999999999995]
[23,"CUNDINAMARCA","SECRETARIA DE CIENCIA, TECNOLOGIA E INNOVACIÓN",2012000100010,"FORTALECIMIENTO DE LAS REGIONES COLOMBIANAS EN SUS CAPACIDADES DE CTI - CUNDINAMARCA","Asignación Ciencia, Tecnología e Innovación","CTEL",8721806744,8721806744,0,41263,2012,"001 DE 2012","15/12/2012 Acta No. 4\n","OK",41662,41369,41663,"OK",41663,"CONTRATADO EN EJECUCIÓN",0.86029999999999995,0.97289999999999999]
[24,"CUNDINAMARCA","SECRETARIA DE CIENCIA, TECNOLOGIA E INNOVACIÓN",2012000100056,"INVESTIGACIÓN ESTRATEGIAS DE VALORACION Y APROPIACION DE LOS RECURSOS NATURALES MECANISMOS DE ADAPTACION A CAMBIO CLIMATICO. REGION DEL BAJO MAGDALENA","Asignación Ciencia, Tecnología e Innovación","CTEL",7184175232,4100000000,3084175232,41263,2012,"001 DE 2012","20/12/2012 -001","OK",41492,41369,41569,"OK",41569,"CERRADO",1,0.99970000000000003]
[25,"CUNDINAMARCA","SECRETARIA DE CIENCIA, TECNOLOGIA E INNOVACIÓN",2012000100063,"FORTALECIMIENTO DE LAS CAPACIDADES DE INNOVACIÓN SOCIAL POR MEDIO DEL PARQUE CIENTIFICO EN BOGOTA - CUNDINAMARCA","Asignación Ciencia, Tecnología e Innovación","CTEL",16942704000,8250704000,8692000000,41263,2012,"001 DE 2012","20/12/2012 001","OK",41492,41369,41578,"OK",41578,"CERRADO",1,0.94730000000000003]
[26,"CUNDINAMARCA","SECRETARIA DE CIENCIA, TECNOLOGIA E INNOVACIÓN",2012000100118,"FORMACION EN CIENCIA, TECNOLOGIA E INNOVACION EN LA COMUNIDAD EDUCATIVA DE LAS INSTITUCIONES EDUCATIVAS OFICIALES DE LOS MUNICIPIOS NO CERTIFICADOS DEL DEPARTAMENTO","Asignación Ciencia, Tecnología e Innovación","CTEL",22788739251,17739839251,5048900000,41295,2013,"001 DE 2012","21/01/2013 002","OK",41638,41269,41570,"OK",41570,"CERRADO",0.98180000000000001,0.94810000000000005]
[27,"CUNDINAMARCA","SECRETARIA DE CIENCIA, TECNOLOGIA E INNOVACIÓN",2012000100144,"INVESTIGACIÓN INVESTIGACION, DESARROLLO Y TRANSFERENCIA TECNOLOGICA EN EL SECTOR AGROPECUARIO Y AGROINDUSTRIAL CON EL FIN DE MEJORAR L TODO EL DEPARTAMENTO, CUNDINAMARCA, CENTRO ORIENTE","Asignación Ciencia, Tecnología e Innovación","CTEL",50514736439,34707000000,15807736439,41263,2012,"001 DE 2012",41263,"OK",41492,41369,41586,"OK",43329,"CONTRATADO EN EJECUCIÓN",0.84330000000000005,0.82169999999999999]
[28,"CUNDINAMARCA","SECRETARIA DE CIENCIA, TECNOLOGIA E INNOVACIÓN",2012000100156,"CONSTRUCCIÓN DEL ECOSISTEMA DE INNOVACION TIC PARA EL DEPTO DE CUNDINAMARCA","Asignación Ciencia, Tecnología e Innovación","CTEL",7088000000,5000000000,2088000000,41263,2012,"001 DE 2012",41263,"OK",41492,41369,41948,"OK",41948,"CERRADO",0.98980000000000001,0.93179999999999996]
[29,"DESENTRALIZADOS","ICCU - GESPROY GB",2013000050003,"ESTUDIOS Y DISEÑOS PARA EL MEJORAMIENTO DE LA VA VILLAPINZON-TURMEQUE EN LONGITUD DE 11 KMS (K0+00 LOCALIZADO EN VILLAPINZON DEPARTAMENTO DE CUNDINAMARCA","(2013) Fondo de desarrollo regional $245.000.000","TRANSPORTE",245000000,245000000,0,41400,2013,"006 DE 2013",41571,"OK",41785,41632,41934,"OK",42023,"CERRADO",1,0.73470000000000002]
[30,"DESENTRALIZADOS","ICCU - GESPROY GB",2013000050004,"ESTUDIOS Y DISEÑOS PARA EL MEJORAMIENTO DE LA VA YACOPI - LA VICTORIA CON K0+00 EN YACOPI DEPARTAMENTO DE CUNDINAMARCA","(2013) Fondo de compensación regional $250.000.000","TRANSPORTE",250000000,250000000,0,41400,2013,"006 DE 2013",41571,"OK",41785,41632,41963,"OK",41974,"CERRADO",1,0.74909999999999999]
[31,"CUNDINAMARCA","SECRETARIA DE DESARROLLO E INCLUSIÓN SOCIAL",2013000050005,"IMPLEMENTACIÓN DEL PROGRAMA DE COMPLEMENTACION ALIMENTARIA Y NUTRICIONAL PARA MENORES DE CINCO AÑOS Y MUJERES GESTANTES Y LACTANTES EN TODO EL DEPARTAMENTO DE CUNDINAMARCA","(2013) Fondo de compensación regional $3.000.000.000\n(2013) Propios $94.916.059\n(2014) Fondo de compensación regional $3.000.000.000\n(2014) Propios $94.916.059","EDUCACIÓN",6189832118,6000000000,189832118,41400,2013,"006 DE 2013","1-24/10/2013","OK",41738,41586,41995,"OK",41967,"CERRADO",0.99819999999999998,0.9899]
[32,"CUNDINAMARCA","SECRETARIA DE EDUCACIÓN",2013000050011,"FORTALECIMIENTO DE LA PERMANENCIA DE LOS ESTUDIANTES EN LOS MUNICIPIOS DEL DEPARTAMENTO DE CUNDINAMARCA 2013-2014 CUNDINAMARCA, CENTRO ORIENTE","(2013) Fondo de compensación regional $7.360.387\n(2014) Fondo de compensación regional $6.000.000","EDUCACIÓN",13360387595,13360387595,0,41400,2013,"006 DE 2013",41508,"OK",41562,41530,41827,"OK",41791,"CERRADO",0.998,0.9234]
[33,"CUNDINAMARCA","SECRETARIA DE MINAS, ENERGIA Y GAS",2013000050026,"CONSTRUCCIÓN REDES ELECTRICAS EN LA ZONA RURAL DE LOS MUNICIPIOS DE PARATEBUENO Y GUTIERREZ EN EL DEPARTAMENTO DE CUNDINAMARCA","(2013) Propios $23.200.000\n(2013) SGR $1.045.119.227","MINAS Y ENERGÍA",1068319227,1045119227,23200000,41502,2013,"007 DE 2013","18/10/2013 009","OK",41586,41577,41586,"OK",41586,"CERRADO",0.44929999999999998,0.44700000000000001]
[34,"CUNDINAMARCA","SECRETARIA DE AGRICULTURA",2013000050027,"FORTALECIMIENTO DE LA ACTIVIDAD CAFETERA COMO ESTRATEGIA DE MEJORAMIENTO DE LA PRODUCTIVIDAD Y LA COMPETITIVIDAD EN EL DEPARTAMENTO DE CUNDINAMARCA, CENTRO ORIENTE","(2013) Propios $7.875.984.367\n(2013) SGR $1.499.633.914\n(2014) Propios $7.880.946.232\n(2014) SGR $1.500.366.086","AGRICULTURA ",18756930869,3000000000,15756930869,41502,2013,"025 DE 2014","18/10/2013 17","OK",41586,41585,41555,"OK",41586,"CERRADO",1,0.99490000000000001]
[35,"CUNDINAMARCA","SECRETARIA DE AGRICULTURA",2013000050028,"FORTALECIMIENTO DEL SUBSECTOR PANELERO EN EL DEPARTAMENTO DE CUNDINAMARCA","(2013) Propios $483.857.674\n(2013) SGR $1.299.782.239\n(2014) Propios $483.857.674\n(2014) SGR $1.299.782.239","AGRICULTURA ",3427279826,2599564478,827715348,41502,2013,"007 DE 2013","18/10/2013 016","OK",41586,41585,41586,"OK",41586,"CERRADO",1,0.99960000000000004]
[36,"DESENTRALIZADOS","ICCU - GESPROY GB",2013000050043,"MEJORAMIENTO Y REHABILITACION DE LA VIA GUACHETA - CAPELLANIA (SECTOR K0+780 AL K2+240) K0+000 LOCALIZADO EN EL RIO UBATE GUACHET, CUNDINAMARCA, CENTRO ORIENTE","(2014) Fondo de desarrollo regional $1.000.000.000\n(2014) Propios $19.047.619","TRANSPORTE",1019047619,1000000000,19047619,41639,2013,"015 DE 2013",41729,"OK",41782,41744,41806,"OK",41876,"CERRADO",1,0.98060000000000003]
[37,"ENTIDAD APORTANTE RECURSOS","BANCO AGRARIO DE COLOMBIA",2013000050044,"CONSTRUCCIÓN CUNDINAMARCA VISR 2013 TODO EL DEPARTAMENTO, CUNDINAMARCA, CENTRO ORIENTE",null,"AGRICULTURA ",60041780218,15888838218,44152942000,41569,2013,"005 DE 2015",41915,"OK",42024,42024,41884,"OK",41983,"CONTRATADO EN EJECUCIÓN",0.81020000000000003,0.85289999999999999]
[38,"DESENTRALIZADOS","ICCU - GESPROY GB",2013000050045,"MEJORAMIENTO Y PAVIMENTACIÓN DE LA VIA FOSCA - GUTIERREZ, DESDE EL KM 2+000 AL KM 3+000 (K0+000 LOCALIZADO EN FOSCA), DEPARTAMENTO DE CUNDINAMARCA","(2014) Fondo de desarrollo regional $2.000.000.000\n(2015) Propios $534.999.997","TRANSPORTE",2534999997,2000000000,534999997,41579,2013,"012 DE 2013",41676,"OK",41785,41632,41899,"OK",41971,"CERRADO",1,0.97450000000000003]
[39,"CUNDINAMARCA","SECRETARIA DE MINAS, ENERGIA Y GAS",2013000050046,"IMPLEMENTACIÓN Y MASIFICACION DEL SERVICIO DE GAS COMBUSTIBLE POR REDES PARA LOS MUNICIPIOS DE CAPARRAPI, EL PEÑON, LA PALMA, PAIME, TOPAIPI Y VILLAGOMEZ CUNDINAMARCA","(2013) Fondo de compensación regional $ 2.118.969.154\n(2013) Fondo de desarrollo regional $2.118.963.154\n(2013) Propios  $2.036.375.022\n(2014) Propios $9.464.800.188","MINAS Y ENERGÍA",6609136508,2118963154,4490173354,41579,2013,"012 DE 2013",41676,"OK",41928,41744,41934,"OK",41934,"CERRADO",1,1]
[40,"DESENTRALIZADOS","ICCU - GESPROY GB",2013000050047,"MEJORAMIENTO Y PAVIMENTACIÓN VIA GUANACAS - EL PEÑON DESDE EL K0+000 AL K2+000 (K0+000 UBICADO EN GUANACAS) MUNICIPIO EL PEÑON, CUNDINAMARCA","(2014) Fondo de desarrollo regional $3.000.000.000","TRANSPORTE",3000000000,3000000000,0,41808,2014,"022 DE 2014",41887,"OK",41918,41899,41941,"OK",41985,"CERRADO",1,0.99639999999999995]
[41,"DESENTRALIZADOS","ICCU - GESPROY GB",2013000050049,"MEJORAMIENTO Y MANTENIMIENTO DE LA RE VIAL MEDIANTE LA ADQUISICION DE MAQUINARIA AÑO 2013-2014 PARA LOS MUNICIPIOS DEL DEPARTAMENTO DE CUNDINAMARCA","(2013) Fondo de compensación regional $11.008.981.620\n(2013) Propios $3.321.872.756","TRANSPORTE",14330854376,12431431552,1899422824,41609,2013,"012 DE 2013",41676,"OK",41822,41599,41836,"OK",41884,"CERRADO",1,0.99960000000000004]
[42,"DESENTRALIZADOS","ICCU - GESPROY GB",2013000050050,"MEJORAMIENTO Y PAVIMENTACIÓN DE LA VIA SANAME - PUENTE QUETAME DESDE K0+000 AL K1+500 (K0+000 LOCALIZADO EN PUENTE QUEMADO) MUNICIPIO FOSCA, CUNDINAMARCA","(2014) Fondo de Desarrollo regional $3.000.000.000","TRANSPORTE",6000000000,6000000000,0,41639,2013,"015 DE 2013",41729,"OK",41782,41744,41807,"OK",41887,"CERRADO",1,0.49209999999999998]
[43,"CUNDINAMARCA","SECRETARIA DE AMBIENTE",2013000050051,"FORTALECIMIENTO DE LA GESTION INTEGRAL DE RESIDUOS SOLIDOS, A TRAVES DE SISTEMAS RECIONALES EN LAS PROVINCIAS DE UBATE Y RIONEGRO EN EL DEPARTAMENTO DE CUNDINAMARCA","(2014) Fondo de desarrollo regional $3.000.000.000","VIVIENDA, CIUDAD Y TERRITORIO ",3000000000,3000000000,0,41579,2013,"012 DE 2013",41736,"OK",41885,41712,41954,"OK",41970,"CERRADO",0.48280000000000001,0.47399999999999998]
[44,"CUNDINAMARCA","SECRETARIA DE AGRICULTURA",2013000050054,"MEJORAMIENTO DE LA PRODUCTIVIDAD Y COMPETITIVIDAD DEL SECTOR CAUCHERO EN EL DEPARTAMENTO DE CUNDINAMARCA","(2014) Fondo de desarrollo regional $878.495.000\n(2014) Propios $478.030.000\n(2015) Fondo de desarrollo regional $1.580.505.000\n(2015) Propios $828.830.000 ","AGRICULTURA ",3765860000,2459000000,1306860000,41639,2013,"015 DE 2013","06/02/2014 007","OK",41948,41935,41976,"OK",41976,"CERRADO",1,1]
[45,"CUNDINAMARCA","SECRETARIA DE GOBIERNO",2013000050056,"PREVENCIN DE INCENDIOS FORESTALES CON LA ADQUISICION DE VEHICULOS 4X4 ACCION RAPIDA TIPO FORESTAL PARA EL DEPARTAMENTO DE CUNDINAMARCA","(2013) Fondo de desarrollo regional $4.000.000.000","AMBIENTE Y DESARROLLO SOSTENIBLE",4000000000,4000000000,0,41579,2013,"012 DE 2013",41676,"OK",41723,41579,41809,"OK",41851,"CERRADO",1,0.99990000000000001]
[46,"CUNDINAMARCA","SECRETARIA DE AGRICULTURA",2013000050081,"MEJORAMIENTO DE LA PRODUCTIVIDAD, CALIDAD, POSCOSECHA Y MERCADEO DE LAS CADENAS HORTIFRUTCOLA Y AROMATICAS DE CUNDINAMARCA","(2014) Fondo de desarrollo regonal $1.860.300.000\n(2014) Propios $ 873.720.000\n(2015) Fondo de desarrollo regional $739.700.000\n(2015) Propios $1.150.200.000","AGRICULTURA ",4900400000,2600000000,2300400000,41808,2014,"022 DE 2014",41872,"OK",41964,41935,41976,"OK",41976,"CERRADO",1,1]
[47,"CUNDINAMARCA","SECRETARIA DE AGRICULTURA",2013000050083,"IMPLEMENTACIÓN Y PUESTA EN MARCHA DE UNA PLANTA HOMOGENIZADORA DE MIELES PARA LA PRODUCCION DE PANELA EN CAPARRAPI CUNDINAMARCA, CENTRO ORIENTE","(2014) Fondo de desarrollo regional $2.200.794.931\n(2014) Propios $177.000.000\n(2015) Fondo de compensación regional $925.447.593\n(2015) Propios $196.440.552","AGRICULTURA ",3322683076.3200002,3126242524.3200002,196440552,41808,2014,"022 DE 2014",41872,"OK",41948,41935,41948,"OK",41948,"CERRADO",1,1]
[48,"DESENTRALIZADOS","ICCU - GESPROY GB",2013000050094,"MEJORAMIENTO Y REHABILITACION DE LA VIA TABIO - CHIA DEL K1+100 AL K3+200","(2014) Fondo de desarrollo regional $2.000.000.000\n","TRANSPORTE",2000000000,2000000000,0,41639,2013,"015 DE 2013",41729,"OK",41782,41744,"Sin Dato","OK","Sin Dato","DESAPROBADO",0,0]
[49,"CUNDINAMARCA","SECRETARIA DE CIENCIA, TECNOLOGIA E INNOVACIÓN",2013000100129,"INCREMENTO EN LAS ESTRATEGIAS SUSTENTABLES EN EL USO DEL RECURSO DE ENERGA ELECTRICA PARA LA POBLACION VULNERABLE EN EL DPTO. DE CUNDINAMARCA","Asignación Ciencia, Tecnología e Innovación","CTEL",5264002961,4097083299,1166919662,41789,2014,"025 DE 2014",41789,"OK",42172,42139,42178,"OK",42178,"CONTRATADO EN EJECUCIÓN",0.89290000000000003,0.75719999999999998]
[50,"CUNDINAMARCA","SECRETARIA DE CIENCIA, TECNOLOGIA E INNOVACIÓN",2013000100131,"INVESTIGACIÓN ESTIMAR VULNERABILIDAD AL CAMBIO CLIMATICO DE SISTEMAS CAFETEROS Y DISEÑO DE ARREGLOS AGROFORESTALES CON BIOTECNOLOGIA PACHO, TIBACUY, SAN JUAN DE RIO SECO, CUNDINAMARCA","Asignación Ciencia, Tecnología e Innovación","CTEL",3287867000,2622860000,665007000,41474,2013,"005 DE 2013",41626,"OK",41663,41577,41663,"OK",41663,"CERRADO",0.98450000000000004,0.89039999999999997]
[51,"CUNDINAMARCA","SECRETARIA DE CIENCIA, TECNOLOGIA E INNOVACIÓN",2013000100149,"INNOVACIÓN EN EL MODELO DE GESTION DE MEDICAMENTO EN EL DEPARTAMENTO DE CUNDINAMARCA FASE II","Asignación Ciencia, Tecnología e Innovación","CTEL",3079583047,2490946916,588636131,41474,2013,"005 DE 2013",41638,"OK",41579,41547,41598,"OK",41612,"CERRADO",1,1]
[52,"CUNDINAMARCA","SECRETARIA DE CIENCIA, TECNOLOGIA E INNOVACIÓN",2013000100176,"INNOVACIÓN SISTEMA DE PRODUCCION DE FRUTAS/HORTALIZAS FRESCAS/PROCESADAS TIPO EXPORTACION CON TECNOLOGIA BIOLOGICA /INTEGRAL INOCUA SUBACHOQUE, CUNDINAMARCA, CENTRO ORIENTE","Asignación Ciencia, Tecnología e Innovación","CTEL",9285096292,6556945302,2728150990,41474,2013,"005 DE 2013",41656,"OK",43819,41577,41664,"OK",41887,"TERMINADO",1,0.68710000000000004]
[53,"CUNDINAMARCA","SECRETARIA DE CIENCIA, TECNOLOGIA E INNOVACIÓN",2013000100180,"DISEÑO SMART TON: TALENTO E INNOVACION APLICADA AL TERRITORIO","Asignación Ciencia, Tecnología e Innovación","CTEL",3089954000,2497510000,592444000,41509,2013,"008 DE 2013",41583,"OK",41663,41577,41663,"OK",41663,"CERRADO",1,0.86539999999999995]
[54,"CUNDINAMARCA","SECRETARIA DE CIENCIA, TECNOLOGIA E INNOVACIÓN",2013000100215,"FORTALECIMIENTO DE LA GESTIN COMUNITARIA DEL RECURSO HIDRICO, POR MEDIO DE LA DISMINUCION DEL CONSUMO DE ESTE, UTILIZANDO TP Y TICS , CUNDINAMARCA, CENTRO ORIENTE","Asignación Ciencia, Tecnología e Innovación","CTEL",1811292700,1608461700,202831000,41565,2013,"011 DE 2013",41583,"OK",41782,41709,41969,"OK",41969,"CERRADO",1,0.90739999999999998]
[55,"CUNDINAMARCA","SECRETARIA DE CIENCIA, TECNOLOGIA E INNOVACIÓN",2013000100217,"FORTALECIMIENTO DE LA COMPETITIVIDAD DEL SECTOR FLORICULTOR COLOMBIANO MEDIANTE EL USO DE CIENCIA, TECNOLOGA E INNOVACION APLICADAS EN EL DEPARTAMENTO DE CUNDINAMARCA","Asignación Ciencia, Tecnología e Innovación","CTEL",7204002875,4618409839,2585593036,41789,2014,"025 DE 2014",41789,"OK",42174,42160,42178,"OK",42178,"CERRADO",1,0.9859]
[56,"CUNDINAMARCA","SECRETARIA DE CIENCIA, TECNOLOGIA E INNOVACIÓN",2013000100247,"INVESTIGACIÓN E INNOVACIÓN TECNOLÓGICA Y APROPIACIÓN SOCIAL DE CONOCIMIENTO CIENTÍFICO DE ORQUÍDEAS NATIVAS DE CUNDINAMARCA","Asignación Ciencia, Tecnología e Innovación","CTEL",3400306874,2551931927,848374947,41856,2014,"027 DE 2014",41856,"OK",42174,42160,42179,"OK",42179,"CERRADO",0.96699999999999997,0.9526]
[57,"CUNDINAMARCA","SECRETARIA DE CIENCIA, TECNOLOGIA E INNOVACIÓN",2013000100248,"INNOVACIÓN , CIENCIA Y TECNOLOGIA PARA PRODUCTORES DE LECHE EN LA PROVINCIA DE UBATE, CUNDINAMARCA.","Asignación Ciencia, Tecnología e Innovación","CTEL",11619725567,9380319099,2239406468,41565,2013,"011 DE 2013",41626,"OK",42172,42139,42173,"OK",42178,"TERMINADO",0.80249999999999999,0.81969999999999998]
[58,"ENTIDAD APORTANTE RECURSOS","MUNICIPIO DE MADRID",2013000050048,"MEJORAMIENTO Y PAVIMENTACIÓN DE LA VIA AJOVER-SANTA CRUZ EN 2 KILOMETROS, MUNICIPIO DE MADRID, CUNDINAMARCA","(2014) Propios $246.944.399\n(2014) SGR $2.900.000.000","TRANSPORTE",8946944399,8700000000,246944399,41689,2014,"017 DE 2014",41564,"OK",42009,41672,42075,"OK",42264,"CERRADO",1,1]
[59,"ENTIDAD APORTANTE RECURSOS","CORMAGDALENA",20132401060001,"MANTENIMIENTO Y RECUPERACIÓN DE LA NAVEGABILIDAD DEL RIO MAGDALENA","(2015) Fondo de compensación $20.500.000.000\n(2015) Nación $40.000.000.000\n(2015) Propios $8.000.000.000\n(2015) SGR $3.000.000.000\n(2016) Nación $40.000.000.000\n(2016) Propios $5.000.000.000\n(2017) Nación $196.976.000.000\n(2017) Propios $5.000.000.000\n(2018) Nación $252.432.000.000\n(2018) Propios $5.000.000.000\n(2019) Nación $286.856.460.806\n(2019) Propios $5.000.000.000\n(2020) Nación $305.819.344.597\n(2020) Propios $5.000.000.000\n(2021) Nación $705.891.703.580\n(2021) Propios $5.000.000.000\n(2022) Nación $727.368.584.690\n(2022) Propios $5.000.000.000\n(2023) Nación $739.488.782.230\n(2024) Nación $471.470.945.699\n(2025) Nación $485.615.074.070\n(2026) Nación $500.183.526.293\n(2027) Nación $515.189.032.081\n","TRANSPORTE",3527443454052,117000000000,3410443454052,41514,2013,"001 DE 2013",41631,"OK",41781,41640,41766,"OK",41895,"CERRADO",4.4999999999999998E-2,3.8300000000000001E-2]
[60,"DESENTRALIZADOS","ICCU - GESPROY GB",2014000050033,"MEJORAMIENTO Y REHABILITACIÓN DE LA VIA TABIO - CHIA DEL K0+000 AL K1+800","(2014) Fondo de desarrollo regional $2.000.000\n(2016) Propios $570.000.000","TRANSPORTE",2570000000,2000000000,570000000,41893,2014,"026 DE 2014",42003,"OK",42151,41949,42206,"OK",42244,"CERRADO",1,1]
[61,"DESENTRALIZADOS","ICCU - GESPROY GB",2014257720001,"MEJORAMIENTO Y PAVIMENTACIÓN DE LA VIA SUESCA LA PLAYA - SESQUILE DEPARTAMENTO DE CUNDINAMARCA",null,"TRANSPORTE",4191000000,1391000000,2800000000,41743,2014,"001 DE 2014",41760,"OK",41669,41632,41631,"OK",41760,"CERRADO",1,0.98670000000000002]
[62,"CUNDINAMARCA","SECRETARIA DE GOBIERNO",2014000050010,"CONSTRUCCIÓN DE UN CENTRO DE ATENCION ESPECIALIZADA AL SERVICIO DE ADOLESCENTES INFRACTORES DE LA LEY PENAL EN EL DEPARTAMENTO DE CUNDINAMARCA","(2014) SGR $8.500.000.000\n(2015) Propios $760.000.000","JUSTICIA Y DEL DERECHO ",9260000000,8500000000,760000000,41808,2014,"022 DE 2014",42178,"OK",42174,42139,42179,"OK",42179,"PARA CIERRE",1,1]
[63,"ENTIDAD APORTANTE RECURSOS","MUNICIPIO DE VILLETA",2014000050048,"MEJORAMIENTO Y PAVIMENTACIÓN DE LA VIA VILLETA-PANTANILLO-CORREDOR CHUGUACAL -CAMBAO DEL K0+360 AL K1+060 VILLETA, CUNDINAMARCA, CENTRO ORIENTE","(2015) Fondo de desarrollo regional $1.500.000\n(2016) Propios $212.403.426","TRANSPORTE",1701612797,1489209370.23,212403426.76999998,42089,2015,"033 DE 2015",42146,"OK",42149,42116,42185,"OK",42250,"CERRADO",1,1]
[64,"DESENTRALIZADOS","ICCU - GESPROY GB",2015000050010,"MEJORAMIENTO DE LA VA SAN CAYETANO - COGUA SECTOR K6+670 - K8+366 (K0+000 LOCALIZADO EN EL CASCO URBANO DEL MUNICIPIO DE SAN CAYETANO) CUNDINAMARCA","(2015) Fondo de desarrollo regional $3.000.000\n(2016) Propios 796.247.522","TRANSPORTE",3796247522,3000000000,796247522,42158,2015,"036 DE 2015",42213,"OK",42243,42216,42265,"OK",42338,"CERRADO",1,0.98760000000000003]
[65,"DESENTRALIZADOS","ICCU - GESPROY GB",2015000050013,"MEJORAMIENTO DE LA VA UBAQUE - LOS CEREZOS - CHIPAQUE SECTORES DEL K0+000 AL K2+040 Y DEL K16+000 AL K18+260 (K0+000 LOCALIZADO EN UBAQUE) DEPARTAMENTO DE CUNDINAMARCA","(2015) Fondo de desarrollo regional $4.449.468.121\n(2016) Fondo de desarrollo regional $3.550.531.879","TRANSPORTE",8000000000,8000000000,{"$f":"H71-I71","v":0},42159,2015,"036 de 2015",42213,"OK",42236,42216,42265,"OK",42338,"CERRADO",0.99709999999999999,0.98750000000000004]
[66,"CUNDINAMARCA","SECRETARIA DE HABITAT Y VIVIENDA",2015000050014,"CONSTRUCCIÓN DE VIVIENDAS NUEVAS RURALES VISR 2015 EN EL DEPARTAMENTO DE CUNDINAMARCA-SGR","(2015) Fondo de compensación regional $1.284.769.000\n(2015) Fondo de desarrollo regional $5.555.500.782\n(2015) Propios $426.626.218\n(2016) Propios $32.000.000\n(2017) Propios $32.000.000\n(2018) Propios $32.000.000\n(2019) Propios $32.000.000\n(2020) Propios $32.000.000\n(2021) Propios $32.000.000\n(2022) Propios $32.000.000\n(2023) Propios $32.000.000\n(2024) Propios $32.000.000\n(2025) Propios $32.000.000","AGRICULTURA ",7588896000,6840269782,748626218,42173,2015,"036 de 2015",42158,"OK",42178,42174,42179,"OK",42179,"CERRADO",1,0.92759999999999998]
[67,"CUNDINAMARCA","SECRETARIA DE EDUCACIÓN",2015000050015,"FORTALECIMIENTO DE LA PERMANENCIA DE LOS ESTUDIANTES EN LOS MUNICIPIOS DEL DEPARTAMENTO DE CUNDINAMARCA, CENTRO ORIENTE - 2015","(2015) Fondo de compensación regional $6.373.797.030","EDUCACIÓN",8373797030,8373797030,0,42159,2015,"036 de 2015",42297,"OK",42242,42209,42255,"OK",42255,"CERRADO",0.97070000000000001,0.85189999999999999]
[68,"DESENTRALIZADOS","ICCU - GESPROY GB",2015000050025,"MEJORAMIENTO Y PAVIMENTACIÓN DE LA TRONCAL DEL CARBON SECTOR K0+000 AL K2+860 (K0+000 LOCALIZADO EN TIERRA NEGRA, MUNICIPIO DE TAUSA), DEPARTAMENTO DE CUNDINAMARCA","(2015) Fondo de desarrollo regional $6.000.000.000\n(2016) Propios $1.913.699.780","TRANSPORTE",7913699780,6000000000,1913699780,42159,2015,"036 DE 2015",42213,"OK",42236,42584,42264,"OK",42328,"CERRADO",1,1]
[69,"CUNDINAMARCA","SECRETARIA DE EDUCACIÓN",2015000050026,"FORTALECIMIENTO A LA ESTRATEGIA DE ALIMENTACIÓN ESCOLAR PARA MUNICIPIOS NO CERTIFICADOS DEL DEPARTAMENTO DE CUNDINAMARCA, CENTRO ORIENTE","(2015) Fondo de compensación regional $2.100.000.000","EDUCACIÓN",2100000000,2100000000,0,42159,2015,"036 de 2015",42283,"OK",42237,42209,42317,"OK",42317,"CERRADO",1,0.85509999999999997]
[70,"CUNDINAMARCA","SECRETARIA DE AGRICULTURA",2015000050029,"IMPLEMENTACIÓN Y PUESTA EN MARCHA DE UNA PLANTA HOMOGENIZADORA DE MIELES PARA LA PRODUCCION DE PANELA EN EL MUNICIPIO DE QUIPILE, CUNDINAMARCA, CENTRO ORIENTE","(2015) Fondo de compensación regional $1.707.361.177\n(2015) Propios $55.000.000\n(2016) Fondo de compensación regional $1.432.150.480\n(2016) Propios $201.020.000","AGRICULTURA ",3395531657,3139511657,256020000,42180,2015,"037 de 25 2015",42213,"OK",42654,42587,42709,"OK",42709,"CERRADO",1,1]
[71,"CUNDINAMARCA","SECRETARIA DE AGRICULTURA",2015000050030,"FORTALECIMIENTO A LA CADENA PRODUCTIVA DEL CACAO EN EL DEPARTAMENTO DE CUNDINAMARCA","(2015) Fondo de compensación regional $1.160.000.000\n(2015) Propios $1.053.334.400\n(2016) Fondo de compensación regional $40.000.000","AGRICULTURA ",2253334400,1200000000,1053334400,42159,2015,"036 de 2015",42228,"OK",42227,42213,42228,"OK",42228,"CERRADO",1,1]
[72,"CUNDINAMARCA","SECRETARIA DE GOBIERNO",2015000050031,"ADQUISICIÓN DE VEHICULOS PARA LOS CUERPOS OPERATIVOS (BOMBEROS) PARA LAS PROVINCIAS DEL DEPARTAMENTO DE CUNDINAMARCA","(2015) Fondo de desarrollo regional $3.760.000.000","AMBIENTE Y DESARROLLO SOSTENIBLE",3670000000,3670000000,0,42159,2015,"036 de 2015",42213,"OK",42195,42181,42303,"OK",42303,"CERRADO",1,0.98]
[73,"CUNDINAMARCA","SECRETARIA DE AGRICULTURA",2015000050034,"FORTALECIMIENTO DE LA PRODUCTIVIDAD Y COMPETITIVIDAD DEL SECTOR CAUCHERO EN EL DEPARTAMENTO DE CUNDINAMARCA","(2015) Fondo de compensación regional $1.374.200.000\n(2015) Propios $658.800.000\n(2016) Fondo de compensación regional $125.800.000","AGRICULTURA ",2158800000,1500000000,658800000,42159,2015,"036 de 2015",42234,"OK",42227,42213,42240,"OK",42240,"CERRADO",1,1]
[74,"DESENTRALIZADOS","ICCU - GESPROY GB",2015000050041,"MEJORAMIENTO DE LA VA UBALA - PALOMAS - MAMBITA - MEDINA (K0+000 UBICADO EN EL SITIO PROFESIONALES MUNICIPIO DE UBALA, DEPARTAMENTO DE CUNDINAMARCA","(2015) Fondo de compensación regional $224.840.000\n(2015) Fondo de desarrollo regional $8.649.310.938\n(2016) Fondo de compensación regional $2.446.570.751\n(2016) Fondo de desarrollo regional $1.342.769.761\n(2017) Propios $1.000.000.000","TRANSPORTE",13663491451,12663491451,1000000000,42180,2015,"037 DE 2015",42213,"OK",42706,42216,42264,"OK",42326,"CERRADO",1,1]
[75,"CUNDINAMARCA","SECRETARIA DE DESARROLLO E INCLUSIÓN SOCIAL",2015000050048,"IMPLEMENTACIÓN DEL PROGRAMA DE COMPLEMENTACION ALIMENTARIA Y NUTRICIONAL PARA MENORES DE 5 AÑOS, MADRES GESTANTES Y LACTANTES EN TODO EL DEPARTAMENTO DE CUNDINAMARCA 2015","(2016) Fondo de compensación regional $2.900.000.000","SALUD Y PROTECCIÓN SOCIAL",2900000000,2900000000,0,42348,2015,"044 de 2015",42348,"OK",42621,42605,42668,"OK",42692,"CERRADO",1,1]
[76,"CUNDINAMARCA","SECRETARIA DE EDUCACIÓN",2016000050005,"FORTALECIMIENTO DE LA PERMANENCIA DE LOS ESTUDIANTES EN LOS MUNICIPIOS DEL DEPARTAMENTO DE CUNDINAMARCA, CENTRO ORIENTE - 2016","(2016) SGR $14.963.757.156","EDUCACIÓN",14963757156,14963757156,0,42605,2016,"054 DE 2016",42606,"OK",42634,42629,42647,"OK",42647,"CERRADO",0.96699999999999997,0.56169999999999998]
[77,"CUNDINAMARCA","SECRETARIA DE EDUCACIÓN",2016000050014,"FORTALECIMIENTO A LA ESTRATEGIA DE ALIMENTACION ESCOLAR PARA MUNICIPIOS NO CERTIFICADOS DEL DEPARTAMENTO DE CUNDINAMARCA, SGR 2016.","(2016) Fondo de desarrollo regional $12.339.894.658","EDUCACIÓN",12339894658,12339894658,0,42625,2016,"055 de 2016",42629,"OK",42634,42633,42634,"OK",42634,"CERRADO",0.76700000000000002,0.74729999999999996]
[78,"DESENTRALIZADOS","ICCU - GESPROY GB",2016000050023,"MANTENIMIENTO DE LA RED VIAL EN AFIRMADO A TRAVS DE LA ADQUISICION DE MAQUINARIA PESADA Y EQUIPO DE TRANSPORTE EN EL DEPARTAMENTO DE CUNDINAMARCA","(2017) SGR $12.992.542.392\n(2018) SGR $11.187.275.138","TRANSPORTE",24179817530,24179817530,0,43066,2017,"068 de 2017",43131,"OK",43494,43474,43277,"OK",43223,"CERRADO",0.9133,0.62809999999999999]
[79,"DESENTRALIZADOS","ICCU - GESPROY GB",2016000050025,"REHABILITACIÓN DE LA VIA BOQUERON - PANDI DEL DEPARTAMENTO DE CUNDINAMARCA",null,"TRANSPORTE",4991550669,4991550669,0,42825,2017,"061 DE 2017",43000,"OK",42984,42891,43021,"OK",43087,"CERRADO",1,0.98740000000000006]
[80,"DESENTRALIZADOS","ICCU - GESPROY GB",2016000050029,"REHABILITACIÓN DE LA VIA LA QUINTA - REPRESA DEL NEUSA, MUNICIPIO DE COGUA, DEPARTAMENTO DE CUNDINAMARCA","(2017) Asginaciones directas $64.456.762\n(2017) Fondo de compensación regional $543.119.703\n(2017) Fondo de desarrollo regional $4.676.267.432\n(2017) Propios $392.423.535\n(2018) Fondo de desarrollo regional $341.913.166\n(2018) Propios $780.496.134","TRANSPORTE",6798676732,5625757063,1172919669,42846,2017,"061 de 2017",43000,"OK",43626,42891,43021,"OK",43098,"CERRADO",1,0.99990000000000001]
[81,"DESENTRALIZADOS","ICCU - GESPROY GB",2016000050032,"REHABILITACIÓN DE LA VIA CLUB EL BOSQUE - TIBACUY - CUMACA DEL DEPARTAMENTO DE CUNDINAMARCA","(2017) Fondo de desarrollo regional $2.980.233.374\n(2018) Fondo de desarrollo regional $41.916.760\n(2018) Propios $1.000.000.000","TRANSPORTE",4022150134,3022150134,1000000000,42825,2017,"061 DE 2017",43000,"OK",42984,42891,43021,"OK",43118,"CERRADO",1,0.99980000000000002]
[82,"ENTIDAD APORTANTE RECURSOS","ALCALDIA MAYOR DE BOGOTA",2016000050033,"ELABORACIÓN DE LA ENCUESTA MULTIPROPOSITO 2017 : BOGOTA - CUNDINAMARCA","(2017) Propios $521.000.000\n(2017) SGR $26.949.969.184\n(2018) SGR $ 1.298.345.781\n(2019) SGR $281.073.614","VIVIENDA, CIUDAD Y TERRITORIO ",17282722269,16761722269,521000000,42825,2017,"061 DE 2017",42947,"OK",42872,42872,43342,"OK",43006,"CERRADO",1,0.99950000000000006]
[83,"CUNDINAMARCA","SECRETARIA DE HABITAT Y VIVIENDA",2016000050052,"CONSTRUCCIÓN DE VIVIENDAS NUEVAS RURALES EN EL DEPARTAMENTO DE CUNDINAMARCA","(2018) Propios $640.030.220\n(2018) SGR $5.173.764.521\n(2018) SGR - Asignaciones directas $169.984.284","AGRICULTURA ",5983779025.1700001,5343748804.6800003,640030220.48999977,43090,2017,"069 de 2017",43438,"OK",43523,43507,43360,"OK",43539,"CONTRATADO EN EJECUCIÓN",0.99990000000000001,0.99990000000000001]
[84,"CUNDINAMARCA","SECRETARIA DE CIENCIA, TECNOLOGIA E INNOVACIÓN",2016000100027,"ANLISIS DE FACTORES GENETICOS, SANITARIOS Y MEDIOAMBIENTALES QUE AFECTAN LAS TASAS DE PREÑEZ A PARTIR DE EMBRIONES IN VITRO EN EL DEPARTAMENTO DE CUNDINAMARCA","Asignación Ciencia, Tecnología e Innovación","CTEL",8135504363,6359045755,{"$f":"H90-I90","v":1776458608},43098,2017,"063 DE 2017",43277,"OK",43244,43244,43369,"OK",43369,"TERMINADO",1,0.99670000000000003]
[85,"CUNDINAMARCA","SUPERVISIÓN / INTERVENTORÍA RAPE - SECRETARIA DE PLANEACIÓN",2016000050012,"IMPLEMENTACIÓN DE ACCIONES DE CONSERVACION Y RESTAURACION DE LOS COMPLEJOS DE PARAMO, BOSQUE ALTO-ANDINO Y SERVICIOS ECOSISTEMICOS DE LA REGION CENTRAL","(2017) SGR $16.800.086.695\n(2018) SGR $15.699.900.587","AMBIENTE Y DESARROLLO SOSTENIBLE",32499987282,{"$f":"H91","v":32499987282},0,42829,2017," 058 DE 2016",42999,"OK",42934,42976,43035,"OK",43070,"CONTRATADO EN EJECUCIÓN",0.99809999999999999,0.99880000000000002]
[86,"CUNDINAMARCA","SECRETARIA DE DESARROLLO E INCLUSIÓN SOCIAL",2017000050017,"FORTALECIMIENTO DEL PROGRAMA DE COMPLEMENTACIÓN ALIMENTARIA Y NUTRICIONAL PARA NIÑAS, NIÑOS MENORES DE 5 AÑOS Y MADRES GESTANTES Y LACTANTES EN RIESGO DE DESNUTRICIÓN DEL DEPARTAMENTO DE CUNDINAMARCA",null,"INCLUSIÓN SOCIAL Y RECONCILIACIÓN",8199993544,8199993544,0,42915,2017,"062 de 2017",43059,"OK",43055,43055,43123,"OK",43124,"CERRADO",1]
[87,"CUNDINAMARCA","SECRETARIA DE EDUCACIÓN",2017000050027,"FORTALECIMIENTO DE LA PERMANENCIA DE LOS ESTUDIANTES EN LOS MUNICIPIOS DEL DEPARTAMENTO DE CUNDINAMARCA , CENTRO ORIENTE 2017 CUNDINAMARCA","(2017) Fondo de desarrollo regional $8.199.993.544","EDUCACIÓN",14995289800,14995289800,0,42961,2017,"064 de 2017",42961,"OK",43040,43021,42965,"OK",43034,"CERRADO",1,0.88590000000000002]
[88,"ENTIDAD APORTANTE RECURSOS","MUNICIPIO DE ZIPAQUIRA",2017000050029,"CONSERVACIÓN  Y GESTIÓN INTEGRAL DEL RECURSO HÍDRICO MEDIANTE LA ADQUISICIÓN Y RESTAURACIÓN DE PREDIOS DE INTERÉS ECOSISTÉMICO EN ELDEPARTAMENTO DE   CUNDINAMARCA","(2018) Propios $433.000.000\n(2018) SGR  $467.000.000","AMBIENTE Y DESARROLLO SOSTENIBLE",900000000,467000000,433000000,43340,2018,"077 DE 2018",43503,"OK",43427,43081,43571,"OK",43585,"CONTRATADO EN EJECUCIÓN",0.3327,0.47539999999999999]
[89,"CUNDINAMARCA","SECRETARIA DE EDUCACIÓN",2017000050033,"FORTALECIMIENTO A LA ESTRATEGIA DE ALIMENTACIÓN ESCOLAR PARA MUNICIPIOS NO CERTIFICADOS DEL DEPARTAMENTO DE CUNDINAMARCA","(2017) SGR $14.000.000.000","EDUCACIÓN",14000000000,14000000000,0,42977,2017,"065 de 2017",43056,"OK",43075,43075,43056,"OK",43048,"CERRADO",1,0.26939999999999997]
[90,"CUNDINAMARCA","SECRETARIA DE MINAS, ENERGIA Y GAS",2017000050036,"IMPLEMENTACIÓN Y EXPANSIÓN DEL SERVICIO DE GAS COMBUSTIBLE POR REDES PARA VEREDAS Y CENTROS POBLADOS DEL DEPARTAMENTO DE CUNDINAMARCA","(2018) Propios $314.242.952\n(2018) SGR $1.292.065.001\n(2018) SGR - Asignaciones directas $358.177.160\n(2019) Propios $1.367.786.017\n(2019) SGR $63.000.000\n(2019) SGR - Asignaciones directas $1.356.414.342","MINAS Y ENERGÍA",4751658472,3069656503,1682001969,43356,2018,"077 DE 2018",43504,"OK",43545,43507,43584,"OK",43584,"CERRADO",0.91510000000000002,0.92069999999999996]
[91,"CUNDINAMARCA","SECRETARIA DE PLANEACIÓN",2017000050039,"MEJORAMIENTO DE VÍAS TERCIARIAS MEDIANTE EL USO DE PLACA HUELLA EN LOS MUNICIPIOS DE GUATAVITA, PACHO, SAN JUAN DE RIOSECO, SUBACHOQUE, TENA Y ZIPAQUIRÁ, DEPARTAMENTO DE CUNDINAMARCA","(2017) SGR $6.725.380.624\n(2019) Propios $65.721.800","TRANSPORTE",6791102421.6400003,6725380621.6400003,65721800,43063,2017,"067 DE 2017",43224,"OK",43224,43220,43291,"OK",43328,"CONTRATADO EN EJECUCIÓN",0.98519999999999996,0.92030000000000001]
[92,"CUNDINAMARCA","SECRETARIA DE HABITAT Y VIVIENDA",2017000050042,"MEJORAMIENTO DE VIVIENDAS RURALES DE LA PROVINCIA DE UBATÉ - CUNDINAMARCA","(2017) SGR $2.354.318.125","VIVIENDA, CIUDAD Y TERRITORIO ",2354318125,2354318125,0,43096,2017,"069 de 2017",43270,"OK",43300,43259,43341,"OK",43341,"TERMINADO",1,0.99729999999999996]
[93,"CUNDINAMARCA","SECRETARIA DE SALUD",2017000050061,"ADQUISICIÓN AMBULANCIAS DE TRANSPORTE ASISTENCIAL BÁSICO (TAB) Y TRANSPORTE ASISTENCIAL MEDICALIZADA (TAM), PARA EL APOYO DEL SISTEMA DE REFERENCIA Y CONTRA REFERENCIA DE LA RED HOSPITALARIA DEL DEPARTAMENTO DE CUNDINAMARCA",null,"SALUD Y PROTECCIÓN SOCIAL",3764666699,2000553024,1764113675,43081,2017,"069 de 2017",43081,"OK",43175,43166,43235,"OK",43318,"CERRADO",1,0.9708]
[94,"CUNDINAMARCA","SECRETARIA DE AGRICULTURA",2017000050062,"FORTALECIMIENTO DE LAS CADENAS PRODUCTIVAS DE MANGO, AGUACATE Y CÍTRICOS EN EL DEPARTAMENTO DE CUNDINAMARCA",null,"AGRICULTURA ",3000129600,2100129600,900000000,43124,2018,"072 DE 2018",43126,"OK",43126,43126,43126,"OK",43126,"CERRADO",1,1]
[95,"CUNDINAMARCA","SECRETARIA DE MINAS, ENERGIA Y GAS",2017000050064,"CONSTRUCCIÓN DE REDES ELÉCTRICAS EN ZONA RURAL DE 13 MUNICIPIOS, EN EL MARCO DEL PROYECTO ILUMINANDO VIDAS DEL DEPARTAMENTO DE CUNDINAMARCA","(2018) Propios $440.515.408\n(2018) SGR $2.532.327.281","MINAS Y ENERGÍA",2972842689,2532327281,440515408,43273,2018,"076 DE 2018",43418,"OK",43360,43360,43510,"OK",43510,"CERRADO",0.82330000000000003,0.81879999999999997]
[96,"CUNDINAMARCA","SECRETARIA DE AGRICULTURA",2017000050065,"MEJORAMIENTO DE LA PRODUCTIVIDAD Y RENTABILIDAD DE LOS CAFICULTORES DEL DEPARTAMENTO DE CUNDINAMARCA","(2017) $1.327.357.177\n(2017) SGR $2.372.880.052\n(2018) Propios $976.522.877\n(2018) SGR $1.853.119.948","AGRICULTURA ",6523880054,4220000000,2303880054,43096,2017,"069 DE 2017",43125,"OK",43123,43122,43126,"OK",43126,"TERMINADO",0.86480000000000001,0.84630000000000005]
[97,"CUNDINAMARCA","SECRETARIA DE CIENCIA, TECNOLOGIA E INNOVACIÓN",2017000100016,"IMPLEMENTACIÓN PROGRAMA DE INNOVACIÓN PARA LA VALIDACIÓN Y GENERACIÓN DE PRODUCTOS DERIVADOS DE LA BIODIVERSIDAD EN EL DEPARTAMENTO DE CUNDINAMARCA","Asignación Ciencia, Tecnología e Innovación","CTEL",4825004077.9799995,4664086788.1700001,160917289.80999947,42941,2017,"058 DE 2017",43039,"OK",43010,43004,43054,"OK",43089,"CONTRATADO EN EJECUCIÓN",0.79620000000000002,0.96160000000000001]
[98,"CUNDINAMARCA","SECRETARIA DE CIENCIA, TECNOLOGIA E INNOVACIÓN",2017000100034,"IMPLEMENTACIÓN DE UN SISTEMA DE GESTIÓN DE INNOVACIÓN PARA LA INDUSTRIA DE CUNDINAMARCA","Asignación Ciencia, Tecnología e Innovación","CTEL",3925471448,3714407118,211064330,42941,2017,"058 DE 2017",42928,"OK",43010,43004,43054,"OK",43049,"CONTRATADO EN EJECUCIÓN",0.99209999999999998,0.94179999999999997]
[99,"CUNDINAMARCA","SECRETARIA DE CIENCIA, TECNOLOGIA E INNOVACIÓN",2017000100074,"IMPLEMENTACIÓN DE ESTRATEGIAS DE FOMENTO A LA CULTURA Y SERVICIOS DE INNOVACIÓN EN LAS PROVINCIAS SABANA OCCIDENTE, SABANA CENTRAL, SOACHA Y SUMAPAZ CUNDINAMARCA","Asignación Ciencia, Tecnología e Innovación","CTEL",6183633276,5533633276,650000000,43098,2017,"063 DE 2017"," 26/06/2018 ","OK",43523,43244,43418,"OK",43406,"PARA CIERRE",1,0.99709999999999999]
[100,"CUNDINAMARCA","SECRETARIA DE CIENCIA, TECNOLOGIA E INNOVACIÓN",2017000100076,"FORTALECIMIENTO DE CAPACIDADES DE GESTIÓN DEL RIESGO A TRAVÉS DE APROPIACIÓN SOCIAL DE LA CIENCIA, LA TECNOLOGÍA Y LA INNOVACIÓN EN EL DEPARTAMENTO DE CUNDINAMARCA","Asignación Ciencia, Tecnología e Innovación","CTEL",4404970720,4000000000,404970720,43322,2018,"068 DE 2018",43511,"OK",43402,43402,43599,"OK",43602,"CONTRATADO EN EJECUCIÓN",0.98760000000000003,1.2524]
[101,"CUNDINAMARCA","SECRETARIA DE CIENCIA, TECNOLOGIA E INNOVACIÓN",2017000100087,"FORMACIÓN DE TALENTO HUMANO DE ALTO NIVEL EN MAESTRÍAS EN EL DEPARTAMENTO DE CUNDINAMARCA","Asignación Ciencia, Tecnología e Innovación","CTEL",5148022960,5048022960,100000000,43698,2019,"078 DE 2019",43811,"OK",43787,"18/11/2019\t","28/02/2020\t","OK","28/02/2020\t","CONTRATADO EN EJECUCIÓN",0.61890000000000001,1.7048000000000001]
[102,"CUNDINAMARCA","SECRETARIA DE CIENCIA, TECNOLOGIA E INNOVACIÓN",2017000100104,"FORTALECIMIENTO DE LA CULTURA DE LA GESTIÓN Y UTILIZACIÓN DEL CONOCIMIENTO EN CTEI EN NIÑOS, JÓVENES Y COMUNIDADES DEL DEPARTAMENTO DE CUNDINAMARCA","Asignación Ciencia, Tecnología e Innovación","CTEL",9498967749,7498967749,2000000000,43565,2019,"074 DE 2019","07/10/2019\t","OK","19/09/2019\t","27/08/2019\t","08/10/2019\t","OK","07/11/2019\t","CONTRATADO EN EJECUCIÓN",0.93269999999999997,0.89470000000000005]
[103,"CUNDINAMARCA","UNIDAD ADMINISTRATIVA DE GESTIÓN DEL RIESGO.",20172401060022,"ESTUDIOS DETALLADOS PARA LA INCORPORACIÓN DE LA GESTIÓN DEL RIESGO PARA LOS MUNICIPIOS DE GIRARDOT, RICAURTE","(2018) SGR $3.084.907.873","AMBIENTE Y DESARROLLO SOSTENIBLE",3084907873,3084907873,0,43802,2019,"033 DE 2019",43745,"OK","27/08/2019\t","27/08/2019\t","08/10/2019\t","OK","05/10/2021\t","CONTRATADO EN EJECUCIÓN",0.20300000000000001,0.20269999999999999]
[104,"CUNDINAMARCA","SECRETARIA DE CIENCIA, TECNOLOGIA E INNOVACIÓN",20170000100012,"CONFORMACIÓN DE UNA CONVOCATORIA REGIONAL DE PROYECTOS I+D EN FOCOS PRIORIZADOS CTEI PARA EL FORTALECIMIENTO DE LOS GRUPOS DE INVESTIGACIÓN CUNDINAMARCA","Asignación Ciencia, Tecnología e Innovación","CTEL",7586358670.8000002,7375550629.0600004,210808041.73999977,42941,2017,"058 DE 2017","09/11/2017\t","OK","20/02/2019\t","26/09/2017\t","12/12/2017\t","OK","20/12/2017\t","CONTRATADO EN EJECUCIÓN",0.72089999999999999,0.96760000000000002]
[105,"ENTIDAD APORTANTE RECURSOS","CAR",2017000050063,"RECUPERACIÓN HIDRÁULICA Y AMBIENTAL DEL COMPLEJO LAGUNAR  FÚQUENE","(2018) SGR $13.872.442.184\n(2019) SGR $4.127.557.816","AMBIENTE Y DESARROLLO SOSTENIBLE",18000000000,18000000000,0,43364,2018,"081 DE 2018","12/02/2019\t","OK","10/05/2019\t","10/05/2019\t","25/07/2019\t","OK","24/09/2019\t","CONTRATADO EN EJECUCIÓN",0.8982,0.64629999999999999]
[106,"ENTIDAD APORTANTE RECURSOS","CAR",2017000050070,"CONSTRUCCIÓN DE OBRAS DE MITIGACIÓN DEL RIESGO POR EVENTOS CLIMÁTICOS EN LA CUENCA DE LA QUEBRADA LA PARROQUIA EN EL CERRO DE FUSACATÁN DEL MUNICIPIO DE  FUSAGASUGÁ, CUNDINAMARCA","(2018) Propios $600.000.000\n(2018) SGR $1.376.558.725","AMBIENTE Y DESARROLLO SOSTENIBLE",1976558725,1376558725,600000000,43417,2018,"082 DE 2018","29/04/2019\t","OK","11/04/2019\t","10/04/2019\t","no hay datos","OK","no hay dato","DESAPROBADO",0,0]
[107,"ENTIDAD APORTANTE RECURSOS","MUNICIPIO DE UTICA",2017000050087,"MEJORAMIENTO DEL SENDERO TURÍSTICO DE LA PROVINCIA DEL GUALIVÁ  – ÚTICA  CUNDINAMARCA","(2018) SGR $2.123.058.880\n(2019) Propios $223.945.988","COMERCIO, INDUSTRIA Y TURISMO ",2347004868,2123058880,223945988,43241,2018,"075 de 2018","25/06/2018\t","OK","01/06/2018\t","21/05/2018\t","12/09/2018\t","OK","14/12/2018\t","TERMINADO",0.78920000000000001,0.95660000000000001]
[108,"CUNDINAMARCA","SECRETARIA DE EDUCACIÓN",2018000050019,"FORTALECIMIENTO DE LA PERMANENCIA DE LOS ESTUDIANTES EN LOS MUNICIPIOS DEL DEPARTAMENTO DE CUNDINAMARCA, CENTRO ORIENTE 2018 CUNDINAMARCA","(2018) SGR $19.395.559.645","EDUCACIÓN",19395559645,19395559645,0,43336,2018,"080 DE 2018","24/08/2018\t","OK","06/09/2018\t","31/08/2018\t","05/09/2018\t","OK","05/09/2018\t","CERRADO",1,0.66120000000000001]
[109,"DESENTRALIZADOS","ICCU - GESPROY GB",2018000050022,"MEJORAMIENTO Y REHABILITACIÓN DE VÍAS SECUNDARIAS EN LA PROVINCIA DE UBATÉ, DEPARTAMENTO DE CUNDINAMARCA","(2018) SGR $7.441.105.086\n(2019) Propios $83.771.277","TRANSPORTE",7524876363,7441105086,83771277,43320,2018,"078 de 2018","07/02/2019\t","OK","18/02/2019\t","05/10/2018\t",43594,"OK","29/04/2019\t","CERRADO",0.98829999999999996,0.97309999999999997]
[110,"DESENTRALIZADOS","ICCU - GESPROY GB",2018000050024,"MEJORAMIENTO Y REHABILITACIÓN DE LA VÍA LA MARÍA – TOBIA - PASO EL REJO - LA PEÑA, DEPARTAMENTO DE CUNDINAMARCA","(2018) SGR $8.983.328.881\n(2019) Propios $165.834.110","TRANSPORTE",9149162991,8983328881,165834110,43417,2018,"082 de 2018","14/03/2019\t","OK","19/03/2019\t","14/03/2019\t","20/03/2019\t","OK","17/05/2019\t","CERRADO",0.96450000000000002,0.96089999999999998]
[111,"DESENTRALIZADOS","ICCU - GESPROY GB",2018000050026,"MEJORAMIENTO DE VÍAS EN LA PROVINCIA DE SUMAPAZ PARA LA CONSOLIDACIÓN DE UNA PAZ ESTABLE Y DURADERA EN EL DEPARTAMENTO DE CUNDINAMARCA",null,"TRANSPORTE",11457047617,11457047617,0,43462,2018,"011 de 2018 - OCAD PAZ","14/03/2019\t","OK","19/03/2019\t\t","14/03/2019\t","20/03/2019\t","OK",43617,"CONTRATADO EN EJECUCIÓN",0.52569999999999995,0.57879999999999998]
[112,"CUNDINAMARCA","UNIDAD ADMINISTRATIVA DE GESTIÓN DEL RIESGO.",2018000050036,"CONSTRUCCIÓN DE OBRAS PARA LA MITIGACIÓN DEL RIESGO EN EL MUNICIPIO DE SAN BERNARDO, BENEFICIANDO A COMUNIDADES DE LOS MUNICIPIOS DE ARBELAEZ, PANDI Y VENECIA CUNDINAMARCA","(2018) SGR $2.094.390.119\n(2019) SGR $211.398.062","AMBIENTE Y DESARROLLO SOSTENIBLE",2305788182,2305788182,0,43629,2019,"089 de 2019","DESAPROBADO","OK","DESAPROBADO","DESAPROBADO","DESAPROBADO","OK","DESAPROBADO","DESAPROBADO",0,0]
[113,"CUNDINAMARCA","SECRETARIA DE HABITAT Y VIVIENDA",2018000050039,"MEJORAMIENTO DE VIVIENDA RURAL EN LOS MUNICIPIOS DE CUCUNUBÁ, JERUSALEN, QUEBRADANEGRA Y VIOTÁ - DEPARTAMENTO DE CUNDINAMARCA","(2018) SGR $4.024.793.625","AGRICULTURA ",4024793625,4024793625,0,43571,2019,"009 DE 2019","08/03/2019\t","OK","06/06/2019\t","28/05/2019\t","25/06/2019\t","OK","25/06/2019\t","PARA CIERRE",1,1]
[114,"DESENTRALIZADOS","ICCU - GESPROY GB",2018000050049,"MEJORAMIENTO DE LA VÍA SESQUILÉ – GUATAVITA - GACHETÁ, DEPARTAMENTO DE CUNDINAMARCA","(2018) SGR $3.935.792.642\n(2020) Propios $61.921.403","TRANSPORTE",3997714045,3935792642,61921403,43455,2018,"084 de 2018","14/03/2019\t","OK","14/03/2019\t","14/03/2019\t","15/03/2019\t","OK","27/05/2019\t","CERRADO",0.80930000000000002,0.80869999999999997]
[115,"DESENTRALIZADOS","ICCU - GESPROY GB",2018000050055,"MEJORAMIENTO DE LA TRONCAL DE RIONEGRO, SECTOR LA PALMA CHARCO LARGO PARA LA CONSOLIDACIÓN DE UNA PAZ ESTABLE Y DURADERA EN EL DEPARTAMENTO DE CUNDINAMARCA","(2018) SGR $4.441.833.955","TRANSPORTE",17928531277,17928531277,0,43532,2019,"086 de 2019","08/05/2019\t","OK","21/05/2019\t",43594,"23/05/2019\t","OK","05/08/2019\t","CERRADO",0.95509999999999995,0.92210000000000003]
[116,"DESENTRALIZADOS","ICCU - GESPROY GB",2018000050059,"MEJORAMIENTO DE LA VÍA GUSBITA - TIBIRITA DEL DEPARTAMENTO DE CUNDINAMARCA","(2019) Propios $163.575.615\n(2019) SGR $4.870.657.724\n(2021) Propios $466.298.401","TRANSPORTE",5500531740,4870657724,629874016,43532,2019,"086 de 2019","26/09/2019\t","OK","03/10/2019\t","07/05/2019\t","10/10/2019\t","OK","30/12/2019\t","PARA CIERRE",0.99580000000000002,0.99580000000000002]
[117,"CUNDINAMARCA","SECRETARIA DE CIENCIA, TECNOLOGIA E INNOVACIÓN",2018000100106,"INNOVACIÓN EN EL MODELO DE GESTIÓN DEL MEDICAMENTO FASE III EN EL DEPARTAMENTO DE  CUNDINAMARCA","Asignación Ciencia, Tecnología e Innovación","CTEL",3452890062,3071356262,381533800,43830,2019,"087 DE 2019","NO HA MIGRADO A GESPROY","NO HA MIGRADO A GESPROY","NO HA MIGRADO A GESPROY","NO HA MIGRADO A GESPROY","NO HA MIGRADO A GESPROY","OK","NO HA MIGRADO A GESPROY","DESAPROBADO",0,0]
[118,"CUNDINAMARCA","SECRETARIA DE CIENCIA, TECNOLOGIA E INNOVACIÓN",2018000100160,"FORMACIÓN DE CAPITAL HUMANO DE ALTO NIVEL PARA LA INVESTIGACIÓN, EL DESARROLLO TECNOLÓGICO Y LA INNOVACIÓN MAESTRÍAS DE INVESTIGACIÓN PARA DOCENTES DEL DEPARTAMENTO DE CUNDINAMARCA","Asignación Ciencia, Tecnología e Innovación","CTEL",5217415747,3519725709,1697690038,43731,2019,"080 DE 2019","21/02/2020\t","OK","30/12/2019\t","30/12/2019\t","12/11/2021\t","OK","12/11/2021\t","CONTRATADO EN EJECUCIÓN",0.16969999999999999,0.46289999999999998]
[119,"CUNDINAMARCA","SUPERVISIÓN / INTERVENTORÍA -EPC",20181301010555,"CONSTRUCCIÓN DE UNIDADES SANITARIAS EN EL ÁREA RURAL DEL DEPARTAMENTO DE CUNDINAMARCA",null,"VIVIENDA, CIUDAD Y TERRITORIO ",4999900475,4999900475,0,43378,2018,"010 DE 2018 - OCAD PAZ","24/01/2019\t","OK","14/02/2019\t","19/02/2019\t","01/04/2019\t","OK","23/07/2019\t","CONTRATADO EN EJECUCIÓN",0.85780000000000001,0.78310000000000002]
[120,"DESENTRALIZADOS","ICCU - GESPROY GB",2019000050002,"MEJORAMIENTO DE LA VÍA DEPARTAMENTAL LA VICTORIA (EL COLEGIO) SAN GABRIEL (VIOTÁ), TRAMO LA VICTORIA ALTO DE LA MULA, DEPARTAMENTO DE CUNDINAMARCA","(2019) SGR $5.745.879.373","TRANSPORTE",5745879373,5745879373,0,43532,2019,"086 de 2019","08/05/2019\t","OK","21/05/2019\t","30/04/2019\t","31/05/2019\t","OK","01/08/2019\t","CERRADO",0.97219999999999995,0.98519999999999996]
[121,"DESENTRALIZADOS","ICCU - GESPROY GB",2019000050003,"MEJORAMIENTO DE LA VÍA CÁQUEZA FOSCA, DEPARTAMENTO DE CUNDINAMARCA","(2019) SGR $4.049.029.755","TRANSPORTE",4049029755,4049029755,0,43585,2019,"088 de 2019","14/06/2019\t","OK","29/08/2019\t","29/08/2019\t","11/09/2019\t","OK","29/10/2019\t","CERRADO",0.93269999999999997,0.98540000000000005]
[122,"DESENTRALIZADOS","ICCU - GESPROY GB",2019000050005,"MEJORAMIENTO DE LA VÍA FÓMEQUE UBAQUE, DEPARTAMENTO DE CUNDINAMARCA","(2019) SGR $14.057.373.703\n(2020) Propios $2.456.830.510","TRANSPORTE",16514204213,14057373703,2456830510,43629,2019,"089 DE 2019","27/08/2019\t","OK","29/08/2019\t","29/08/2019\t","03/09/2019\t","OK","31/10/2019\t","CERRADO",0.99919999999999998,0.99919999999999998]
[123,"DESENTRALIZADOS","ICCU - GESPROY GB",2019000050011,"MEJORAMIENTO DE LA VÍA SUPATÁ - PACHO, DEPARTAMENTO DE CUNDINAMARCA","(2019) SGR $7.339.441.010","TRANSPORTE",7339441010,7339441010,0,43585,2019,"088 DE 2019","04/06/2019\t","OK","03/07/2019\t","31/05/2019\t","04/07/2019\t","OK","04/09/2019\t","CERRADO",0.33489999999999998,0.71899999999999997]
[124,"DESENTRALIZADOS","ICCU - GESPROY GB",2019000050013,"CONSTRUCCIÓN DE LA PLAZA DE MERCADO DEL MUNICIPIO DE CHOACHÍ CUNDINAMARCA","(2019) SGR $3.152.125.044\n(2021) Propios $1.328.984.899","AGRICULTURA ",4481109943.3100004,3152125044,1328984899.3100004,43678,2019,"090 DE 2019","04/09/2019\t","OK",43714,"05/08/2019\t","25/09/2019\t","OK","18/11/2019\t","TERMINADO",1,0.67859999999999998]
[125,"DESENTRALIZADOS","ICCU - GESPROY GB",2019000050016,"MEJORAMIENTO DE LA VÍA ANOLAIMA CORRALEJAS (INSPECCIÓN DE CORRALEJAS), DEPARTAMENTO DE CUNDINAMARCA","(2019) SGR $5.718.724.028\n(2020) Propios $1.179.638.441","TRANSPORTE",6898362469,5718724028,1179638441,43629,2019,"089 DE 2019","27/08/2019\t","OK","29/08/2019\t","05/08/2019\t","03/09/2019\t","OK","05/11/2019\t","CERRADO",0.99850000000000005,0.99960000000000004]
[126,"CUNDINAMARCA","SECRETARIA DE EDUCACIÓN",2019000050020,"FORTALECIMIENTO DE LA PERMANENCIA DE LOS ESTUDIANTES PARA EL AÑO 2019 EN LOS MUNICIPIOS DEL DEPARTAMENTO DE CUNDINAMARCA","(2019) SGR $20.536.293.937","EDUCACIÓN",20536293937,20536293937,0,43629,2019,"089 DE 2019","26/06/2019\t","OK","27/06/2019\t","27/06/2019\t","26/06/2019\t","OK","26/06/2019\t","PARA CIERRE",1,0.9103]
[127,"DESENTRALIZADOS","ICCU - GESPROY GB",2019000050023,"MEJORAMIENTO DE LA VÍA LENGUAZAQUE - VILLAPINZÓN, DEPARTAMENTO DE CUNDINAMARCA","(2019) Propios $1.326.191.602\n(2019) SGR $7.310.087.087","TRANSPORTE",8636278689,7310087087,1326191602,43629,2019,"089 DE 2019","27/08/2019\t","OK","29/08/2019\t","29/08/2019\t","03/09/2019\t","OK","15/11/2019\t","CERRADO",1,0.99180000000000001]
[128,"CUNDINAMARCA","SECRETARIA DE AGRICULTURA",2019000050027," MEJORAMIENTO DE LA COMPETITIVIDAD  DE LA CADENA PRODUCTIVA DE CACAO EN EL DEPARTAMENTO DE CUNDINAMARCA","(2019) Propios $1.465.745.991\n(2019) SGR $4.297.237.971\n(2020) SGR $100.000.000","AGRICULTURA ",5862983962,4397237971,1465745991,43819,2019,"098 DE 2019","24/04/2020\t","OK","04/05/2020\t","04/05/2020\t","24/06/2020\t","OK","24/06/2020\t","CERRADO",1,1]
[129,"DESENTRALIZADOS","ICCU - GESPROY GB",2019000050029,"MEJORAMIENTO DE LA VÍA GACHETÁ - GAMA, DEPARTAMENTO DE CUNDINAMARCA","(2019) SGR $5.322.582.208\n(2021) Propios $155.000.000","TRANSPORTE",5477582208,5322582208,{"$f":"H135-I135","v":155000000},43629,2019,"089 DE 2019","27/08/2019\t","OK","29/08/2019\t","29/08/2019\t","03/09/2019\t","OK","31/10/2019\t","TERMINADO",0.95509999999999995,0.9425]
[130,"CUNDINAMARCA","SECRETARIA DE SALUD",2019000050036,"ADQUISICIÓN DE AMBULANCIAS PARA EL FORTALECIMIENTO DE LA RED HOSPITALARIA DEL DEPARTAMENTO CUNDINAMARCA","(2019) Fondo de desarrollo regional $2.385.000.000","SALUD Y PROTECCIÓN SOCIAL",2385000000,2385000000,{"$f":"H136-I136","v":0},43656,2019,"090 DE 2019","27/08/2019\t","OK","29/08/2019\t","29/08/2019\t","03/09/2019\t","OK","11/10/2019\t","CERRADO",1,0.82809999999999995]
[131,"CUNDINAMARCA","UNIDAD ADMINISTRATIVA DE GESTIÓN DEL RIESGO.",2019000050037," FORTALECIMIENTO DEL SISTEMA DEPARTAMENTAL PARA LA GESTIÓN DEL RIESGO DE DESASTRES DEL DEPARTAMENTO DE CUNDINAMARCA","(2019) SGR $4.936.307.506","PRESIDENCIA DE LA REPÚBLICA",24666685502,4936307506,19730377996,43748,2019,"094 DE 2019","DESAPROBADO","DESAPROBADO","DESAPROBADO","DESAPROBADO","DESAPROBADO","OK","DESAPROBADO","DESAPROBADO",0,0]
[132,"ENTIDAD APORTANTE RECURSOS","MEDICINA LEGAL Y CIENCIAS FORENSES",2019000050025,"ESTUDIOS Y DISEÑOS PARA LA CONSTRUCCIÓN DE LA SEDE DE MEDICINA LEGAL EN EL DEPARTAMENTO DE CUNDINAMARCA","(2019) SGR $904.521.100","FISCALIA",904521100,904521100,0,43677,2019,"091 DE 2019","31/01/2020\t","OK","30/03/2020\t","04/12/2019\t","07/10/2020\t","OK","19/10/2020\t","CERRADO",1,1]
[133,"CUNDINAMARCA","SECRETARIA DE MINAS, ENERGIA Y GAS",2019000050039," ESTUDIO Y DISEÑO PARA LA CONSTRUCCIÓN DE REDES ELÉCTRICAS AÉREAS EN ZONAS RURALES DEL DEPARTAMENTO DE CUNDINAMARCA","(2019) SGR $1.616.407.501","MINAS Y ENERGÍA",1616407501,1616407501,0,43714,2019,"092 DE 2019","09/12/2019\t","OK","NO HAY DATO","07/03/2020\t","NO HAY DATO","OK","NO HAY DATO","DESAPROBADO",0,0]
[134,"CUNDINAMARCA","SECRETARIA DE EDUCACIÓN",2019000050044,"FORTALECIMIENTO A LA ESTRATEGIA DE ALIMENTACIÓN ESCOLAR PARA MUNICIPIOS NO CERTIFICADOS, VIGENCIA 2019 DEL DEPARTAMENTO DE CUNDINAMARCA","(2019) SGR $18.301.749.135","EDUCACIÓN",18301749135,18301749135,0,43656,2019,"090 DE 2019",43685,"OK","13/08/2019\t",43690,43739,"OK",43739,"CERRADO",0.2152,0.53269999999999995]
[135,"DESENTRALIZADOS","ICCU - GESPROY GB",2019000050047,"MEJORAMIENTO DE LA VÍA SUSA - CARMEN DE CARUPA, DEPARTAMENTO DE CUNDINAMARCA","(2019) SGR $4.131.178.258\n(2021) Propios $1.072.319.209","TRANSPORTE",5203497467.6199999,4131178258,1072319209.6199999,43677,2019,"091 DE 2019",43915,"OK","31/03/2020\t","19/10/2019\t","16/04/2020\t","OK","06/07/2020\t","CERRADO",1,1]
[136,"DESENTRALIZADOS","ICCU - GESPROY GB",2019000050056,"MEJORAMIENTO DE LA VÍA QUE CONDUCE DEL MUNICIPIO DE NIMAIMA AL MUNICIPIO DE NOCAIMA, DEPARTAMENTO DE CUNDINAMARCA","(2019) SGR $4.614.214.508\n(2021) Proipios $468.277.061","TRANSPORTE",5082491569.8000002,4614214508,468277061.80000019,43748,2019,"094 DE 2019","02/12/2019\t","OK","03/12/2019\t","27/11/2019\t","04/12/2019\t","OK","06/02/2020\t","TERMINADO",1,0.87219999999999998]
[137,"DESENTRALIZADOS","IDECUT",2019000050059,"FORTALECIMIENTO A LAS ESCUELAS MUNICIPALES DE MÚSICA, DANZA, TEATRO Y ARTES PLÁSTICAS Y VISUALES EN EL DEPARTAMENTO DE CUNDINAMARCA","(2019) SGR $1.972.606.058","CULTURA ",1972606058,1972606058,0,43748,2019,"094 DE 2019","22/05/2020\t","OK","28/07/2020\t","28/07/2020\t","02/07/2021\t","OK","20/08/2021\t","CERRADO",1,0.96099999999999997]
[138,"DESENTRALIZADOS","ICCU - GESPROY GB",2019000050060,"ESTUDIOS Y DISEÑOS DE VÍAS PARA MEJORAR LA COMPETITIVIDAD DEL DEPARTAMENTO DE CUNDINAMARCA","(2019) SGR $7.089.369.627","TRANSPORTE",7089369627,7089369627,0,43714,2019,"092 DE 2019","14/11/2019\t","OK","03/12/2019\t","14/11/2019\t","03/12/2019\t","OK","31/12/2019\t","CERRADO",0.98650000000000004,0.95530000000000004]
[139,"CUNDINAMARCA","SECRETARIA DE MINAS, ENERGIA Y GAS",2019000050073,"AMPLIACIÓN DE LA COBERTURA DEL SERVICIO DE GAS COMBUSTIBLE DOMICILIARIO A TRAVÉS DE LA FINANCIACIÓN DE LA CONEXIÓN Y LA RED INTERNA PARA USUARIOS DE BARRIOS PERIFÉRICOS, VEREDAS Y CENTROS POBLADOS DEL DEPARTAMENTO DE CUNDINAMARCA","(2019) Propios $12.461.377.100\n(2019) SGR $6.651.376.060","MINAS Y ENERGÍA",12461377100,6651376060,5810001040,43805,2019,"097 DE 2019","06/02/2020\t","OK","11/03/2020\t","11/03/2020\t","18/03/2020\t","OK","18/03/2020\t","PARA CIERRE",0.93589999999999995,0.93589999999999995]
[140,"DESENTRALIZADOS","ICCU - GESPROY GB",2019000050075,"MEJORAMIENTO DE LA VÍA QUE CONDUCE DEL MUNICIPIO DE VIANI AL MUNICIPIO DE CHAGUANI, (DE LA Y DE SAN VICENTE A CHAGUANI), DEPARTAMENTO DE CUNDINAMARCA","(2020) SGR $7.504.443.091","TRANSPORTE",7504443091,7504443091,0,43819,2019,"098 DE 2019","06/03/2020\t","OK","06/04/2020\t","06/04/2020\t","16/04/2020\t","OK","21/07/2020\t","TERMINADO",1,0.9516]
[141,"DESENTRALIZADOS","ICCU - GESPROY GB",2019000050079,"MEJORAMIENTO DE LA VÍA SERREZUELA - EL TRIUNFO, MUNICIPIO DE LA CALERA, DEPARTAMENTO DE CUNDINAMARCA","(2019) SGR $7.614.258.187\n","TRANSPORTE",7614258187,7614258187,0,43748,2019,"094 DE 2019","22/11/2019\t","OK","03/12/2019\t","27/11/2019\t","05/12/2019\t","OK","05/02/2020\t","CERRADO",0.94289999999999996,0.87190000000000001]
[142,"DESENTRALIZADOS","ICCU - GESPROY GB",2019000050085,"MEJORAMIENTO DE LA VÍA QUE CONDUCE DEL MUNICIPIO DE LA MESA AL MUNICIPIO DE CACHIPAY, (DE LA INSPECCIÓN DE PEÑA NEGRA AL MUNICIPIO DE CACHIPAY), DEPARTAMENTO DE CUNDINAMARCA","(2019) SGR $7.019.896.083\n","TRANSPORTE",7019896083,7019896083,0,43852,2019,"96 DE 2019","05/03/2020\t","OK","30/03/2020\t","27/03/2020\t","16/04/2020\t","OK","08/07/2020\t","PARA CIERRE",0.71350000000000002,0.6774]
[143,"ENTIDAD APORTANTE RECURSOS","TV ANDINA",2019000050064,"PROTECCIÓN Y PRESERVACIÓN DEL PATRIMONIO AUDIOVISUAL COLOMBIANO QUE SE ENCUENTRA EN EL CANAL PÚBLICO TEVEANDINA LOCALIZADO EN EL DEPARTAMENTO DE  CUNDINAMARCA","(2019) Propios $324.101.821\n(2019) SGR $5.543.576.098\n(2020) Propios $1.343.278\n(2020) SGR $54.264.000","CULTURA ",5923285198,"$ 5.597.840.098",325445100,43774,2019,"095 DE 2019","24/01/2020\t","OK","05/03/2020\t","27/12/2019\t","20/03/2020\t","OK","05/03/2020\t","CERRADO",1,0.99350000000000005]
[144,"ENTIDAD APORTANTE RECURSOS","UNAD",2019000050069,"MEJORAMIENTO DE INFRAESTRUCTURA FÍSICA, DOTACIÓN DE MOBILIARIO Y EQUIPAMIENTO TECNOLÓGICO DE LA UNIVERSIDAD NACIONAL ABIERTA Y A DISTANCIA EN MUNICIPIOS DEL DEPARTAMENTO DE CUNDINAMARCA","(2019) SGR $16.011.115.466","EDUCACIÓN",16011115461,16011115461,0,43774,2019,"095 DE 2019","10/02/2020\t","OK","26/02/2020\t","01/02/2020\t","25/03/2020\t","OK","06/05/2020\t","CERRADO",1,1]
[145,"ENTIDAD APORTANTE RECURSOS","U TECNOLOGICA DE PEREIRA",2019000100009,"FORMACIÓN DE CAPITAL HUMANO DE ALTO NIVEL UNIVERSIDAD TECNOLÓGICA DE PEREIRA  NACIONAL","(2020) Propios $55.665.000\n(2020) SGR $1.101.934.584\n(2021) Propios $55.665.000\n(2021) SGR $947.350.056\n(2022) Propios $55.665.000\n(2022) SGR $1.127.219.335\n(2023) Propios $55.665.000\n(2023) SGR $751.204.240\n(2024) Propios $46.790.000\n(2024) SGR $5.625.000\n(2025) Propios $46.790.000\n(2025) SGR $5.625.000\n(2026) Propios $46.790.000\n(2026) SGR $5.625.000\n(2027) Propios $46.790.000\n(2027) SGR $5.625.000","CTEL",4360028215,3950208215,409820000,43781,2019,"083 DE 2019","29/01/2020\t","OK","17/03/2020\t","21/02/2020\t","10/07/2020\t","OK","14/05/2020\t","CONTRATADO EN EJECUCIÓN",0.83120000000000005,0.82589999999999997]
[146,"ENTIDAD APORTANTE RECURSOS","U EAN",2019000100015,"FORMACIÓN DE CAPITAL HUMANO DE ALTO NIVEL - UNIVERSIDAD EAN -  NACIONAL","(2020) Propios $6.656.250\n(2020) SGR $304.687.500\n(2021) Propios $6.656.250\n(2021) SGR $304.687.500\n(2022) Propios $6.656.250\n(2022) SGR $304.687.500\n(2023) Propios $6.656.250\n(2023) SGR $304.687.500\n(2024) Propios $4.437.500\n(2024) SGR $7.812.500\n(2025) Propios $4.437.500\n(2025) SGR $7.812.500\n(2026) Propios $4.437.500\n(2026) SGR $7.812.500\n(2027) Propios $4.437.500\n(2027) SGR $7.812.500","CTEL",1294375000,1250000000,44375000,43830,2019,"087 DE 2019","04/05/2020\t","OK","13/07/2020\t","31/07/2020\t","26/06/2020\t","OK","16/07/2020\t","CONTRATADO EN EJECUCIÓN",0.83179999999999998,0.75839999999999996]
[147,"ENTIDAD APORTANTE RECURSOS","U CATOLICA",2019000100022,"FORMACIÓN DE CAPITAL HUMANO DE ALTO NIVEL - UNIVERSIDAD CATÓLICA DE COLOMBIA -  NACIONAL","(2019) Propios $6.656.250\n(2019) SGR $128.373.000\n(2020) Propios $6.656.250\n(2020) SGR $84.755.000\n(2021) Propios $6.656.250\n(2021) SGR $70.467.000\n(2022) Propios $6.656.250\n(2022) SGR $3.125.000\n(2023) Propios $4.437.500\n(2023) SGR $3.125.000\n(2024) Propios $4.437.500\n(2024) SGR $3.125.000\n(2025) Propios $4.437.500\n(2025) SGR $3.125.000\n(2026) Propios $4.437.500\n(2026) SGR $3.125.000","CTEL",343595000,299220000,44375000,43812,2019,"086 DE 2019","14/04/2020\t","OK","10/06/2020\t","17/07/2020\t","13/07/2020\t","OK","11/06/2020\t","CONTRATADO EN EJECUCIÓN",0.86709999999999998,0.85809999999999997]
[148,"ENTIDAD APORTANTE RECURSOS","UNIVERSIDAD MILITAR NUEVA GRANADA",2019000100025,"FORMACIÓN DE CAPITAL HUMANO DE ALTO NIVEL UNIVERSIDAD MILITAR NUEVA GRANADA  NACIONAL","(2020) Propios $6.656.250\n(2020) SGR $66.687.500\n(2021) Propios $6.656.250\n(2021) SGR $56.687.500\n(2022) Propios $6.656.250\n(2022) SGR $66.687.500\n(2023) Propios $6.656.250\n(2023) SGR $56.687.500\n(2024) Propios $4.437.500\n(2024) SGR $312.500\n(2025) Propios $4.437.500\n(2025) SGR $312.500\n(2026) Propios $4.437.500\n(2026) SGR $312.500\n(2027) Propios $4.437.500\n(2027) SGR $312.500","CTEL",294375000,250000000,44375000,43812,2019,"086 DE 2019","06/05/2020\t","OK","26/06/2020\t","22/04/2020\t","05/06/2020\t","OK","15/07/2020\t","CONTRATADO EN EJECUCIÓN",0.79879999999999995,0.73980000000000001]
[149,"ENTIDAD APORTANTE RECURSOS","UNIVERSIDAD NACIONAL DE COLOMBIA",2019000100026,"FORMACIÓN DE CAPITAL HUMANO DE ALTO NIVEL UNIVERSIDAD NACIONAL DE COLOMBIA   NACIONAL","(2020) Propios $11.094.126\n(2020) SGR $5.039.171.749\n(2021) Propios $11.094.126\n(2021) SGR $5.039.171.749\n(2022) Propios $11.094.126\n(2022) SGR $5.039.171.749\n(2023) Propios $11.094.126\n(2023) SGR $5.039.171.749\n(2024) Propios $94.937.750\n(2024) SGR $145.312.500\n(2025) Propios $94.937.750\n(2025) SGR $145.312.500\n(2026) Propios $94.937.750\n(2026) SGR $145.312.500\n(2027) Propios $94.937.750\n(2027) SGR $145.312.500","CTEL",21162064500,20233937500,928127000,43781,2019,"083 DE 2019","03/02/2020\t","OK","01/04/2020\t","12/03/2020\t","07/04/2020\t","OK","26/05/2020\t","CONTRATADO EN EJECUCIÓN",0.75119999999999998,1.2075]
[150,"ENTIDAD APORTANTE RECURSOS","U DISTRITAL",2019000100027,"FORMACIÓN DE CAPITAL HUMANO DE ALTO NIVEL EN DOCTORADO PARA EL DESARROLLO REGIONAL, UNIVERSIDAD DISTRITAL FRANCISCO JOSÉ DE CALDAS, A NIVEL  NACIONAL","(2020) Propios $13.134.136\n(2020) SGR $270.586.436\n(2021) Propios $13.134.136\n(2021) SGR $270.586.436\n(2022) Propios $13.134.136\n(2022) SGR $270.586.436\n(2023) Propios $13.134.136\n(2023) SGR $270.586.436\n(2024) Propios $13.134.136\n(2024) SGR $7.812.500\n(2025) Propios $13.134.136\n(2025) SGR $7.812.500\n(2026) Propios $13.134.136\n(2026) SGR $7.812.500\n(2027) Propios $13.134.136\n(2027) SGR $7.812.500","CTEL",1218668841,1113595753,105073088,43798,2019,"085 DE 2019","20/05/2020\t","OK","09/07/2020\t","05/06/2020\t","30/06/2020\t","OK","04/08/2020\t","CONTRATADO EN EJECUCIÓN",0.69399999999999995,0.65149999999999997]
[151,"ENTIDAD APORTANTE RECURSOS","U JAVERIANA",2019000100028,"FORMACIÓN DE CAPITAL HUMANO DE ALTO NIVEL PONTIFICIA UNIVERSIDAD JAVERIANA SEDE CENTRAL  NACIONAL","(2020) SGR $1.584.312.500\n(2021) SGR 1.888.312.500\n(2022) SGR $1.507.937.500\n(2023) SGR $1.395.187.500\n(2024) SGR $42.187.500\n(2025) SGR $42.187.500\n(2026) SGR $42.187.500\n(2027) SGR $42.187.500","CTEL",6524500000,6524500000,0,43781,2019,"083 DE 2019","26/02/2020\t","OK","02/07/2020\t","18/05/2020\t","28/04/2020\t","OK","08/05/2020\t","CONTRATADO EN EJECUCIÓN",0.77790000000000004,0.77239999999999998]
[152,"ENTIDAD APORTANTE RECURSOS","U DE LOS ANDES",2019000100036,"FORMACIÓN  DE CAPITAL HUMANO DE ALTO NIVEL UNIVERSIDAD DE LOS ANDES   NACIONAL","(2020) Propios $13.659.625\n(2020) SGR $785.763.001\n(2021) PropioS $7.579.526\n(2021) SGR $716.642.001\n(2022) Propios $7.579.526\n(2022) SGR $673.175.268\n(2023) Propios $7.579.526\n(2023) SGR $497.375.000\n(2024) Propios $7.579.526\n(2024) SGR $18.750.000\n(2025) Propios $7.579.526\n(2025) SGR $18.750.000\n(2026) Propios $7.579.526\n(2026) SGR $18.750.000\n(2027) Propios $7.579.526\n(2027) SGR $18.750.000","CTEL",2814671307,2748000000,66671307,43798,2019,"085 DE 2019","31/01/2020\t","OK","04/03/2020\t","27/04/2020\t","28/02/2020\t","OK","04/03/2020\t","CONTRATADO EN EJECUCIÓN",0.87580000000000002,0.87609999999999999]
[153,"ENTIDAD APORTANTE RECURSOS","UNIVERSIDAD NACIONAL DE COLOMBIA",2019000100061,"FORTALECIMIENTO DE LA CAPACIDAD TECNOLÓGICA INSTALADA EN EL CENTRO AGROPECUARIO MARENGO PARA LA INVESTIGACIÓN EN LOS SISTEMAS AGROPRODUCTIVOS DEL TRÓPICO ALTO, BAJO EL EFECTO DE LA VARIABILIDAD Y CAMBIO CLIMÁTICO -  CUNDINAMARCA","(2020) Propios $313.959.972\n(2020) SGR $528.590.836\n(2021) Propios $213.281.808\n(2021) SGR $1.465.555.493","CTEL",2521388540,1994146760,527241780,43830,2019,"087 DE 2019","31/01/2020\t","OK","03/03/2020\t","27/04/2020\t","28/02/2020\t","OK","04/03/2020\t","CONTRATADO EN EJECUCIÓN",0.9738,0.80669999999999997]
[154,"CUNDINAMARCA","SECRETARIA DE CIENCIA, TECNOLOGIA E INNOVACIÓN",2020000100137,"FORTALECIMIENTO DE LAS CAPACIDADES DE INVESTIGACIÓN Y DESARROLLO PARA ATENDER PROBLEMÁTICAS ASOCIADAS CON AGENTES BIOLÓGICOS PARA LA SALUD PÚBLICA, A TRAVÉS DEL MEJORAMIENTO DEL LABORATORIO DE SALUD PÚBLICA DE CUNDINAMARCA","Asignación Ciencia, Tecnología e Innovación","CTEL",4506359274,4048003426,458355848,43966,2020,"093 DE 2020","27/07/2020\t","OK","09/09/2020\t","22/07/2020\t","16/01/2021\t","OK","09/10/2020\t","CONTRATADO EN EJECUCIÓN",0.6764,0.61619999999999997]
[155,"CUNDINAMARCA","SECRETARIA DE SALUD",2020000050003,"ADQUISICIÓN DE AMBULANCIAS,EQUIPOS BIOMÉDICOS, ELEMENTOS DE PROTECCIÓN PERSONAL, ASEO Y DESINFECCIÓN PARA LA ATENCIÓN DE LA CALAMIDAD SANITARIA POR COVID-19 EN LAS E.S.E DEL DEPARTAMENTO DE   CUNDINAMARCA","(2020) SGR $43.433.295.564","SALUD Y PROTECCIÓN SOCIAL",43433295564,43433295564,0,43986,2020,"102 de 2020","30/06/2020\t","OK","10/08/2020\t","23/06/2020\t","23/07/2020\t","OK","25/07/2020\t","CERRADO",0.54379999999999995,0.54759999999999998]
[157,"CUNDINAMARCA","SECRETARIA DE EDUCACIÓN",2020000050019,"FORTALECIMIENTO A LA ESTRATEGIA DE ALIMENTACIÓN ESCOLAR PARA EL AÑO 2020, EN LOS MUNICIPIOS DEL DEPARTAMENTO DE CUNDINAMARCA ","(2020) SGR $26.240.955.000","EDUCACIÓN",26240955000,26240955000,0,44040,2020,"105 DE 2020","27/07/2020\t","OK","06/04/2021\t","11/08/2020\t","20/09/2020\t","OK","18/09/2020\t","CERRADO",1,0.995]
[158,"CUNDINAMARCA","SECRETARIA DE CIENCIA, TECNOLOGIA E INNOVACIÓN",2020000100266,"GENERACIÓN DE ESPACIOS DE ENCUENTRO DE LA SOCIEDAD CON LA CIENCIA Y LA TECNOLOGÍA - UN VIAJE CON LA CIENCIA EN EL DEPARTAMENTO DE CUNDINAMARCA","Asignación Ciencia, Tecnología e Innovación","CTEL",2241429590,2218862102,22567488,44111,2020,"098 DE 2020","16/06/2021\t","OK","30/06/2021\t","17/06/2021\t","26/08/2021\t","OK","12/10/2021\t","CONTRATADO EN EJECUCIÓN",0.79879999999999995,0.87839999999999996]
[159,"CUNDINAMARCA","SECRETARIA DE CIENCIA, TECNOLOGIA E INNOVACIÓN",2020000100246,"FORTALECIMIENTO DE LA COMPETITIVIDAD DE LA CADENA PRODUCTIVA DE LA GUADUA POR MEDIO DEL DESARROLLO E IMPLEMENTACIÓN DE DOS (2) PAQUETES TECNOLÓGICOS PARA LA GENERACIÓN DE PRODUCTOS CON VALOR AGREGADO EN EL DEPARTAMENTO DE CUNDINAMARCA ","Asignación Ciencia, Tecnología e Innovación","CTEL",3144525520,2294345776,850179744,44111,2020,"098 DE 2020","17/06/2021\t","OK","30/06/2021\t","17/06/2021\t","07/09/2021\t","OK","27/09/2021\t","CONTRATADO EN EJECUCIÓN",1,0.89849999999999997]
[160,"ENTIDAD APORTANTE RECURSOS","CONNECT BOGOTA REGIÓN",2020000100078,"DISEÑO E IMPLEMENTACIÓN DE UN MODELO DE GESTIÓN DE CONOCIMIENTO, INNOVACIÓN Y TRANSFERENCIA DE TECNOLOGÍA CON APLICACIÓN EN EL SECTOR AGROPECUARIO Y AGROINDUSTRIAL EN EL DEPARTAMENTO DE CUNDINAMARCA ","(2021) Propios $157.863.192\n(2021) SGR $1.122.255.338\n(2022) Propios $76.939.218\n(2022) SGR $825.849.572\n(20223 Propios $161.740.380\n(2023) SGR $1.194.760.538\n(2024) Propios $4.121.445\n(2024) SGR $61.714.113","CTEL",3438832990.73,3028251016.23,410581974.5,44111,2020,"098 DE 2020","27/12/2021\t","OK","11/01/2022\t","17/12/2021\t","31/12/2021\t","OK","22/02/2022\t","CONTRATADO EN EJECUCIÓN",0.6371,0.67820000000000003]
[161,"ENTIDAD APORTANTE RECURSOS","FEDERACIÓN NACIONAL DE CAFETEROS",2020000100205,"TRASLADO DE TECNOLOGÍAS INNOVADORAS A CAFICULTORES CON IMPACTO SOBRE LA CALIDAD DEL CAFÉ Y LA GESTIÓN DEL RECURSO HÍDRICO DURANTE EL PROCESO DE BENEFICIO EN ZONA CAFETERA DEL DEPARTAMENTO DE CUNDINAMARCA ","(2021) Propios $16.558.264\n(2021) SGR $371.631.057\n(2022) Propios $355.607.184\n(2022) SGR $6.424.429.766\n(2023) Propios $361.654.646\n(2023) SGR $5.454.854.199\n(2024) Propios $100.805.491\n(2024) SGR $598.016.714","CTEL",13783557324,12848931736,934625588,44111,2020,"098 DE 2020","28/06/2021\t","OK","15/12/2021\t","24/06/2021\t","16/12/2021\t","OK","20/12/2021\t","CONTRATADO EN EJECUCIÓN",0.47,0.39560000000000001]
[162,"ENTIDAD APORTANTE RECURSOS","AGROSAVIA",2020000100197,"DESARROLLO DE BIOPLAGUICIDAS POTENCIADOS DE NUEVA GENERACIÓN PARA EL MEJORAMIENTO DE LA PRODUCTIVIDAD E INOCUIDAD DEL CULTIVO DE TOMATE Y CRUCÍFERAS EN EL DEPARTAMENTO DE CUNDINAMARCA ","(2020) Propios $158.344.805\n(2020) SGR $899.846.461\n(2021) Propios $236.420.706\n(2021) SGR $684.743.303\n(2022) Propios $449.611.200\n(2022) SGR $737.387.654\n(2023) Propios $309.697.665\n(2023) SGR $597.385.567\n(2024) Propios $147.150.397\n(2024) SGR $363.382.275","CTEL",4583970033,3282745260,1301224773,44111,2020,"098 DE 2020","06/04/2021\t","OK","06/04/2021\t","06/04/2021\t","15/12/2021\t","OK","01/01/2022\t","CONTRATADO EN EJECUCIÓN",0.48170000000000002,0.47670000000000001]
[163,"ENTIDAD APORTANTE RECURSOS","UNIVERSIDAD NACIONAL DE COLOMBIA",2020000100240,"ESTUDIO DE PREFACTIBILIDAD PARA LA CREACIÓN DE UN CENTRO DE INNOVACIÓN Y DE PRODUCTIVIDAD PARA EL SECTOR AGROPECUARIO DE SABANA OCCIDENTE DE CUNDINAMARCA ","(2020) Propios $188.724.096\n(2020) SGR $1.707.430.133","CTEL",1896154229,1707430133,188724096,44111,2020,"098 DE 2020","26/03/2021\t","OK","05/04/2021\t","13/01/2021\t","26/03/2021\t","OK","06/04/2021\t","PARA CIERRE",1,0.99099999999999999]
[164,"ENTIDAD APORTANTE RECURSOS","UNIVERSIDAD DE CUNDINAMARCA",2020000100158,"FORTALECIMIENTO DE LA INFRAESTRUCTURA FÍSICA Y TECNOLÓGICA DEL CENTRO DE ESTUDIOS AGROAMBIENTALES DE LA UNIVERSIDAD DE CUNDINAMARCA AGROU CUNDINAMARCA ","(2020) Propios $13.340.080\n(2020) SGR $752.452.737\n(2021) Propios $13.340.080\n(2021) SGR $1.245.300.772","CTEL",2024433669,1997753509,26680160,44111,2020,"098 DE 2020","SIN DATO","OK","SIN DATO","SIN DATO","SIN DATO","OK","SIN DATO","CONTRATADO EN EJECUCIÓN",0.71489999999999998,0.60780000000000001]
[165,"ENTIDAD APORTANTE RECURSOS","ZIPAQUIRA",2020000050013,"MEJORAMIENTO DE LA VÍA QUE COMUNICA A LOS MUNICIPIOS DE ZIPAQUIRÁ Y TOCANCIPÁ, TRAMO BARANDILLAS - LA FUENTE, DEPARTAMENTO DE CUNDINAMARCA","(2020) SGR $6.788.620.689","TRANSPORTE","6.788.620.869,00",{"$f":"H170","v":"6.788.620.869,00"},0,44152,2020,"107 del 2020","02/02/2021\t","OK","04/03/2021\t","04/03/2021\t","16/04/2021\t","OK","02/07/2021\t","CONTRATADO EN EJECUCIÓN",0.60589999999999999,0.86439999999999995]
[166,"ENTIDAD APORTANTE RECURSOS","ZIPAQUIRA",2020000050015,"MEJORAMIENTO DE LA VÍA ZIPAQUIRÁ - SAN JORGE - TABIO DEPARTAMENTO DE CUNDINAMARCA","(2020) SGR $7.458.735.075","TRANSPORTE",7458735075,{"$f":"H171","v":7458735075},0,44152,2020,"107 del 2020","15/07/2021\t","OK",44415,"22/10/2021\t","01/09/2021\t","OK","20/02/2022\t","CONTRATADO EN EJECUCIÓN",0.52110000000000001,0]
[167,"CUNDINAMARCA","SECRETARIA DE CIENCIA, TECNOLOGIA E INNOVACIÓN",2020000100695,"DESARROLLO, TRANSFERENCIA DE TECNOLOGÍA Y CONOCIMIENTO PARA LA INNOVACIÓN QUE FORTALEZCAN CAPACIDADES COMUNITARIAS EN LA COMPRENSIÓN Y/O MITIGACIÓN DE LOS PROBLEMAS DE VIOLENCIAS BASADAS EN GÉNERO, DERIVADAS DE LA EMERGENCIA POR COVID 19, EN CUNDINAMARCA","Asignación Ciencia, Tecnología e Innovación","CTEL",3100000000,3000000000,100000000,44183,2020,"103 DE 2020","20/05/2021\t","OK","30/06/2021\t","17/06/2021\t",44483,"OK","16/09/2021\t","CONTRATADO EN EJECUCIÓN",0.74109999999999998,0.9204]
[168,"CUNDINAMARCA","SECRETARIA DE CIENCIA, TECNOLOGIA E INNOVACIÓN",2020000100650,"FORTALECIMIENTO DE CAPACIDADES DE CTEI PARALA INNOVACION EDUCATIVA EN LOS NIVELES DE BÁSICA Y\nMEDIA, MEDIANTE USO DE TICS EN INSTITUCIONES EDUCATIVAS OFICIALES DE LOS MUNICIPIOS NO\nCERTIFICADOS DEL DEPARTAMENTO DE CUNDINAMARCA","Asignación Ciencia, Tecnología e Innovación","CTEL",10804663122,9999728696,804934426,44183,2020,"103 DE 2020","27/05/2021\t","OK","30/06/2021\t","30/06/2021\t","12/08/2021\t","OK","20/10/2021\t","CONTRATADO EN EJECUCIÓN",0.36020000000000002,0.25559999999999999]
[169,"CUNDINAMARCA","SECRETARIA DE CIENCIA, TECNOLOGIA E INNOVACIÓN",2020000100696,"FORTALECIMIENTO DE CAPACIDADES DE CTEI PARA LA REACTIVACIÓN ECONÓMICA Y LA TRANSFORMACIÓN\nPRODUCTIVA EN CUNDINAMARCA","Asignación Ciencia, Tecnología e Innovación","CTEL",7370634083,6974290175,396343908,44183,2020,"103 DE 2020","27/05/2021\t","OK","02/08/2021\t","17/06/2021\t","17/08/2021\t","OK","27/08/2021\t","CONTRATADO EN EJECUCIÓN",0.9395,0.95660000000000001]
[170,"CUNDINAMARCA","SECRETARIA DE CIENCIA, TECNOLOGIA E INNOVACIÓN",2020000100649,"FORTALECIMIENTO DE CAPACIDADES DE CTEI PARA EL RELACIONAMIENTO ESCUELA - CONTEXTO RURAL MEDIANTE LA APROPIACIÓN Y USO DE LAS TIC EN EL MUNICIPIO DE SIBATÉ, DEPARTAMENTO DE CUNDINAMARCA","Asignación Ciencia, Tecnología e Innovación","CTEL",4292464018,2645464018,1647000000,44183,2020,"103 DE 2020","20/05/2021\t","OK","30/06/2021\t","30/06/2021\t","27/09/2021\t","OK","13/10/2021\t","CONTRATADO EN EJECUCIÓN",0.97219999999999995,0.80100000000000005]
[171,"ENTIDAD APORTANTE RECURSOS","FUNDACION UNIVERSIDAD DEL VALLE",2020000050044,"FORTALECIMIENTO DE LAS COMPETENCIAS COMUNICATIVAS EN INGLÉS DE LOS ESTUDIANTES DE LOS ESTABLECIMIENTOS EDUCATIVOS OFICIALES DEL DEPARTAMENTO CUNDINAMARCA","(2020) Aportes en especie $57.200.000\n(2020) SGR $4.600.237.252\n(2021) SGR $5.300.455.127","EDUCACIÓN",15011999229,14954799229,57200000,44195,2020,"110 DE 2020","26/03/2021\t","OK","20/04/2021\t","20/04/2021\t","22/04/2021\t","OK","14/05/2021\t","TERMINADO",1,0.95179999999999998]
[172,"ENTIDAD APORTANTE RECURSOS","UNAD",2020000100433,"INVESTIGACIÓN DE LOS COMPUESTOS VOLÁTILES ORGÁNICOS E INDUCIDOS PARA EL MANEJO DE MOSCAS PLAGAS EN GULUPA Y GRANADILLA EN EL DEPARTAMENTO DE  CUNDINAMARCA","(2020) Propios $500.962.846\n(2020) SGR $1.125.385.928\n(2021) Propios $500.962.847\n(2021) SGR $393.795.129\n(2022) Propios $410.962.847\n(2022) SGR $480.804.604","CTEL",3412874201,1999985660,{"$f":"H177-I177","v":1412888541},44159,2020,"100 DE 2020","24/05/2021\t","OK","28/07/2021\t","24/05/2021\t","11/10/2021\t","OK","13/10/2021\t","CONTRATADO EN EJECUCIÓN",0.72460000000000002,0.78069999999999995]
[173,"ENTIDAD APORTANTE RECURSOS","UNIVERSIDAD INDUSTRIAL DE SANTANDER",2020000100415,"DESARROLLO DE UN SISTEMA ÓPTICO  COMPUTACIONAL PARA ESTIMAR EL CONTENIDO DE CARBONO ORGÁNICO DE SUELOS AGRÍCOLAS A TRAVÉS DE IMÁGENES ESPECTRALES E INTELIGENCIA ARTIFICIAL EN CULTIVOS DE CÍTRICOS DE   SANTANDER","(2021) Propios $70.633.632\n(2021) SGR $916.606.260\n(2022) Propios $70.633.632\n(2022) SGR $593.379.758\n(2023) Propios $70.633.632\n(2023) SGR $462.239.969","CTEL",2184125885.29,1972224989.29,211900896,44159,2020,"100 DE 2020","20/04/2021\t","OK","20/05/2021\t","20/05/2021\t","21/05/2021\t","OK","21/05/2021\t","CONTRATADO EN EJECUCIÓN",0.89739999999999998,0.82050000000000001]
[174,"ENTIDAD APORTANTE RECURSOS","UNIVERSIDAD INDUSTRIAL DE SANTANDER",2020000100375,"CONFORMACIÓN DE UNA PLATAFORMA PARA ESTUDIOS CELULARES AVANZADOS IN VIVO EN TIEMPO REAL PARA EL ANÁLISIS DE LA RESPUESTA INMUNOMETABÓLICA ANTE LA REEXPRESIÓN DE INTERFERÓN TIPO I KAPPA EN ESFEROIDES DE CÉLULAS TUMORALES DE CUELLO UTERINO EN  SANTANDER","(2020) Propios $471.221.890\n(2020) SGR $1.808.291.920\n(2021) Propios $326.944.000\n(2021) SGR $110.727.990\n(2022) Propios $326.944.000\n(2022) SGR $79.868.000","CTEL",3123997801,1998887911,1125109890,44159,2020,"100 DE 2020","20/04/2021\t","OK","21/05/2021\t","24/11/2020\t","21/05/2021\t","OK","21/05/2021\t","CONTRATADO EN EJECUCIÓN",0.84119999999999995,0.85240000000000005]
[175,"ENTIDAD APORTANTE RECURSOS","UNIVERSIDAD INDUSTRIAL DE SANTANDER",2020000100351,"DESARROLLO DE UN PROTOTIPO SELECTIVO Y SENSIBLE PARA MONITOREAR CONTENIDO DE CADMIO IN SITU EN DIVERSAS MATRICES ASOCIADAS A LA PRODUCCIÓN DE GRANOS DE CACAO EN EL DEPARTAMENTO DE  SANTANDER","(2021)  Propios $307.400.000\n(2021) SGR  $1.498.459.531\n(2022) Propios $278.400.000\n(2022) SGR $501.540.469","CTEL",2585800000,2000000000,585800000,44159,2020,"100 DE 2020","20/04/2021\t","OK","20/05/2021\t","01/03/2021\t","01/09/2021\t","OK","03/08/2021\t","CONTRATADO EN EJECUCIÓN",1,0.99909999999999999]
[176,"ENTIDAD APORTANTE RECURSOS","INSTITUTO SUPERIOR DE EDUCACION RURAL DE PAMPLONA",2020000100343,"IMPLEMENTACIÓN LABORATORIO DE CALIDAD FISICOQUÍMICA DE ALIMENTOS PARA EL FORTALECIMIENTO COMPETITIVO Y SOSTENIBLE DE LASCADENAS AGROALIMENTARIAS DEL DEPARTAMENTO DE  NORTE DE SANTANDER","(2020) Propios $225.265.626\n(2020) SGR $1.101.185.576\n(2021) Propios $267.286.226\n(2021) SGR $561.878.675\n(2022) Propios $255.685.249\n(20202 SGR $336.935.751","CTEL",1097306327,999999999,97306328,44159,2020,"100 DE 2020","SIN DATO","OK","07/01/2022\t","05/04/2021\t","07/01/2022\t","OK","SIN DATO","CONTRATADO EN EJECUCIÓN",0.34179999999999999,0.33900000000000002]
[177,"ENTIDAD APORTANTE RECURSOS","UNIVERSIDAD NACIONAL DE COLOMBIA",2020000100342,"ESTUDIO DE POTENCIALES INSECTICIDAS EN MATRICES POLIMÉRICAS PARA EL CONTROL DE PLAGAS DE GRANOS ALMACENADOS BASADOS EN ACEITES ESENCIALES PROVENIENTES DE LA BIODIVERSIDADFLORÍSTICA DEL DEPARTAMENTO DE  CUNDINAMARCA","(2020) Propios $225.265.626\n(2020) SGR $1.101.185.576\n(2021) Propios $267.286.226\n(2021) SGR $561.878.675\n(2022) Propios $255.685.249\n(20202 SGR $336.935.751","CTEL",2748237104,2000000000,748237104,44159,2020,"100 DE 2020","23/04/2021\t","OK","09/06/2021\t","08/06/2021\t","29/11/2021\t","OK","26/11/2021\t","CONTRATADO EN EJECUCIÓN",0.55420000000000003,0.68700000000000006]
[178,"ENTIDAD APORTANTE RECURSOS","UNIVERSIDAD MILITAR NUEVA GRANADA",2020000100728,"GENERACIÓN Y TRANSFERENCIA DE CONOCIMIENTOS Y TECNOLOGÍAS PARA ELEVAR CAPACIDADES DE CTEL DE PEQUEÑOS PRODUCTORES DE TOMATE PARA AFRONTAR PROBLEMAS DERIVADOS DEL COVID-19 ASOCIADAS A LA SEG. ALIMENTARIA EN LAS SAB. CENTRO Y ORIENTE  CUNDINAMARCA","(2021) Propios $1.019.463.999\n(2021) SGR $1.085.806.726\n(2022) Propios $1.019.464.001\n(2022) SGR $1.037.806.726","CTEL",4162541452,2123613452,2038928000,44183,2020,"103 DE 2020","17/03/2021\t","OK","16/06/2021\t","16/02/2021\t","21/07/2021\t","OK","28/08/2021\t","CONTRATADO EN EJECUCIÓN",0.84230000000000005,0.86550000000000005]
[179,"ENTIDAD APORTANTE RECURSOS","UNIVERSIDAD NACIONAL DE COLOMBIA",2020000100339,"DESARROLLO DE NUEVOS MÉTODOS NO DESTRUCTIVOS PARA MONITOREO IN SITU DE PROBABILIDAD DE OCURRENCIA DE FALLA EN TUBERÍAS EN EL SECTOR DE HIDROCARBUROS EN LOS DEPARTAMENTOS DE  BOGOTÁ BOYACÁ SANTANDER","(2021) Propios $308.186.357\n(2021)  SGR $1.407.085.662\n(2022) Propios $104.021.481\n(2022) SGR $593.042.673","CTEL",2412084140,1999876300,412207840,44159,2020,"100 DE 2020",44308,"OK","24/11/2020\t","24/11/2020\t","01/10/2021\t","OK","04/06/2021\t","CONTRATADO EN EJECUCIÓN",0.58550000000000002,0.79730000000000001]
[180,"ENTIDAD APORTANTE RECURSOS","UNIVERSIDAD MILITAR NUEVA GRANADA",2020000100216,"INNOVACIÓN Y TRANSFERENCIA TECNOLÓGICA DE UMNGBIO A PRODUCTORES DE FLORES PARA EL CONTROL BIOLÓGICO DE TETRANYCHUS URTICAE (ACARI: TETRANYCHIIDAE) EN CULTIVOS DE INVERNADERO CON EL ÁCARO BENÉFICO NEOSEIULUS CALIFORNICUS (ACARI: PHYTOSEIIDAE)  CUNDINAMARCA","(2020) Propios $389.050.000\n(2020) SGR $646.570.326\n(2021)  Propios $388.214.070\n(2021) SGR $300.843.198\n(2022) Propios $412.735.930\n(2022) SGR $294.166.476","CTEL",2431580000,1241580000,1190000000,44159,2020,"100 DE 2020","17/03/2021\t","OK","09/06/2021\t","16/02/2021\t","11/06/2021\t","OK","17/07/2021\t","CONTRATADO EN EJECUCIÓN",0.79220000000000002,0.80179999999999996]
[181,"CUNDINAMARCA","SECRETARIA DE COMPETITIVIDAD",2019000050026,"DESARROLLO DE UN PROGRAMA PRODUCTIVO, AMIGABLE CON EL MEDIO AMBIENTE DEL SECTOR GANADERO EN EL DEPARTAMENTO DE CUNDINAMARCA CUNDINAMARCA","(2020) Propios $1.151.631.237\n(2020) SGR $4.326.106.510\n(2021)  Propios $1.801.269.370\n(2021) SGR $2.450.811.046\n(2022)  Propios $312.267.464\n(2022) SGR $27.325.359","AGRICULTURA ",11567711442,8302543371,3265168071,44187,2020,"109 DE 2020","31/05/2021\t","OK","30/06/2021\t","17/06/2021\t","SIN DATO","OK","21/09/2021\t","CONTRATADO EN EJECUCIÓN",0.91910000000000003,0.92469999999999997]
[182,"ENTIDAD APORTANTE RECURSOS","UNIVERSIDAD NACIONAL DE COLOMBIA",2020000100169,"INVESTIGACIÓN DESARROLLO, INNOVACIÓN Y TRANSFERENCIA DE CONOCIMIENTO PARA EL PROCESAMIENTO DE LA SEMILLA DE SACHA INCHI EN PRODUCTOS DE VALOR AGREGADO, COMO ESTRATEGIA PARA MEJORAR LA PRODUCTIVIDAD DEL SECTOR AGROINDUSTRIAL DE LA REGIÓN  CUNDINAMARCA","(2020)  Propios $279.981.341\n(2020) SGR $1.272.176.041\n(2021) Propios $262.125.378\n(2021) SGR $485.933.334\n(2022) Propios $217.890.591\n(2022) SGR $239.590.625","CTEL",2757697312,1997700000.0999999,759997311.9000001,44078,2020,"97 DE 2020","10/02/2021\t","OK","31/05/2021\t","04/09/2020\t","04/06/2021\t","OK","15/06/2021\t","CONTRATADO EN EJECUCIÓN",0.85389999999999999,0.6159]
[183,"ENTIDAD APORTANTE RECURSOS","UPTC",2020000100114,"FORTALECIMIENTO DEL ECOSISTEMA DE INVESTIGACIÓN CIENTÍFICA PARA CTEI EN LA UNIVERSIDAD PEDAGÓGICA Y TECNOLÓGICA DE COLOMBIA UPTC, I-SPACIO  SOGAMOSO","(2020) Propios $34.928.797\n(2020) SGR $11.411.440\n(2021)  Propios $164.884.827\n(2021) SGR $1.857.760.962\n(2022)  Propios $143.790.211\n(2022) SGR $97.858.644","CTEL",2312299017.4499998,1967031046.1500001,345267971.29999971,44078,2020,"97 DE 2020",43881,"OK","10/06/2021\t","25/11/2020\t","10/06/2021\t","OK","10/06/2021\t","CONTRATADO EN EJECUCIÓN",0.93069999999999997,0.89910000000000001]
[184,"ENTIDAD APORTANTE RECURSOS","UNIVERSIDAD DE ANTIOQUIA",2020000100079,"FORTALECIMIENTO DE LA INFRAESTRUCTURA TECNOLÓGICA Y EQUIPAMIENTO DEL AMBIENTE DE FORMACIÓN INDUSTRIAL PARA EL AUMENTO DE LAS CAPACIDADES INSTITUCIONALES EN CTEI DE LA ETITC  BOGOTÁ","(2020) Propios $30.284.203\n(2020) SGR $832.479.819\n(2021) Propios $61.515.796\n(2021) SGR $166.328.487","CTEL",1090608306,998808306,91800000,44078,2020,"97 DE 2020","14/04/2021\t","OK","29/09/2021\t","29/09/2021\t","05/10/2021\t","OK","10/10/2021\t","TERMINADO",1,0.99209999999999998]
[185,"ENTIDAD APORTANTE RECURSOS","UNIVERSIDAD NACIONAL DE COLOMBIA",2020000100075,"APROVECHAMIENTO DE LA BIODIVERSIDAD EN AGRAZ Y PAPA PARA EL DESARROLLO DE CULTIVOS PROMISORIOS EN EL DEPARTAMENTO DE   SANTANDER","(2020) Propios $375.585.336\n(2020) SGR $1.043.676.000\n(2021) Propios $436.089.024\n(2021) SGR $595.574.000\n(2022) Propios $365.585.336\n(2022) SGR $340.749.999","CTEL",3177259696,2000000000,1177259696,44078,2020,"97 DE 2020","09/02/2021\t","OK","11/10/2021\t","11/06/2021\t","15/10/2021\t","OK","23/11/2021\t","CONTRATADO EN EJECUCIÓN",0.31950000000000001,0.42459999999999998]
[186,"ENTIDAD APORTANTE RECURSOS","UNIVERSIDAD NACIONAL DE COLOMBIA",2020000100019,"FORTALECIMIENTO DE CAPACIDADES DE INVESTIGACIÓN Y DESARROLLO TECNOLÓGICO DE LA UNIVERSIDAD COLEGIO MAYOR DE CUNDINAMARCA A PARTIR DE TECNOLOGÍAS INDUSTRIA 4.0 PARA EL DISEÑO Y CONSTRUCCIÓN EN   BOGOTÁ","(2020) Propios $59.497.954\n(2020) SGR $1.846.658.909\n(2021) Propios $88.073.259\n(2021) SGR $83.341.091","CTEL",2077571214,1930000000,147571214,44078,2020,"97 DE 2020","23/12/2020\t","OK","07/11/2021\t","03/05/2021\t","SIN DATO","OK","20/12/2021\t","PARA CIERRE",1,0.99390000000000001]
[187,"ENTIDAD APORTANTE RECURSOS","UNIVERSIDAD INDUSTRIAL DE SANTANDER",2020000100017,"FORTALECIMIENTO DE LA CAPACIDAD INSTITUCIONAL DE INVESTIGACIÓN DE LA UNIVERSIDAD INDUSTRIAL DESANTANDER  NACIONAL","(2020) Propios $554.920.000\n(2020) SGR $2.000.000.000\n(2021) Propios $253.600.000","CTEL",2808520000,2000000000,808520000,44078,2020,null,"22/09/2021\t","OK","08/12/2021\t","04/01/2021\t","09/12/2021\t","OK","09/12/2021\t","CONTRATADO EN EJECUCIÓN",0.37480000000000002,0.3886]
[188,"ENTIDAD APORTANTE RECURSOS","UNIVERSIDAD MILITAR NUEVA GRANADA",2020000100103,"FORTALECIMIENTO DE CAPACIDADES INSTALADAS DE CIENCIA Y TECNOLOGÍA DEL LABORATORIO DE DIAGNÓSTICO EN EL CAMPUS DE LA UNIV MILITAR NUEVA GRANADA, PARA ATENDER PROBLEMÁTICAS ASOCIADAS CON AGENTES BIOLÓGICOS DE ALTO RIESGO PARA LA SALUD HUMANA,  CUNDINAMARCA","(2020) Propios $858.326.524 \n(2020) SGR $3.827.151.962\n(2021) Propios $135.902.888\n(2021 SGR $241.361.603","CTEL",5715742977,4168513565,1547229412,43966,2020,"93 DE 2020","31/07/2020\t","OK","29/10/2020\t","24/06/2020\t","01/10/2021\t","OK","23/06/2021\t","CONTRATADO EN EJECUCIÓN",0.59179999999999999,0.76139999999999997]
[189,"ENTIDAD APORTANTE RECURSOS","INSTITUTO UNIVERSITARIO DE LA PAZ – UNIPAZ",2020000100042,"FORTALECIMIENTO DE LOS PROCESOS ACADÉMICOS EN LOS PROGRAMAS OFRECIDOS POR EL INSTITUTO UNIVERSITARIO DE LA PAZ, UNIPAZ,   BARRANCABERMEJA","(2020) Propios $182.640.000\n(2020) SGR $996.109.590","CTEL",1178749590,996109590,182640000,43998,2020,"94 DE 2020","14/09/2020\t","OK","13/11/2020\t","17/09/2020\t","01/12/2020\t","OK","01/12/2020\t","PARA CIERRE",1,0.98870000000000002]
[190,"ENTIDAD APORTANTE RECURSOS","INSTITUTO UNIVERSITARIO DE LA PAZ – UNIPAZ",2020000100016,"ADECUACIÓN , DOTACIÓN E IMPLEMENTACIÓN DE UN LABORATORIO DE FABRICACIÓN DIGITAL PARA PROMOVER EL DESARROLLO DE LA CIENCIA, LAINNOVACIÓN Y EL EMPRENDIMIENTO EN LA UNIVERSIDAD FRANCISCO DE PAULA SANTANDER.  CÚCUTA","(2020) Propios $548.684.167\n(2020) SGR $1.941.138.782\n(2021) Propios $425.529.720\n(2021) SGR $6.845.904","CTEL",2921057589.04,1946843702.04,974213887,43950,2020,"92 DE 2020","16/10/2020\t","OK","09/11/2020\t","05/06/2020\t","22/10/2020\t","OK","01/10/2021\t","CERRADO",1,0.99470000000000003]
[191,"ENTIDAD APORTANTE RECURSOS","UNIVERSIDAD TECNOLOGICA DE SANTANDER",2020000100004,"FORTALECIMIENTO Y ADECUACIÓN DE EQUIPOS E INFRAESTRUCTURA DEL LABORATORIO DE FÍSICA DEL DEPARTAMENTO DE CIENCIAS BÁSICAS, PARA EL MEJORAMIENTO DE LAS CAPACIDADES INSTITUCIONALES Y LA INVESTIGACIÓN EN LAS UNIDADES TECNOLÓGICAS DE SANTANDER -  BUCARAMANGA","(2020) Propios $10.207.602\n(2021) Propios $26.545.100\n(2021) SGR $980.000.000\n(2022) Propios $494.752.053","CTEL",1511504755,980000000,531504755,43950,2020,"92 DE 2020","25/01/2021\t","OK","14/04/2021\t","14/04/2021\t","16/12/2021\t","OK","16/12/2021\t","CONTRATADO EN EJECUCIÓN",0.1719,0.15579999999999999]
[192,"CUNDINAMARCA","SECRETARIA DE EDUCACIÓN",2020000050037,"DOTACIÓN DEL MOBILIARIO ESCOLAR PARA LAS INSTITUCIONES EDUCATIVAS DE LOS MUNICIPIOS NO CERTIFICADOS DEL DEPARTAMENTO DE CUNDINAMARCA","(2020) SGR $10.093.038.848","EDUCACIÓN",10093038848,10093038848,0,44195,2020,"110 DE 2020","16/06/2021\t","OK","18/06/2021\t","14/05/2021\t","12/07/2021\t","OK","12/07/2021\t","CERRADO",1,0.84530000000000005]
[193,"ENTIDAD APORTANTE RECURSOS","UNIVERSIDAD DEL NORTE",2020000100287,"FORMACIÓN DE CAPITAL HUMANO DE ALTO NIVEL UNIVERSIDAD DEL NORTE 2DO CORTE NACIONAL","(2021) Propios $19.833.871\n(2021) SGR $1.706.062.500\n(2022) Propios $20.230.548\n(2022) SGR $1.652.062.500\n(2023) Propios $20.635.159\n(2023) SGR $1.652.062.500\n(2024 Propios $21.047.862\n(2024) SGR $1.652.062.500\n(2025) Propios $21.468.820\n(2025) SGR $26.437.500\n(2026) Propios $21.898.196\n(2026) SGR $26.437.500\n(2027) Propios $22.336.160\n(2027) SGR $17.437.500\n(2028) Propios $22.782.883\n(2028) SGR $17.437.500","CTEL",6920233499,6750000000,{"$f":"H198-I198","v":170233499},44330,2021,"004 DE 2021","17/06/2021\t","OK","16/07/2021\t","15/06/2021\t","23/07/2021\t","OK","27/07/2021\t","CONTRATADO EN EJECUCIÓN",0.43,0.4919]
[194,"ENTIDAD APORTANTE RECURSOS","UNIVERSIDAD DEL VALLE",2020000100345,"FORMACIÓN DE CAPITAL HUMANO DE ALTO NIVEL SEGUNDO CORTE UNIVERSIDAD DEL VALLE NACIONAL","(2021) Propios $79.925.385\n(2021) SGR $2.121.195.763\n(2022) Propios $82.324.657\n(2022) SGR $1.427.983.891\n(2023) Propios $84.867.888\n(2023) SGR $1.213.310.202\n(2024) Propios $87.563.710\n(2024) SGR $558.716.932\n(2025) Propios $57.740.694\n(2025) SGR $4.687.500\n(2026) Propios $59.607.636\n(2026) SGR $4.687.500\n(2027) Propios $61.586.593\n(2027) SGR $3.437.500\n(2028) Propios $63.684.290\n(2028) SGR $1.750.000","CTEL",5913070114,5335769261,577300853,44348,2021,"05 DE 2021","28/06/2021\t","OK","27/07/2021\t","09/07/2021\t","19/08/2021\t","OK","03/08/2021\t","CONTRATADO EN EJECUCIÓN",0.49320000000000003,0.49299999999999999]
[195,"ENTIDAD APORTANTE RECURSOS","UNIVERSIDAD NACIONAL DE COLOMBIA",2021000100003,"FORMACIÓN DE CAPITAL HUMANO DE ALTO NIVEL UNIVERSIDAD  NACIONAL DE COLOMBIA CORTE II NACIONL","(2021) Propios $115.525.750\n(2021) SGR $4.285.546.875\n(2022) Propios $115.525.750\n(2022) SGR $4.285.546.875\n(2023) Propios $115.525.750\n(2023) SGR $4.285.546.875\n(2024) Propios $115.525.750\n(2024) SGR $4.285.546.875\n(2025) Propios $80.025.750\n(2025) SGR $123.437.500\n(2026) Propios $80.025.750\n(2026) SGR $123.437.500\n(2027) Propios $80.025.750\n(2027) SGR $123.437.500\n(2028) Propios $80.025.750\n(2028) SGR $123.437.500","CTEL",18418143500,17635937500,782206000,44330,2021,"04 DE 2021","30/07/2021\t","OK","09/08/2021\t","18/06/2021\t","30/08/2021\t","OK","30/11/2021\t","CONTRATADO EN EJECUCIÓN",0.48399999999999999,0.51600000000000001]
[196,"ENTIDAD APORTANTE RECURSOS","UNIVERSIDAD DE LA SABANA",2021000100004,"FORMACIÓN DE CAPITAL HUMANO DE ALTO NIVEL UNIVERSIDAD DE LA SABANA CORE 2 NACIONAL","(2021) Propios $42.202.083\n(2021) SGR $425.966.667\n(2022) Propios $42.202.083\n(2022) SGR $389.966.667\n(2023) Propios $42.202.083\n(2023) SGR $315.166.667\n(2024) Propios $39.368.750\n(2024) SGR $171.000.000\n(2025) Propios $11.093.750\n(2025) SGR $1.875.000\n(2026) Propios $11.093.750\n(2026) SGR $1.875.000\n(2027) Propios $11.093.750\n(2027) SGR $1.875.000\n(2028) Propios $11.093.750\n(2028) SGR $1.875.000","CTEL",1519950000,1309600000,210350000,44348,2021,"05 DE 2021","08/07/2021\t","OK","23/08/2021\t","24/06/2021\t","07/09/2021\t","OK","27/09/2021\t","CONTRATADO EN EJECUCIÓN",0.63009999999999999,0.83150000000000002]
[197,"ENTIDAD APORTANTE RECURSOS","UNIVERSIDAD ANTONIO NARIÑO",2021000100014,"FORMACIÓN DE CAPITAL HUMANO DE ALTO NIVEL UNIVERSIDAD ANTONIO NARIÑO CORE 2 NACIONAL","(2021) Propios $64.188.050\n(2021) SGR $1.035.937.500\n(2022) Propios $64.188.050\n(2022) SGR $1.035.937.500\n(2023) Propios $64.188.050\n(2023) SGR $1.035.937.500\n(2024) Propios $64.188.050\n(2024) SGR $1.035.937.500\n(2025) Propios $11.631.250\n(2025) SGR $26.562.500\n(2026) Propios $11.631.250\n(2026) SGR $26.562.500\n(2027) Propios $11.631.250\n(2027) SGR $26.562.500\n(2028) Propios $11.631.250\n(2028) SGR $26.562.500","CTEL",4526652200,4250000000,276652200,44348,2021,"06 DE 2021","12/07/2021\t","OK","08/09/2021\t","07/07/2021\t","29/09/2021\t","OK","29/09/2021\t","CONTRATADO EN EJECUCIÓN",0.37219999999999998,0.26700000000000002]
[198,"ENTIDAD APORTANTE RECURSOS","UNIVERSIDAD EAN",2021000100025,"FORMACIÓN DE CAPITAL HUMANO DE ALTO NIVEL UNIVERSIDAD EAN NACIONAL COHORTE II NACIONAL","(2021) Propios $36.813.302\n(2021) SGR $426.562.500\n(2022) Propios $36.813.302\n(2022) SGR $426.562.500\n(2023) Propios $36.813.302\n(2023) SGR $426.562.500\n(2024) Propios $36.813.302\n(2024) SGR $426.562.500\n(2025) Propios $36.813.302\n(2025) SGR $10.937.500\n(2026) Propios $36.813.302\n(2026) SGR $10.937.500\n(2027) Propios $36.813.302\n(2027) SGR $10.937.500\n(2028) Propios $36.813.302\n(2028) SGR $10.937.500","CTEL",2044506416,1750000000,294506416,44368,2021,"06 DE 2021","25/06/2021\t","OK","07/10/2021\t","01/07/2021\t","01/07/2021\t","OK","08/10/2021\t","CONTRATADO EN EJECUCIÓN",0.54700000000000004,0.46839999999999998]
[199,"ENTIDAD APORTANTE RECURSOS","UNIVERSIDAD MILITAR NUEVA GRANADA",2021000100026,"FORMACIÓN DE CAPITAL HUMANO DE ALTO NIVEL UNIVERSIDAD MILITAR NUEVA GRANADA SEGUNDO CORTE NACIONAL","(2021) Propios $16.098.779\n(2021) SGR $204.097.500\n(2022) Propios $16.098.779\n(2022) SGR $200.703.900\n(2023) Propios $16.098.779\n(2023) SGR $191.414.556\n(2024) Propios $16.098.779\n(2024) SGR $50.636.348\n(2025) Propios $9.158.764\n(2025) SGR $937.500\n(2026) Propios $9.158.764\n(2026) SGR $937.500\n(2027) Propios $9.158.764\n(2027) SGR $937.500\n(2028) Propios $9.158.764\n(2028) SGR $937.500","CTEL",751632481,650602304,101030177,44348,2021,"05 DE 2021","16/07/2021\t","OK","20/10/2021\t","14/07/2021\t","22/11/2021\t","OK","22/12/2021\t","CONTRATADO EN EJECUCIÓN",0.49759999999999999,0.42959999999999998]
[200,"ENTIDAD APORTANTE RECURSOS","PONIFICA UNIVERSIDAD JAVERIANA",2021000100027,"FORMACIÓN DE CAPITAL HUMANO DE ALTO NIVEL PONTIFICIA UNIVERSIDAD JAVERIANA SEDE BOGOTÁ CORTE II NACIONAL","(2021) Propios $280.909.761\n(2021) SGR $1.674.703.125\n(2022) Propios $323.472.187\n(2022) SGR $1.674.703.125\n(2023) Propios $369.892.005\n(2023) SGR $2.034.703.125\n(2024) Propios $345.478.822\n(2024) SGR $1.674.703.125\n(2025) Propios $5.385.284\n(2025) SGR $46.875.000\n(2026) Propios $2.013.734\n(2026) SGR $46.875.000\n(2027) Propios $2.013.734\n(2027) SGR $46.875.000\n(2028) Propios $2.013.734\n(2028) SGR $46.875.000","CTEL",8577491761,7246312500,1331179261,44348,2021,"05 DE 2021","12/10/2021\t","OK","11/10/2021\t","21/06/2021\t","SIN DATO","OK","30/07/2021\t","CONTRATADO EN EJECUCIÓN",0.49580000000000002,0.46579999999999999]
[201,"ENTIDAD APORTANTE RECURSOS","UNIVERSIDAD DE CALDAS",2021000100028,"FORMACIÓN DE CAPITAL HUMANO DE ALTO NIVEL CORTE 2 UNIVERSIDAD DE CALDAS - NACIONAL","(2021) Propios $44.750.000\n(2021) SGR $1.600.500.000\n(2022) Propios $44.750.000\n(2022) SGR $1.360.500.000\n(2023) Propios $44.750.000\n(2023) SGR $1.360.500.000\n(2024) Propios $44.750.000\n(2024) SGR $1.648.500.000\n(2025) Propios $44.750.000\n(2025) SGR $7.500.000\n(2026) Propios $44.750.000\n(2026) SGR $7.500.000\n(2027) Propios $44.750.000\n(2027) SGR $7.500.000\n(2028) Propios $44.750.000\n(2028) SGR $7.500.000","CTEL",6358000000,6000000000,358000000,44348,2021,"05 DE 2021","25/08/2021\t","OK","05/10/2021\t","01/06/2021\t","08/10/2021\t","OK","08/10/2021\t","CONTRATADO EN EJECUCIÓN",0.57850000000000001,0.56910000000000005]
[202,"CUNDINAMARCA","SECRETARIA DE EDUCACIÓN",2021004250258,"FORTALECIMIENTO A LA ESTRATEGIA DE ALIMENTACIÓN ESCOLAR PARA EL AÑO 2021 EN LOS MUNICIPIOS DEL DEPARTAMENTO DE CUNDINAMARCA","(2021) SGR $16.289.941.201","EDUCACIÓN",16289941201,16289941201,0,44432,2021,"248 DE 2021","10/09/2021\t","OK","13/09/2021\t","24/08/2021\t","22/10/2021\t","OK","22/10/2021\t","CERRADO",1,0.66559999999999997]
[203,"CUNDINAMARCA","SECRETARIA DE HABITAT Y VIVIENDA",2018000050050,"MEJORAMIENTO VIVIENDA RURAL MEDIANTE CONSTRUCCIÓN DE COCINAS HABITACIONES Y PISOS EN LOS MUNICIPIOS DE CUNDINAMARCA","(2021) SGR $5.616.585.201","AGRICULTURA ",5616585397,5616585397,{"$f":"H208-I208","v":0},44525,2021,"03 DE 2021","25/05/2022\t","OK","15/03/2022\t","25/11/2021\t","14/08/2022\t","OK","11/08/2022\t","CONTRATADO EN EJECUCIÓN",0.3483,4.4999999999999997E-3]
[204,"CUNDINAMARCA","SECRETARIA DE COMPETITIVIDAD",2020000050035,"FORTALECIMIENTO DE LOS SISTEMAS PRODUCTIVOS A TRAVÉS DE LA REACTIVACIÓN DEL SECTOR AGRÍCOLA EN EL DEPARTAMENTO DE CUNDINAMARCA","(2022) SGR $9.997.098.068","AGRICULTURA ",9997098068,9997098068,0,44529,2021,"454 DE 2021","11/06/2022\t","OK","01/06/2022\t","11/06/2022\t",44529,"OK",44917,"CONTRATADO EN EJECUCIÓN",0,0]
["205","CUNDINAMARCA","SECRETARIA DE MINAS, ENERGIA Y GAS",2021004250686,"CONSTRUCCIÓN DEL CENTRO DE FORMACIÓN E INNOVACIÓN MINERO ENERGÉTICO DE CUNDINAMARCA","(2021) Propios $165.024.468\n(2021) SGR $5.550.353.790\n(2022) Propios $6.676.901.810\n(2022) SGR $1.378.613.312","GOBIERNO TERRITORIAL","$ 13.770.893.382,00","$ 6.928.967.103,00",6841926279,44561,"2021","546 DE 2021","28/06/2022\t","OK","08/06/2022\t","04/08/2022\t","31/12/2021\t","OK","17/02/2022\t","CONTRATADO EN EJECUCIÓN",8.1900000000000001E-2,1.4500000000000001E-2]
[206,"CUNDINAMARCA","UNIDAD ADMINISTRATIVA DE GESTIÓN DEL RIESGO.",2021004250690,"FORTALECIMIENTO DEL SISTEMA AUTOMOTOR PARA LA GESTIÓN DEL RIESGO DE DESASTRES DEL DEPARTAMENTO DE CUNDINAMARCA","(2021) SGR $7.299.514.100","GOBIERNO TERRITORIAL",7299514100,7299514100,0,44547,2021,"496 DE 2021","15/06/2022\t","OK","22/05/2022\t",44994,44650,"OK","31/07/2022\t","PARA CIERRE",1,0.93810000000000004]
[207,"CUNDINAMARCA","SECRETARIA DE COMPETITIVIDAD",2020000050038,"OPTIMIZACIÓN DE LOS SISTEMAS GANADEROS BOVINOS DE CARNE LECHE Y DOBLE PROPÓSITO A PARTIR DE LA IMPLEMENTACIÓN DE MEJORAMIENTO GENÉTICO PRODUCTIVO Y ENTREGA DE MAQUINARIA Y EQUIPOS EN MUNICIPIOS DEL DEPARTAMENTO DE CUNDINAMARCA","(2022) AIR 60%SGR $4.073.462.784","AGRICULTURA ",9732446243,9732446243,0,44561,2021,"DECRETO No 547 DE 2021","01/07/2022\t","OK",45000,44999,44699,"OK",44958,"CONTRATADO EN EJECUCIÓN",2.0000000000000001E-4,0]
[208,"CUNDINAMARCA","SECRETARIA DE CIENCIA, TECNOLOGIA E INNOVACIÓN",2021000100327,"DESARROLLO DE UN SISTEMA DE PRODUCCIÓN LECHERO PARA LA OBTENCIÓN DE LECHES INOCUAS DE ALTA CALIDAD Y CON UN PERFIL LIPÍDICO SALUDABLE EN EL DEPARTAMENTO DE CUNDINAMARCA","Asignación Ciencia, Tecnología e Innovación","CTEL",3833042862,3044082702,788960160,44617,2022,"15 DE 2022","19/08/2022\t","OK",44771,45001,44774,"OK",44928,"CONTRATADO EN EJECUCIÓN",0.10979999999999999,0.24879999999999999]
[209,"CUNDINAMARCA","SECRETARIA DE CIENCIA, TECNOLOGIA E INNOVACIÓN",2021000100208,"FORTALECIMIENTO DE LOS NIVELES DE APROPIACIÓN SOCIAL DEL CONOCIMIENTO DE LA CTEI EN COMUNIDADES DE LAS PROVINCIAS DE ALMEIDAS Y UBATÉ DEL DEPARTAMENTO DE CUNDINAMARCA","Asignación Ciencia, Tecnología e Innovación","CTEL",2191964751,1839764876,352199875,44615,2022,"15 DE 2021","21/07/2022\t","OK",45000,"\t16/03/2023",44774,"OK",44847,"CONTRATADO EN EJECUCIÓN",0.94569999999999999,0.78510000000000002]
[210,"CUNDINAMARCA","SECRETARIA DE CIENCIA, TECNOLOGIA E INNOVACIÓN",2021000100243,"DESARROLLO PARTICIPATIVO DE UNA PLATAFORMA TECNOLÓGICA DE TELEDETECCIÓN PARA LA GESTIÓN SOSTENIBLE DE SUELOS EN AGROECOSISTEMAS DEL DEPARTAMENTO DE CUNDINAMARCA","Asignación Ciencia, Tecnología e Innovación","CTEL",3042693625,2332094728,710598897,44617,2022,"15 DE 2021","21/07/2022\t","OK","07/08/2022\t",45002,44774,"OK","13/10/2022\t","CONTRATADO EN EJECUCIÓN",0.29170000000000001,0.31119999999999998]
[211,"CUNDINAMARCA","SECRETARIA DE MINAS, ENERGIA Y GAS",2021000050019,"AMPLIACIÓN DE LA COBERTURA DEL SERVICIO DE GAS COMBUTIBLE POR REDES A TRAVES DE LA FINANCIACIÓN DEL CARGO POR CONEXIÓN Y LA RED INTERNA PARA USUARIOS DE BARRIOS PERIFÉRICOS VEREDAS Y CENTROS POBLADOS DE LOS MUNICIPIOS DE CUNDINAMARCA","(2022) Propios $2.263.800.000\n(2022 )AIR 40%  SGR $3.012.167.004\n(2023) Propios $2.290.400.000\n(2023)AIR 40%  SGR $3.047.560.432","MINAS Y ENERGÍA",10613927436,6059727436,4554200000,44700,2022,"ACUERDO 07 DE 2022","19/08/2022\t","OK",45000,44784,"SIN DATO","OK",44799,"CONTRATADO EN EJECUCIÓN",0.2341,0.21110000000000001]
[212,"CUNDINAMARCA","SECRETARIA DE EDUCACIÓN",2022000050007,"FORTALECIMIENTO A LA ESTRATEGIA DE ALIMENTACIÓN ESCOLAR EN LOS MUNICIPIOS NO CERTIFICADOS DEL DEPARTAMENTO DE CUNDINAMARCA PARA LA VIGENCIA 2022 CUNDINAMARCA\t","(2022)  AIR 40% SGR $42.966.037.310","EDUCACIÓN",42966037310,42966037310,0,44700,2022,"ACUERDO No 07 de 2022","10/09/2021\t","OK","13/09/2021\t","24/08/2021\t","22/10/2021\t","OK","22/10/2021\t","TERMINADO",1,0.73550000000000004]
[213,"CUNDINAMARCA","SECRETARIA DE CIENCIA, TECNOLOGIA E INNOVACIÓN",2021000100467,"FORTALECIMIENTO DE LAS CAPACIDADES INSTITUCIONALES PARA EL DESARROLLO Y GESTIÓN DEL ECOSISTEMA TERRITORIAL DE CTEI EN TODAS LAS PROVINCIAS DEL DEPARTAMENTO DE CUNDINAMARCA\n","Asignación Ciencia, Tecnología e Innovación","CTEL",2801037429,2299692877,501344552,44664,2022,"18 DE 2022",44776,"OK",44904,44999,"SIN DATO","OK","29/12/2022\t","CONTRATADO EN EJECUCIÓN",0.46339999999999998,3.8699999999999998E-2]
[214,"CUNDINAMARCA","SECRETARIA DE CIENCIA, TECNOLOGIA E INNOVACIÓN",2021000100276,"DESARROLLO DE UN MODELO DE PROMOCIÓN TURÍSTICA SOSTENIBLE DESDE LA TECNOLOGÍA 4.0 EN LOS MUNICIPIOS DE LA PALMA Y YACOPI EN EL DEPARTAMENTO DE CUNDINAMARCA\n","Asignación Ciencia, Tecnología e Innovación","CTEL",2608055295,2401327735,206727560,44637,2022,"16 DE 2022",44776,"OK",44636,44756,44865,"OK",44887,"CONTRATADO EN EJECUCIÓN",0.42759999999999998,0.28820000000000001]
[215,"CUNDINAMARCA","SECRETARIA DE CIENCIA, TECNOLOGIA E INNOVACIÓN",2021000100523,"DESARROLLO DE MICROREDES Y ALMACENAMIENTO (ESS) PRESTADORES DE SERVICIOS COMPLEMENTARIOS PARA INCREMENTAR LA COBERTURA EFICIENCIA Y CONFIABILIDAD DEL SERVICIO EN EL DEPARTAMENTO DE CUNDINAMARCA\n","Asignación Ciencia, Tecnología e Innovación","CTEL",3942973233,3296088001,646885232,44685,2022,"20 DE 2022",44776,"OK",44839,44685,44925,"OK",44911,"CONTRATADO EN EJECUCIÓN",9.2999999999999999E-2,3.9800000000000002E-2]
[216,"CUNDINAMARCA","SECRETARIA DE EDUCACIÓN",2022004250011,"FORTALECIMIENTO A LA ESTRATEGIA DE SUBSIDIO DE TRANSPORTE ESCOLAR EN MUNICIPIOS NO CERTIFICADOS DEL DEPARTAMENTO DE CUNDINAMARCA PARA LA VIGENCIA 2022 CUNDINAMARCA","(2022)AIR 60%  SGR $24.666.685.502","EDUCACIÓN",24666685502,24666685502,{"$f":"H221-I221","v":0},44722,2022,"DECRETO No 184 DE 2022",44764,"OK",44999,44741,"SIN DATO","OK",44760,"CONTRATADO EN EJECUCIÓN",0.96140000000000003,0.99009999999999998]
[217,"ENTIDAD APORTANTE RECURSOS","EMTEL",2022004250006,"IMPLEMENTACIÓN DE UNA ESTRATEGIA DE REACTIVACIÓN ECONÓMICA PARA EL PROGRESO Y LA COMPETITIVIDAD DE MICRONEGOCIOS Y UNIDADES PRODUCTIVAS EN EL DEPARTAMENTO DE CUNDINAMARCA","(2022) SGR $16.921.563.805","COMERCIO, INDUSTRIA Y TURISMO",16921563805,16921563805,0,44707,2022,"DECRETO 150 2022",44733,"OK",44740,44719,"SIN DATO","OK",44796,"CONTRATADO EN EJECUCIÓN",0.6956,0.79169999999999996]
[218,"CUNDINAMARCA","SECRETARIA DE AMBIENTE",2022004250025,"FORTALECIMIENTO DE LA PRODUCCIÓN DE MATERIAL VEGETAL ARBUSTIVO Y ARBÓREO PARA LA RECUPERACIÓN DE LA COBERTURA ARBÓREA EN EL DEPARTAMENTO DE CUNDINAMARCA","(2022) AIR 60% SGR $2.857.824.455 - APORTES EN ESPECIE (AGROSAVIA) 530.142.470","AMBIENTE Y DESARROLLO SOSTENIBLE",3387966925,2857824455,{"$f":"H223-I223","v":530142470},44907,2022,"DECRETO No 474 DE 2022","SIN DATO","OK",45033,44994,45034,"OK",45057,"CONTRATADO EN EJECUCIÓN",6.4999999999999997E-3,0]
[219,"DESENTRALIZADOS","ICCU - GESPROY GB",2022004250032,"MEJORAMIENTO DE LA VÍA QUE COMUNICA A LOS MUNICIPIOS DE SAN CAYETANO Y COGUA TRAMO VEREDA CARDONAL VEREDA MORTIÑO DEL MUNICIPIO DE SAN CAYETANO DEPARTAMENTO DE CUNDINAMARCA","(2022) AIR 60% SGR ","TRANSPORTE",9976205175,9976205175,0,44909,2022,"DECRETO No 474 DE 2022","SIN DATO","OK",45014,45014,"SIN DATO",45014,"SIN DATO","CONTRATADO EN EJECUCIÓN",7.3800000000000004E-2,0]
[220,"CUNDINAMARCA","UNIDAD ADMINISTRATIVA DE GESTIÓN DEL RIESGO.",2022004250031,"CONSTRUCCIÓN DE OBRAS PARA MITIGAR LOS RIESGOS QUE SE PRESENTAN EN LA ZONAS ALEDAÑAS A LA URBANIZACIÓN SASIPA DEL MUNICIPIO DE SILVANIA CUNDINAMARCA","AIR 60% - AIR 60% GESTIÓN DEL RIESGO Y ADAPTACIÓN AL CAMBIO CLIMÁTICO","GOBIERNO TERRITORIAL",3673954111,3673954111,0,44922,2022,"DECRETO No 513 DE 2022","SIN DATO","OK",45061,44994,"SIN DATO","OK","SIN DATO","SIN CONTRATAR",0,0]
[221,"ENTIDAD APORTANTE RECURSOS","UNIDAD ADMINISTRATIVA DE GESTIÓN DEL RIESGO.",2022004250036,"CONSTRUCCIÓN DE OBRAS DE MITIGACIÓN Y ESTABILIZACIÓN EN CENTRO POBLADO DE CUATRO CAMINOS DEL MUNICIPIO DE PAIME DEPARTAMENTO DE CUNDINAMARCA","AIR 60% - AIR 60% GESTIÓN DEL RIESGO Y ADAPTACIÓN AL CAMBIO CLIMÁTICO","GOBIERNO TERRITORIAL",3745004883.4099998,3745004883.4099998,0,44922,2022,"DECRETO No 513 DE 2022",45030,"OK",45015,45014,"SIN DATO","OK",45061,"CONTRATADO SIN ACTA DE INICIO",0,0.45550000000000002]
[222,"ENTIDAD APORTANTE RECURSOS","FUNDACION UNIVERSIDAD DEL VALLE",2022004250028,"FORTALECIMIENTO EMPRESARIAL PARA EL PROGRESO Y LA COMPETITIVIDAD DE LOS MICRONEGOCIOS Y UNIDADES PRODUCTIVAS EN EL DEPARTAMENTO DE CUNDINAMARCA","(2022) AIR 60% SGR ","COMERCIO, INDUSTRIA Y TURISMO ",16598832013,16598832013,0,44923,2022," DECRETO No 517 DE 2022",44963,"OK",44963,44925,44977,"OK",44963,"CONTRATADO EN EJECUCIÓN",0.27539999999999998,0.39800000000000002]
[223,"CUNDINAMARCA","SECRETARIA DE AMBIENTE",20223201010038,"IMPLEMENTACION DE UN PROCESO DE RESTAURACIÓN ECOLÓGICA COMO MEDIDA DE CONSERVACIÓN DE ÁREAS AMBIENTALES ESTRATÉGICAS EN LA PROVINCIA DE GUALIVA CUNDINAMARCA"," Convocatoria","AMBIENTE Y DESARROLLO SOSTENIBLE",2238923844," $ 2.238.923.844 ",0,"20/01/2023",2023,"DE 2023","SIN DATO","OK","SIN DATO","SIN DATO",45021,"SIN DATO","SIN DATO","SIN CONTRATAR",0,0]
[224,"CUNDINAMARCA","SECRETARIA DE EDUCACIÓN",2023000050006,"FORTALECIMIENTO A LA ESTRATEGIA DE ALIMENTACIÓN ESCOLAR EN LOS MUNICIPIOS NO CERTIFICADOS PARA LA VIGENCIA 2023 DEL DEPARTAMENTO DE CUNDINAMARCA","AIR 40%","EDUCACIÓN",73467216989,73467216989,0,45063,2023,"12 DE 2023","SIN DATO","OK","SIN DATO",45063,"SIN DATO","SIN DATO","SIN DATO","CONTRATADO EN EJECUCIÓN",0.49990000000000001,7.4999999999999997E-3]
[225,"CUNDINAMARCA","SECRETARIA DE EDUCACIÓN",2023004250024,"FORTALECIMIENTO A LA ESTRATEGIA DE SUBSIDIO DE TRANSPORTE ESCOLAR PARA LA VIGENCIA 2023 EN MUNICIPIOS NO CERTIFICADOS DEL DEPARTAMENTO DE  CUNDINAMARCA","AIR 60%","EDUCACIÓN",26541498067,26541498067,0,45098,2023," DE 2023","SIN DATO","OK","SIN DATO","SIN DATO","SIN DATO","SIN DATO","SIN DATO","CONTRATADO EN EJECUCIÓN",0.49609999999999999,1E-3]
[null,null,null,null,null,null,null,null,null,null,null,{"$f":"RIGHT(Tabla2[[#This Row],[FECHA DE APROBACIÓN OCAD]],4)","v":""}]
[null,null,null,null,null,null,null,null,null,null,null,{"$f":"RIGHT(Tabla2[[#This Row],[FECHA DE APROBACIÓN OCAD]],4)","v":""}]
[null,null,null,null,null,null,null,null,null,null,null,{"$f":"RIGHT(Tabla2[[#This Row],[FECHA DE APROBACIÓN OCAD]],4)","v":""}]
[null,null,null,null,null,null,null,null,null,null,null,{"$f":"RIGHT(Tabla2[[#This Row],[FECHA DE APROBACIÓN OCAD]],4)","v":""}]
[]
[]
[null,null,null,null,null,null,null,null,null,{"$f":"H237-I237","v":0},null,{"$f":"RIGHT(Tabla2[[#This Row],[FECHA DE APROBACIÓN OCAD]],4)","v":""}]
[null,null,null,null,null,null,null,null,null,0,null,{"$f":"RIGHT(Tabla2[[#This Row],[FECHA DE APROBACIÓN OCAD]],4)","v":""}]
[null,null,null,null,null,null,null,null,null,0,null,{"$f":"RIGHT(Tabla2[[#This Row],[FECHA DE APROBACIÓN OCAD]],4)","v":""}]